{"text_format":"1","workbook":"xlsx","n_sheets":19,"sheets":["Roteiro","Estrutura do Projeto","Plano de Aplicação","Pessoas","Passagens","Compras","Cronograma","Resumo DOA","Memória de Cálculo","Complexidade","Riscos","DOA 2018","Sumário","Parametrização","MateriaisEServiços","Custo CLT","Custo RPA","INSSIR","Diárias"],"not_rendered":{"charts":0,"images":3,"macros":1,"external_links":1,"defined_names":113,"comments":2,"pivot_tables":0},"unopened":[],"bounds":{"document_bytes":16777216,"sheet_cells":100000,"rows_first":2000,"rows_last":500,"rows_between":2000,"halvings":0,"cell_chars":16384,"cell_head_chars":4096},"cells_cut":0,"cells_raw":0,"read":"whole","date_system":"1900"}

{"sheet":"Roteiro","index":0,"n_rows":52,"n_cols":1,"rows_kept":52,"cut":false,"hidden":false,"merged":[[0,0,0,3]]}
["Roteiro de utilização da planilha"]
[]
[]
[]
[]
[]
[]
[]
[]
[]
[]
[]
[]
[]
[]
[]
[]
[]
[]
[]
[]
[]
[]
[]
[]
[]
[]
[]
[]
[]
[]
[]
[]
[]
[]
[]
[]
[]
[]
[]
[]
[]
[]
[]
[]
[]
[]
[]
[]
[]
["PARA ACESSAR A ÍNTEGRA DO TUTORIAL DA FERRAMENTA PLANEJAMENTO DO PROJETO,"]
["Clique aqui."]

{"sheet":"Estrutura do Projeto","index":1,"n_rows":11,"n_cols":6,"rows_kept":11,"cut":false,"hidden":false,"merged":[[0,0,0,1],[1,0,1,1],[3,0,3,1],[4,0,4,1],[3,2,3,3],[0,2,0,5],[2,4,2,5],[3,4,3,5]]}
["NOME DO PROJETO:",null,"Preencha com o nome do projeto"]
["VIGÊNCIA (MESES):",null,1]
["VALOR DO PROJETO:",null,0,null,"VALOR DO PROJETO:"]
["NÚMERO DO PROCESSO:",null,"Preencha com o número do processo",null,{"$f":"IF(F5=FALSE,C3,(TotalDiarias+TotalEquipamentos+TotalMaterialDeConsumo+TotalPassagens+TotalPessoaFisica+TotalPessoaJuridica-ValorDOA)/(1-ISSQN)*-1)","v":12055.367346938776}]
["QTD. DE METAS:",null,1,null,null,"Falso"]
[]
[null,null,"Meta","Descrição da Meta","Qtd. Atividades"]
[null,null,1,null,1]
[]
["Meta","Atividade","Código","Descrição da Atividade"]
[1,1,"1.1"]

{"sheet":"Plano de Aplicação","index":2,"n_rows":108,"n_cols":40,"rows_kept":108,"cut":false,"hidden":false,"merged":[[105,1,105,2],[106,1,106,2],[107,1,107,2],[96,0,107,0],[100,1,100,2],[101,1,101,2],[102,1,102,2],[103,1,103,2],[104,1,104,2],[67,0,95,0],[96,1,96,2],[97,1,97,2],[98,1,98,2],[99,1,99,2],[67,1,73,1],[74,1,80,1],[81,1,87,1],[88,1,94,1],[95,1,95,2],[66,1,66,2],[52,1,58,1],[59,1,65,1],[52,0,66,0],[21,1,27,1],[28,1,28,2],[7,0,28,0],[29,1,35,1],[36,1,36,2],[29,0,36,0],[37,1,43,1],[37,0,51,0],[44,1,50,1],[51,1,51,2],[7,1,13,1],[14,1,20,1]]}
[null,null,null,null,null,"NOME DO PROJETO: Desenvolvimento de vacina zika (atenuada, recombinante)"]
[null,null,null,null,null,"VIGÊNCIA (MESES): 36"]
[null,null,null,null,null,"NÚMERO DO PROCESSO: Preencha com o número do processo"]
[]
[]
["PLANILHA DE CUSTOS - PLANO DE APLICAÇÃO"]
["META","ATIVIDADE","RUBRICA","1º MÊS","2º MÊS","3º MÊS","4º MÊS","5º MÊS","6º MÊS","7º MÊS","8º MÊS","9º MÊS","10º MÊS","11º MÊS","12º MÊS","13º MÊS","14º MÊS","15º MÊS","16º MÊS","17º MÊS","18º MÊS","19º MÊS","20º MÊS","21º MÊS","22º MÊS","23º MÊS","24º MÊS","25º MÊS","26º MÊS","27º MÊS","28º MÊS","29º MÊS","30º MÊS","31º MÊS","32º MÊS","33º MÊS","34º MÊS","35º MÊS","36º MÊS","TOTAIS"]
["Meta 1 - Estabelecimento de condições de produção e controle de qualidade da vacina","1.1 - Estabelecer metodologias de produção em escala de bancada","Pessoa Física",{"$f":"SUMIFS(TbPessoas[Custo Total Mensal],TbPessoas[A partir do mês],\"<=\" & 1,TbPessoas[Até],\">=\"& 1,TbPessoas[Meta:Atividade],LEFT(B8,FIND(\" \",B8,1)-1))","v":0},{"$f":"SUMIFS(TbPessoas[Custo Total Mensal],TbPessoas[A partir do mês],\"<=\" & 2,TbPessoas[Até],\">=\"& 2,TbPessoas[Meta:Atividade],LEFT(B8,FIND(\" \",B8,1)-1))","v":0},{"$f":"SUMIFS(TbPessoas[Custo Total Mensal],TbPessoas[A partir do mês],\"<=\" & 3,TbPessoas[Até],\">=\"& 3,TbPessoas[Meta:Atividade],LEFT(B8,FIND(\" \",B8,1)-1))","v":0},{"$f":"SUMIFS(TbPessoas[Custo Total Mensal],TbPessoas[A partir do mês],\"<=\" & 4,TbPessoas[Até],\">=\"& 4,TbPessoas[Meta:Atividade],LEFT(B8,FIND(\" \",B8,1)-1))","v":0},{"$f":"SUMIFS(TbPessoas[Custo Total Mensal],TbPessoas[A partir do mês],\"<=\" & 5,TbPessoas[Até],\">=\"& 5,TbPessoas[Meta:Atividade],LEFT(B8,FIND(\" \",B8,1)-1))","v":0},{"$f":"SUMIFS(TbPessoas[Custo Total Mensal],TbPessoas[A partir do mês],\"<=\" & 6,TbPessoas[Até],\">=\"& 6,TbPessoas[Meta:Atividade],LEFT(B8,FIND(\" \",B8,1)-1))","v":0},{"$f":"SUMIFS(TbPessoas[Custo Total Mensal],TbPessoas[A partir do mês],\"<=\" & 7,TbPessoas[Até],\">=\"& 7,TbPessoas[Meta:Atividade],LEFT(B8,FIND(\" \",B8,1)-1))","v":0},{"$f":"SUMIFS(TbPessoas[Custo Total Mensal],TbPessoas[A partir do mês],\"<=\" & 8,TbPessoas[Até],\">=\"& 8,TbPessoas[Meta:Atividade],LEFT(B8,FIND(\" \",B8,1)-1))","v":0},{"$f":"SUMIFS(TbPessoas[Custo Total Mensal],TbPessoas[A partir do mês],\"<=\" & 9,TbPessoas[Até],\">=\"& 9,TbPessoas[Meta:Atividade],LEFT(B8,FIND(\" \",B8,1)-1))","v":0},{"$f":"SUMIFS(TbPessoas[Custo Total Mensal],TbPessoas[A partir do mês],\"<=\" & 10,TbPessoas[Até],\">=\"& 10,TbPessoas[Meta:Atividade],LEFT(B8,FIND(\" \",B8,1)-1))","v":0},{"$f":"SUMIFS(TbPessoas[Custo Total Mensal],TbPessoas[A partir do mês],\"<=\" & 11,TbPessoas[Até],\">=\"& 11,TbPessoas[Meta:Atividade],LEFT(B8,FIND(\" \",B8,1)-1))","v":0},{"$f":"SUMIFS(TbPessoas[Custo Total Mensal],TbPessoas[A partir do mês],\"<=\" & 12,TbPessoas[Até],\">=\"& 12,TbPessoas[Meta:Atividade],LEFT(B8,FIND(\" \",B8,1)-1))","v":0},{"$f":"SUMIFS(TbPessoas[Custo Total Mensal],TbPessoas[A partir do mês],\"<=\" & 13,TbPessoas[Até],\">=\"& 13,TbPessoas[Meta:Atividade],LEFT(B8,FIND(\" \",B8,1)-1))","v":0},{"$f":"SUMIFS(TbPessoas[Custo Total Mensal],TbPessoas[A partir do mês],\"<=\" & 14,TbPessoas[Até],\">=\"& 14,TbPessoas[Meta:Atividade],LEFT(B8,FIND(\" \",B8,1)-1))","v":0},{"$f":"SUMIFS(TbPessoas[Custo Total Mensal],TbPessoas[A partir do mês],\"<=\" & 15,TbPessoas[Até],\">=\"& 15,TbPessoas[Meta:Atividade],LEFT(B8,FIND(\" \",B8,1)-1))","v":0},{"$f":"SUMIFS(TbPessoas[Custo Total Mensal],TbPessoas[A partir do mês],\"<=\" & 16,TbPessoas[Até],\">=\"& 16,TbPessoas[Meta:Atividade],LEFT(B8,FIND(\" \",B8,1)-1))","v":0},{"$f":"SUMIFS(TbPessoas[Custo Total Mensal],TbPessoas[A partir do mês],\"<=\" & 17,TbPessoas[Até],\">=\"& 17,TbPessoas[Meta:Atividade],LEFT(B8,FIND(\" \",B8,1)-1))","v":0},{"$f":"SUMIFS(TbPessoas[Custo Total Mensal],TbPessoas[A partir do mês],\"<=\" & 18,TbPessoas[Até],\">=\"& 18,TbPessoas[Meta:Atividade],LEFT(B8,FIND(\" \",B8,1)-1))","v":0},{"$f":"SUMIFS(TbPessoas[Custo Total Mensal],TbPessoas[A partir do mês],\"<=\" & 19,TbPessoas[Até],\">=\"& 19,TbPessoas[Meta:Atividade],LEFT(B8,FIND(\" \",B8,1)-1))","v":0},{"$f":"SUMIFS(TbPessoas[Custo Total Mensal],TbPessoas[A partir do mês],\"<=\" & 20,TbPessoas[Até],\">=\"& 20,TbPessoas[Meta:Atividade],LEFT(B8,FIND(\" \",B8,1)-1))","v":0},{"$f":"SUMIFS(TbPessoas[Custo Total Mensal],TbPessoas[A partir do mês],\"<=\" & 21,TbPessoas[Até],\">=\"& 21,TbPessoas[Meta:Atividade],LEFT(B8,FIND(\" \",B8,1)-1))","v":0},{"$f":"SUMIFS(TbPessoas[Custo Total Mensal],TbPessoas[A partir do mês],\"<=\" & 22,TbPessoas[Até],\">=\"& 22,TbPessoas[Meta:Atividade],LEFT(B8,FIND(\" \",B8,1)-1))","v":0},{"$f":"SUMIFS(TbPessoas[Custo Total Mensal],TbPessoas[A partir do mês],\"<=\" & 23,TbPessoas[Até],\">=\"& 23,TbPessoas[Meta:Atividade],LEFT(B8,FIND(\" \",B8,1)-1))","v":0},{"$f":"SUMIFS(TbPessoas[Custo Total Mensal],TbPessoas[A partir do mês],\"<=\" & 24,TbPessoas[Até],\">=\"& 24,TbPessoas[Meta:Atividade],LEFT(B8,FIND(\" \",B8,1)-1))","v":0},{"$f":"SUMIFS(TbPessoas[Custo Total Mensal],TbPessoas[A partir do mês],\"<=\" & 25,TbPessoas[Até],\">=\"& 25,TbPessoas[Meta:Atividade],LEFT(B8,FIND(\" \",B8,1)-1))","v":0},{"$f":"SUMIFS(TbPessoas[Custo Total Mensal],TbPessoas[A partir do mês],\"<=\" & 26,TbPessoas[Até],\">=\"& 26,TbPessoas[Meta:Atividade],LEFT(B8,FIND(\" \",B8,1)-1))","v":0},{"$f":"SUMIFS(TbPessoas[Custo Total Mensal],TbPessoas[A partir do mês],\"<=\" & 27,TbPessoas[Até],\">=\"& 27,TbPessoas[Meta:Atividade],LEFT(B8,FIND(\" \",B8,1)-1))","v":0},{"$f":"SUMIFS(TbPessoas[Custo Total Mensal],TbPessoas[A partir do mês],\"<=\" & 28,TbPessoas[Até],\">=\"& 28,TbPessoas[Meta:Atividade],LEFT(B8,FIND(\" \",B8,1)-1))","v":0},{"$f":"SUMIFS(TbPessoas[Custo Total Mensal],TbPessoas[A partir do mês],\"<=\" & 29,TbPessoas[Até],\">=\"& 29,TbPessoas[Meta:Atividade],LEFT(B8,FIND(\" \",B8,1)-1))","v":0},{"$f":"SUMIFS(TbPessoas[Custo Total Mensal],TbPessoas[A partir do mês],\"<=\" & 30,TbPessoas[Até],\">=\"& 30,TbPessoas[Meta:Atividade],LEFT(B8,FIND(\" \",B8,1)-1))","v":0},{"$f":"SUMIFS(TbPessoas[Custo Total Mensal],TbPessoas[A partir do mês],\"<=\" & 31,TbPessoas[Até],\">=\"& 31,TbPessoas[Meta:Atividade],LEFT(B8,FIND(\" \",B8,1)-1))","v":0},{"$f":"SUMIFS(TbPessoas[Custo Total Mensal],TbPessoas[A partir do mês],\"<=\" & 32,TbPessoas[Até],\">=\"& 32,TbPessoas[Meta:Atividade],LEFT(B8,FIND(\" \",B8,1)-1))","v":0},{"$f":"SUMIFS(TbPessoas[Custo Total Mensal],TbPessoas[A partir do mês],\"<=\" & 33,TbPessoas[Até],\">=\"& 33,TbPessoas[Meta:Atividade],LEFT(B8,FIND(\" \",B8,1)-1))","v":0},{"$f":"SUMIFS(TbPessoas[Custo Total Mensal],TbPessoas[A partir do mês],\"<=\" & 34,TbPessoas[Até],\">=\"& 34,TbPessoas[Meta:Atividade],LEFT(B8,FIND(\" \",B8,1)-1))","v":0},{"$f":"SUMIFS(TbPessoas[Custo Total Mensal],TbPessoas[A partir do mês],\"<=\" & 35,TbPessoas[Até],\">=\"& 35,TbPessoas[Meta:Atividade],LEFT(B8,FIND(\" \",B8,1)-1))","v":0},{"$f":"SUMIFS(TbPessoas[Custo Total Mensal],TbPessoas[A partir do mês],\"<=\" & 36,TbPessoas[Até],\">=\"& 36,TbPessoas[Meta:Atividade],LEFT(B8,FIND(\" \",B8,1)-1))","v":0},{"$f":"SUM(D8:AM8)","v":0}]
[null,null,"Pessoa Jurídica",{"$f":"SUMIFS(TBCompras[Valor Total Item (R$)],TBCompras[Mês do Projeto],\"<=\" & 1,TBCompras[Até],\">=\"& 1,TBCompras[Meta:Atividade],LEFT(B8,FIND(\" \",B8,1)-1),TBCompras[Tipo de Material],\"SERVIÇO\")","v":0},{"$f":"SUMIFS(TBCompras[Valor Total Item (R$)],TBCompras[Mês do Projeto],\"<=\" & 2,TBCompras[Até],\">=\"& 2,TBCompras[Meta:Atividade],LEFT(B8,FIND(\" \",B8,1)-1),TBCompras[Tipo de Material],\"SERVIÇO\")","v":0},{"$f":"SUMIFS(TBCompras[Valor Total Item (R$)],TBCompras[Mês do Projeto],\"<=\" & 3,TBCompras[Até],\">=\"& 3,TBCompras[Meta:Atividade],LEFT(B8,FIND(\" \",B8,1)-1),TBCompras[Tipo de Material],\"SERVIÇO\")","v":0},{"$f":"SUMIFS(TBCompras[Valor Total Item (R$)],TBCompras[Mês do Projeto],\"<=\" & 4,TBCompras[Até],\">=\"& 4,TBCompras[Meta:Atividade],LEFT(B8,FIND(\" \",B8,1)-1),TBCompras[Tipo de Material],\"SERVIÇO\")","v":0},{"$f":"SUMIFS(TBCompras[Valor Total Item (R$)],TBCompras[Mês do Projeto],\"<=\" & 5,TBCompras[Até],\">=\"& 5,TBCompras[Meta:Atividade],LEFT(B8,FIND(\" \",B8,1)-1),TBCompras[Tipo de Material],\"SERVIÇO\")","v":0},{"$f":"SUMIFS(TBCompras[Valor Total Item (R$)],TBCompras[Mês do Projeto],\"<=\" & 6,TBCompras[Até],\">=\"& 6,TBCompras[Meta:Atividade],LEFT(B8,FIND(\" \",B8,1)-1),TBCompras[Tipo de Material],\"SERVIÇO\")","v":0},{"$f":"SUMIFS(TBCompras[Valor Total Item (R$)],TBCompras[Mês do Projeto],\"<=\" & 7,TBCompras[Até],\">=\"& 7,TBCompras[Meta:Atividade],LEFT(B8,FIND(\" \",B8,1)-1),TBCompras[Tipo de Material],\"SERVIÇO\")","v":0},{"$f":"SUMIFS(TBCompras[Valor Total Item (R$)],TBCompras[Mês do Projeto],\"<=\" & 8,TBCompras[Até],\">=\"& 8,TBCompras[Meta:Atividade],LEFT(B8,FIND(\" \",B8,1)-1),TBCompras[Tipo de Material],\"SERVIÇO\")","v":0},{"$f":"SUMIFS(TBCompras[Valor Total Item (R$)],TBCompras[Mês do Projeto],\"<=\" & 9,TBCompras[Até],\">=\"& 9,TBCompras[Meta:Atividade],LEFT(B8,FIND(\" \",B8,1)-1),TBCompras[Tipo de Material],\"SERVIÇO\")","v":0},{"$f":"SUMIFS(TBCompras[Valor Total Item (R$)],TBCompras[Mês do Projeto],\"<=\" & 10,TBCompras[Até],\">=\"& 10,TBCompras[Meta:Atividade],LEFT(B8,FIND(\" \",B8,1)-1),TBCompras[Tipo de Material],\"SERVIÇO\")","v":0},{"$f":"SUMIFS(TBCompras[Valor Total Item (R$)],TBCompras[Mês do Projeto],\"<=\" & 11,TBCompras[Até],\">=\"& 11,TBCompras[Meta:Atividade],LEFT(B8,FIND(\" \",B8,1)-1),TBCompras[Tipo de Material],\"SERVIÇO\")","v":0},{"$f":"SUMIFS(TBCompras[Valor Total Item (R$)],TBCompras[Mês do Projeto],\"<=\" & 12,TBCompras[Até],\">=\"& 12,TBCompras[Meta:Atividade],LEFT(B8,FIND(\" \",B8,1)-1),TBCompras[Tipo de Material],\"SERVIÇO\")","v":0},{"$f":"SUMIFS(TBCompras[Valor Total Item (R$)],TBCompras[Mês do Projeto],\"<=\" & 13,TBCompras[Até],\">=\"& 13,TBCompras[Meta:Atividade],LEFT(B8,FIND(\" \",B8,1)-1),TBCompras[Tipo de Material],\"SERVIÇO\")","v":0},{"$f":"SUMIFS(TBCompras[Valor Total Item (R$)],TBCompras[Mês do Projeto],\"<=\" & 14,TBCompras[Até],\">=\"& 14,TBCompras[Meta:Atividade],LEFT(B8,FIND(\" \",B8,1)-1),TBCompras[Tipo de Material],\"SERVIÇO\")","v":0},{"$f":"SUMIFS(TBCompras[Valor Total Item (R$)],TBCompras[Mês do Projeto],\"<=\" & 15,TBCompras[Até],\">=\"& 15,TBCompras[Meta:Atividade],LEFT(B8,FIND(\" \",B8,1)-1),TBCompras[Tipo de Material],\"SERVIÇO\")","v":0},{"$f":"SUMIFS(TBCompras[Valor Total Item (R$)],TBCompras[Mês do Projeto],\"<=\" & 16,TBCompras[Até],\">=\"& 16,TBCompras[Meta:Atividade],LEFT(B8,FIND(\" \",B8,1)-1),TBCompras[Tipo de Material],\"SERVIÇO\")","v":0},{"$f":"SUMIFS(TBCompras[Valor Total Item (R$)],TBCompras[Mês do Projeto],\"<=\" & 17,TBCompras[Até],\">=\"& 17,TBCompras[Meta:Atividade],LEFT(B8,FIND(\" \",B8,1)-1),TBCompras[Tipo de Material],\"SERVIÇO\")","v":0},{"$f":"SUMIFS(TBCompras[Valor Total Item (R$)],TBCompras[Mês do Projeto],\"<=\" & 18,TBCompras[Até],\">=\"& 18,TBCompras[Meta:Atividade],LEFT(B8,FIND(\" \",B8,1)-1),TBCompras[Tipo de Material],\"SERVIÇO\")","v":0},{"$f":"SUMIFS(TBCompras[Valor Total Item (R$)],TBCompras[Mês do Projeto],\"<=\" & 19,TBCompras[Até],\">=\"& 19,TBCompras[Meta:Atividade],LEFT(B8,FIND(\" \",B8,1)-1),TBCompras[Tipo de Material],\"SERVIÇO\")","v":0},{"$f":"SUMIFS(TBCompras[Valor Total Item (R$)],TBCompras[Mês do Projeto],\"<=\" & 20,TBCompras[Até],\">=\"& 20,TBCompras[Meta:Atividade],LEFT(B8,FIND(\" \",B8,1)-1),TBCompras[Tipo de Material],\"SERVIÇO\")","v":0},{"$f":"SUMIFS(TBCompras[Valor Total Item (R$)],TBCompras[Mês do Projeto],\"<=\" & 21,TBCompras[Até],\">=\"& 21,TBCompras[Meta:Atividade],LEFT(B8,FIND(\" \",B8,1)-1),TBCompras[Tipo de Material],\"SERVIÇO\")","v":0},{"$f":"SUMIFS(TBCompras[Valor Total Item (R$)],TBCompras[Mês do Projeto],\"<=\" & 22,TBCompras[Até],\">=\"& 22,TBCompras[Meta:Atividade],LEFT(B8,FIND(\" \",B8,1)-1),TBCompras[Tipo de Material],\"SERVIÇO\")","v":0},{"$f":"SUMIFS(TBCompras[Valor Total Item (R$)],TBCompras[Mês do Projeto],\"<=\" & 23,TBCompras[Até],\">=\"& 23,TBCompras[Meta:Atividade],LEFT(B8,FIND(\" \",B8,1)-1),TBCompras[Tipo de Material],\"SERVIÇO\")","v":0},{"$f":"SUMIFS(TBCompras[Valor Total Item (R$)],TBCompras[Mês do Projeto],\"<=\" & 24,TBCompras[Até],\">=\"& 24,TBCompras[Meta:Atividade],LEFT(B8,FIND(\" \",B8,1)-1),TBCompras[Tipo de Material],\"SERVIÇO\")","v":0},{"$f":"SUMIFS(TBCompras[Valor Total Item (R$)],TBCompras[Mês do Projeto],\"<=\" & 25,TBCompras[Até],\">=\"& 25,TBCompras[Meta:Atividade],LEFT(B8,FIND(\" \",B8,1)-1),TBCompras[Tipo de Material],\"SERVIÇO\")","v":0},{"$f":"SUMIFS(TBCompras[Valor Total Item (R$)],TBCompras[Mês do Projeto],\"<=\" & 26,TBCompras[Até],\">=\"& 26,TBCompras[Meta:Atividade],LEFT(B8,FIND(\" \",B8,1)-1),TBCompras[Tipo de Material],\"SERVIÇO\")","v":0},{"$f":"SUMIFS(TBCompras[Valor Total Item (R$)],TBCompras[Mês do Projeto],\"<=\" & 27,TBCompras[Até],\">=\"& 27,TBCompras[Meta:Atividade],LEFT(B8,FIND(\" \",B8,1)-1),TBCompras[Tipo de Material],\"SERVIÇO\")","v":0},{"$f":"SUMIFS(TBCompras[Valor Total Item (R$)],TBCompras[Mês do Projeto],\"<=\" & 28,TBCompras[Até],\">=\"& 28,TBCompras[Meta:Atividade],LEFT(B8,FIND(\" \",B8,1)-1),TBCompras[Tipo de Material],\"SERVIÇO\")","v":0},{"$f":"SUMIFS(TBCompras[Valor Total Item (R$)],TBCompras[Mês do Projeto],\"<=\" & 29,TBCompras[Até],\">=\"& 29,TBCompras[Meta:Atividade],LEFT(B8,FIND(\" \",B8,1)-1),TBCompras[Tipo de Material],\"SERVIÇO\")","v":0},{"$f":"SUMIFS(TBCompras[Valor Total Item (R$)],TBCompras[Mês do Projeto],\"<=\" & 30,TBCompras[Até],\">=\"& 30,TBCompras[Meta:Atividade],LEFT(B8,FIND(\" \",B8,1)-1),TBCompras[Tipo de Material],\"SERVIÇO\")","v":0},{"$f":"SUMIFS(TBCompras[Valor Total Item (R$)],TBCompras[Mês do Projeto],\"<=\" & 31,TBCompras[Até],\">=\"& 31,TBCompras[Meta:Atividade],LEFT(B8,FIND(\" \",B8,1)-1),TBCompras[Tipo de Material],\"SERVIÇO\")","v":0},{"$f":"SUMIFS(TBCompras[Valor Total Item (R$)],TBCompras[Mês do Projeto],\"<=\" & 32,TBCompras[Até],\">=\"& 32,TBCompras[Meta:Atividade],LEFT(B8,FIND(\" \",B8,1)-1),TBCompras[Tipo de Material],\"SERVIÇO\")","v":0},{"$f":"SUMIFS(TBCompras[Valor Total Item (R$)],TBCompras[Mês do Projeto],\"<=\" & 33,TBCompras[Até],\">=\"& 33,TBCompras[Meta:Atividade],LEFT(B8,FIND(\" \",B8,1)-1),TBCompras[Tipo de Material],\"SERVIÇO\")","v":0},{"$f":"SUMIFS(TBCompras[Valor Total Item (R$)],TBCompras[Mês do Projeto],\"<=\" & 34,TBCompras[Até],\">=\"& 34,TBCompras[Meta:Atividade],LEFT(B8,FIND(\" \",B8,1)-1),TBCompras[Tipo de Material],\"SERVIÇO\")","v":0},{"$f":"SUMIFS(TBCompras[Valor Total Item (R$)],TBCompras[Mês do Projeto],\"<=\" & 35,TBCompras[Até],\">=\"& 35,TBCompras[Meta:Atividade],LEFT(B8,FIND(\" \",B8,1)-1),TBCompras[Tipo de Material],\"SERVIÇO\")","v":0},{"$f":"SUMIFS(TBCompras[Valor Total Item (R$)],TBCompras[Mês do Projeto],\"<=\" & 36,TBCompras[Até],\">=\"& 36,TBCompras[Meta:Atividade],LEFT(B8,FIND(\" \",B8,1)-1),TBCompras[Tipo de Material],\"SERVIÇO\")","v":0},0]
[null,null,"Passagens",{"$f":"SUMIFS(TbPassagens[Valor Total Passagem],TbPassagens[A partir do mês],\"<=\" & 1,TbPassagens[Até],\">=\"& 1,TbPassagens[Meta:Atividade],LEFT(B8,FIND(\" \",B8,1)-1))","v":0},{"$f":"SUMIFS(TbPassagens[Valor Total Passagem],TbPassagens[A partir do mês],\"<=\" & 2,TbPassagens[Até],\">=\"& 2,TbPassagens[Meta:Atividade],LEFT(B8,FIND(\" \",B8,1)-1))","v":0},{"$f":"SUMIFS(TbPassagens[Valor Total Passagem],TbPassagens[A partir do mês],\"<=\" & 3,TbPassagens[Até],\">=\"& 3,TbPassagens[Meta:Atividade],LEFT(B8,FIND(\" \",B8,1)-1))","v":0},{"$f":"SUMIFS(TbPassagens[Valor Total Passagem],TbPassagens[A partir do mês],\"<=\" & 4,TbPassagens[Até],\">=\"& 4,TbPassagens[Meta:Atividade],LEFT(B8,FIND(\" \",B8,1)-1))","v":0},{"$f":"SUMIFS(TbPassagens[Valor Total Passagem],TbPassagens[A partir do mês],\"<=\" & 5,TbPassagens[Até],\">=\"& 5,TbPassagens[Meta:Atividade],LEFT(B8,FIND(\" \",B8,1)-1))","v":0},{"$f":"SUMIFS(TbPassagens[Valor Total Passagem],TbPassagens[A partir do mês],\"<=\" & 6,TbPassagens[Até],\">=\"& 6,TbPassagens[Meta:Atividade],LEFT(B8,FIND(\" \",B8,1)-1))","v":0},{"$f":"SUMIFS(TbPassagens[Valor Total Passagem],TbPassagens[A partir do mês],\"<=\" & 7,TbPassagens[Até],\">=\"& 7,TbPassagens[Meta:Atividade],LEFT(B8,FIND(\" \",B8,1)-1))","v":0},{"$f":"SUMIFS(TbPassagens[Valor Total Passagem],TbPassagens[A partir do mês],\"<=\" & 8,TbPassagens[Até],\">=\"& 8,TbPassagens[Meta:Atividade],LEFT(B8,FIND(\" \",B8,1)-1))","v":0},{"$f":"SUMIFS(TbPassagens[Valor Total Passagem],TbPassagens[A partir do mês],\"<=\" & 9,TbPassagens[Até],\">=\"& 9,TbPassagens[Meta:Atividade],LEFT(B8,FIND(\" \",B8,1)-1))","v":0},{"$f":"SUMIFS(TbPassagens[Valor Total Passagem],TbPassagens[A partir do mês],\"<=\" & 10,TbPassagens[Até],\">=\"& 10,TbPassagens[Meta:Atividade],LEFT(B8,FIND(\" \",B8,1)-1))","v":0},{"$f":"SUMIFS(TbPassagens[Valor Total Passagem],TbPassagens[A partir do mês],\"<=\" & 11,TbPassagens[Até],\">=\"& 11,TbPassagens[Meta:Atividade],LEFT(B8,FIND(\" \",B8,1)-1))","v":0},{"$f":"SUMIFS(TbPassagens[Valor Total Passagem],TbPassagens[A partir do mês],\"<=\" & 12,TbPassagens[Até],\">=\"& 12,TbPassagens[Meta:Atividade],LEFT(B8,FIND(\" \",B8,1)-1))","v":0},{"$f":"SUMIFS(TbPassagens[Valor Total Passagem],TbPassagens[A partir do mês],\"<=\" & 13,TbPassagens[Até],\">=\"& 13,TbPassagens[Meta:Atividade],LEFT(B8,FIND(\" \",B8,1)-1))","v":0},{"$f":"SUMIFS(TbPassagens[Valor Total Passagem],TbPassagens[A partir do mês],\"<=\" & 14,TbPassagens[Até],\">=\"& 14,TbPassagens[Meta:Atividade],LEFT(B8,FIND(\" \",B8,1)-1))","v":0},{"$f":"SUMIFS(TbPassagens[Valor Total Passagem],TbPassagens[A partir do mês],\"<=\" & 15,TbPassagens[Até],\">=\"& 15,TbPassagens[Meta:Atividade],LEFT(B8,FIND(\" \",B8,1)-1))","v":0},{"$f":"SUMIFS(TbPassagens[Valor Total Passagem],TbPassagens[A partir do mês],\"<=\" & 16,TbPassagens[Até],\">=\"& 16,TbPassagens[Meta:Atividade],LEFT(B8,FIND(\" \",B8,1)-1))","v":0},{"$f":"SUMIFS(TbPassagens[Valor Total Passagem],TbPassagens[A partir do mês],\"<=\" & 17,TbPassagens[Até],\">=\"& 17,TbPassagens[Meta:Atividade],LEFT(B8,FIND(\" \",B8,1)-1))","v":0},{"$f":"SUMIFS(TbPassagens[Valor Total Passagem],TbPassagens[A partir do mês],\"<=\" & 18,TbPassagens[Até],\">=\"& 18,TbPassagens[Meta:Atividade],LEFT(B8,FIND(\" \",B8,1)-1))","v":0},{"$f":"SUMIFS(TbPassagens[Valor Total Passagem],TbPassagens[A partir do mês],\"<=\" & 19,TbPassagens[Até],\">=\"& 19,TbPassagens[Meta:Atividade],LEFT(B8,FIND(\" \",B8,1)-1))","v":0},{"$f":"SUMIFS(TbPassagens[Valor Total Passagem],TbPassagens[A partir do mês],\"<=\" & 20,TbPassagens[Até],\">=\"& 20,TbPassagens[Meta:Atividade],LEFT(B8,FIND(\" \",B8,1)-1))","v":0},{"$f":"SUMIFS(TbPassagens[Valor Total Passagem],TbPassagens[A partir do mês],\"<=\" & 21,TbPassagens[Até],\">=\"& 21,TbPassagens[Meta:Atividade],LEFT(B8,FIND(\" \",B8,1)-1))","v":0},{"$f":"SUMIFS(TbPassagens[Valor Total Passagem],TbPassagens[A partir do mês],\"<=\" & 22,TbPassagens[Até],\">=\"& 22,TbPassagens[Meta:Atividade],LEFT(B8,FIND(\" \",B8,1)-1))","v":0},{"$f":"SUMIFS(TbPassagens[Valor Total Passagem],TbPassagens[A partir do mês],\"<=\" & 23,TbPassagens[Até],\">=\"& 23,TbPassagens[Meta:Atividade],LEFT(B8,FIND(\" \",B8,1)-1))","v":0},{"$f":"SUMIFS(TbPassagens[Valor Total Passagem],TbPassagens[A partir do mês],\"<=\" & 24,TbPassagens[Até],\">=\"& 24,TbPassagens[Meta:Atividade],LEFT(B8,FIND(\" \",B8,1)-1))","v":0},{"$f":"SUMIFS(TbPassagens[Valor Total Passagem],TbPassagens[A partir do mês],\"<=\" & 25,TbPassagens[Até],\">=\"& 25,TbPassagens[Meta:Atividade],LEFT(B8,FIND(\" \",B8,1)-1))","v":0},{"$f":"SUMIFS(TbPassagens[Valor Total Passagem],TbPassagens[A partir do mês],\"<=\" & 26,TbPassagens[Até],\">=\"& 26,TbPassagens[Meta:Atividade],LEFT(B8,FIND(\" \",B8,1)-1))","v":0},{"$f":"SUMIFS(TbPassagens[Valor Total Passagem],TbPassagens[A partir do mês],\"<=\" & 27,TbPassagens[Até],\">=\"& 27,TbPassagens[Meta:Atividade],LEFT(B8,FIND(\" \",B8,1)-1))","v":0},{"$f":"SUMIFS(TbPassagens[Valor Total Passagem],TbPassagens[A partir do mês],\"<=\" & 28,TbPassagens[Até],\">=\"& 28,TbPassagens[Meta:Atividade],LEFT(B8,FIND(\" \",B8,1)-1))","v":0},{"$f":"SUMIFS(TbPassagens[Valor Total Passagem],TbPassagens[A partir do mês],\"<=\" & 29,TbPassagens[Até],\">=\"& 29,TbPassagens[Meta:Atividade],LEFT(B8,FIND(\" \",B8,1)-1))","v":0},{"$f":"SUMIFS(TbPassagens[Valor Total Passagem],TbPassagens[A partir do mês],\"<=\" & 30,TbPassagens[Até],\">=\"& 30,TbPassagens[Meta:Atividade],LEFT(B8,FIND(\" \",B8,1)-1))","v":0},{"$f":"SUMIFS(TbPassagens[Valor Total Passagem],TbPassagens[A partir do mês],\"<=\" & 31,TbPassagens[Até],\">=\"& 31,TbPassagens[Meta:Atividade],LEFT(B8,FIND(\" \",B8,1)-1))","v":0},{"$f":"SUMIFS(TbPassagens[Valor Total Passagem],TbPassagens[A partir do mês],\"<=\" & 32,TbPassagens[Até],\">=\"& 32,TbPassagens[Meta:Atividade],LEFT(B8,FIND(\" \",B8,1)-1))","v":0},{"$f":"SUMIFS(TbPassagens[Valor Total Passagem],TbPassagens[A partir do mês],\"<=\" & 33,TbPassagens[Até],\">=\"& 33,TbPassagens[Meta:Atividade],LEFT(B8,FIND(\" \",B8,1)-1))","v":0},{"$f":"SUMIFS(TbPassagens[Valor Total Passagem],TbPassagens[A partir do mês],\"<=\" & 34,TbPassagens[Até],\">=\"& 34,TbPassagens[Meta:Atividade],LEFT(B8,FIND(\" \",B8,1)-1))","v":0},{"$f":"SUMIFS(TbPassagens[Valor Total Passagem],TbPassagens[A partir do mês],\"<=\" & 35,TbPassagens[Até],\">=\"& 35,TbPassagens[Meta:Atividade],LEFT(B8,FIND(\" \",B8,1)-1))","v":0},{"$f":"SUMIFS(TbPassagens[Valor Total Passagem],TbPassagens[A partir do mês],\"<=\" & 36,TbPassagens[Até],\">=\"& 36,TbPassagens[Meta:Atividade],LEFT(B8,FIND(\" \",B8,1)-1))","v":0},0]
[null,null,"Diárias",{"$f":"SUMIFS(TbPassagens[Valor Total Diária],TbPassagens[A partir do mês],\"<=\" & 1,TbPassagens[Até],\">=\"& 1,TbPassagens[Meta:Atividade],LEFT(B8,FIND(\" \",B8,1)-1))","v":0},{"$f":"SUMIFS(TbPassagens[Valor Total Diária],TbPassagens[A partir do mês],\"<=\" & 2,TbPassagens[Até],\">=\"& 2,TbPassagens[Meta:Atividade],LEFT(B8,FIND(\" \",B8,1)-1))","v":0},{"$f":"SUMIFS(TbPassagens[Valor Total Diária],TbPassagens[A partir do mês],\"<=\" & 3,TbPassagens[Até],\">=\"& 3,TbPassagens[Meta:Atividade],LEFT(B8,FIND(\" \",B8,1)-1))","v":0},{"$f":"SUMIFS(TbPassagens[Valor Total Diária],TbPassagens[A partir do mês],\"<=\" & 4,TbPassagens[Até],\">=\"& 4,TbPassagens[Meta:Atividade],LEFT(B8,FIND(\" \",B8,1)-1))","v":0},{"$f":"SUMIFS(TbPassagens[Valor Total Diária],TbPassagens[A partir do mês],\"<=\" & 5,TbPassagens[Até],\">=\"& 5,TbPassagens[Meta:Atividade],LEFT(B8,FIND(\" \",B8,1)-1))","v":0},{"$f":"SUMIFS(TbPassagens[Valor Total Diária],TbPassagens[A partir do mês],\"<=\" & 6,TbPassagens[Até],\">=\"& 6,TbPassagens[Meta:Atividade],LEFT(B8,FIND(\" \",B8,1)-1))","v":0},{"$f":"SUMIFS(TbPassagens[Valor Total Diária],TbPassagens[A partir do mês],\"<=\" & 7,TbPassagens[Até],\">=\"& 7,TbPassagens[Meta:Atividade],LEFT(B8,FIND(\" \",B8,1)-1))","v":0},{"$f":"SUMIFS(TbPassagens[Valor Total Diária],TbPassagens[A partir do mês],\"<=\" & 8,TbPassagens[Até],\">=\"& 8,TbPassagens[Meta:Atividade],LEFT(B8,FIND(\" \",B8,1)-1))","v":0},{"$f":"SUMIFS(TbPassagens[Valor Total Diária],TbPassagens[A partir do mês],\"<=\" & 9,TbPassagens[Até],\">=\"& 9,TbPassagens[Meta:Atividade],LEFT(B8,FIND(\" \",B8,1)-1))","v":0},{"$f":"SUMIFS(TbPassagens[Valor Total Diária],TbPassagens[A partir do mês],\"<=\" & 10,TbPassagens[Até],\">=\"& 10,TbPassagens[Meta:Atividade],LEFT(B8,FIND(\" \",B8,1)-1))","v":0},{"$f":"SUMIFS(TbPassagens[Valor Total Diária],TbPassagens[A partir do mês],\"<=\" & 11,TbPassagens[Até],\">=\"& 11,TbPassagens[Meta:Atividade],LEFT(B8,FIND(\" \",B8,1)-1))","v":0},{"$f":"SUMIFS(TbPassagens[Valor Total Diária],TbPassagens[A partir do mês],\"<=\" & 12,TbPassagens[Até],\">=\"& 12,TbPassagens[Meta:Atividade],LEFT(B8,FIND(\" \",B8,1)-1))","v":0},{"$f":"SUMIFS(TbPassagens[Valor Total Diária],TbPassagens[A partir do mês],\"<=\" & 13,TbPassagens[Até],\">=\"& 13,TbPassagens[Meta:Atividade],LEFT(B8,FIND(\" \",B8,1)-1))","v":0},{"$f":"SUMIFS(TbPassagens[Valor Total Diária],TbPassagens[A partir do mês],\"<=\" & 14,TbPassagens[Até],\">=\"& 14,TbPassagens[Meta:Atividade],LEFT(B8,FIND(\" \",B8,1)-1))","v":0},{"$f":"SUMIFS(TbPassagens[Valor Total Diária],TbPassagens[A partir do mês],\"<=\" & 15,TbPassagens[Até],\">=\"& 15,TbPassagens[Meta:Atividade],LEFT(B8,FIND(\" \",B8,1)-1))","v":0},{"$f":"SUMIFS(TbPassagens[Valor Total Diária],TbPassagens[A partir do mês],\"<=\" & 16,TbPassagens[Até],\">=\"& 16,TbPassagens[Meta:Atividade],LEFT(B8,FIND(\" \",B8,1)-1))","v":0},{"$f":"SUMIFS(TbPassagens[Valor Total Diária],TbPassagens[A partir do mês],\"<=\" & 17,TbPassagens[Até],\">=\"& 17,TbPassagens[Meta:Atividade],LEFT(B8,FIND(\" \",B8,1)-1))","v":0},{"$f":"SUMIFS(TbPassagens[Valor Total Diária],TbPassagens[A partir do mês],\"<=\" & 18,TbPassagens[Até],\">=\"& 18,TbPassagens[Meta:Atividade],LEFT(B8,FIND(\" \",B8,1)-1))","v":0},{"$f":"SUMIFS(TbPassagens[Valor Total Diária],TbPassagens[A partir do mês],\"<=\" & 19,TbPassagens[Até],\">=\"& 19,TbPassagens[Meta:Atividade],LEFT(B8,FIND(\" \",B8,1)-1))","v":0},{"$f":"SUMIFS(TbPassagens[Valor Total Diária],TbPassagens[A partir do mês],\"<=\" & 20,TbPassagens[Até],\">=\"& 20,TbPassagens[Meta:Atividade],LEFT(B8,FIND(\" \",B8,1)-1))","v":0},{"$f":"SUMIFS(TbPassagens[Valor Total Diária],TbPassagens[A partir do mês],\"<=\" & 21,TbPassagens[Até],\">=\"& 21,TbPassagens[Meta:Atividade],LEFT(B8,FIND(\" \",B8,1)-1))","v":0},{"$f":"SUMIFS(TbPassagens[Valor Total Diária],TbPassagens[A partir do mês],\"<=\" & 22,TbPassagens[Até],\">=\"& 22,TbPassagens[Meta:Atividade],LEFT(B8,FIND(\" \",B8,1)-1))","v":0},{"$f":"SUMIFS(TbPassagens[Valor Total Diária],TbPassagens[A partir do mês],\"<=\" & 23,TbPassagens[Até],\">=\"& 23,TbPassagens[Meta:Atividade],LEFT(B8,FIND(\" \",B8,1)-1))","v":0},{"$f":"SUMIFS(TbPassagens[Valor Total Diária],TbPassagens[A partir do mês],\"<=\" & 24,TbPassagens[Até],\">=\"& 24,TbPassagens[Meta:Atividade],LEFT(B8,FIND(\" \",B8,1)-1))","v":0},{"$f":"SUMIFS(TbPassagens[Valor Total Diária],TbPassagens[A partir do mês],\"<=\" & 25,TbPassagens[Até],\">=\"& 25,TbPassagens[Meta:Atividade],LEFT(B8,FIND(\" \",B8,1)-1))","v":0},{"$f":"SUMIFS(TbPassagens[Valor Total Diária],TbPassagens[A partir do mês],\"<=\" & 26,TbPassagens[Até],\">=\"& 26,TbPassagens[Meta:Atividade],LEFT(B8,FIND(\" \",B8,1)-1))","v":0},{"$f":"SUMIFS(TbPassagens[Valor Total Diária],TbPassagens[A partir do mês],\"<=\" & 27,TbPassagens[Até],\">=\"& 27,TbPassagens[Meta:Atividade],LEFT(B8,FIND(\" \",B8,1)-1))","v":0},{"$f":"SUMIFS(TbPassagens[Valor Total Diária],TbPassagens[A partir do mês],\"<=\" & 28,TbPassagens[Até],\">=\"& 28,TbPassagens[Meta:Atividade],LEFT(B8,FIND(\" \",B8,1)-1))","v":0},{"$f":"SUMIFS(TbPassagens[Valor Total Diária],TbPassagens[A partir do mês],\"<=\" & 29,TbPassagens[Até],\">=\"& 29,TbPassagens[Meta:Atividade],LEFT(B8,FIND(\" \",B8,1)-1))","v":0},{"$f":"SUMIFS(TbPassagens[Valor Total Diária],TbPassagens[A partir do mês],\"<=\" & 30,TbPassagens[Até],\">=\"& 30,TbPassagens[Meta:Atividade],LEFT(B8,FIND(\" \",B8,1)-1))","v":0},{"$f":"SUMIFS(TbPassagens[Valor Total Diária],TbPassagens[A partir do mês],\"<=\" & 31,TbPassagens[Até],\">=\"& 31,TbPassagens[Meta:Atividade],LEFT(B8,FIND(\" \",B8,1)-1))","v":0},{"$f":"SUMIFS(TbPassagens[Valor Total Diária],TbPassagens[A partir do mês],\"<=\" & 32,TbPassagens[Até],\">=\"& 32,TbPassagens[Meta:Atividade],LEFT(B8,FIND(\" \",B8,1)-1))","v":0},{"$f":"SUMIFS(TbPassagens[Valor Total Diária],TbPassagens[A partir do mês],\"<=\" & 33,TbPassagens[Até],\">=\"& 33,TbPassagens[Meta:Atividade],LEFT(B8,FIND(\" \",B8,1)-1))","v":0},{"$f":"SUMIFS(TbPassagens[Valor Total Diária],TbPassagens[A partir do mês],\"<=\" & 34,TbPassagens[Até],\">=\"& 34,TbPassagens[Meta:Atividade],LEFT(B8,FIND(\" \",B8,1)-1))","v":0},{"$f":"SUMIFS(TbPassagens[Valor Total Diária],TbPassagens[A partir do mês],\"<=\" & 35,TbPassagens[Até],\">=\"& 35,TbPassagens[Meta:Atividade],LEFT(B8,FIND(\" \",B8,1)-1))","v":0},{"$f":"SUMIFS(TbPassagens[Valor Total Diária],TbPassagens[A partir do mês],\"<=\" & 36,TbPassagens[Até],\">=\"& 36,TbPassagens[Meta:Atividade],LEFT(B8,FIND(\" \",B8,1)-1))","v":0},0]
[null,null,"Material de Consumo",{"$f":"SUMIFS(TBCompras[Valor Total Item (R$)],TBCompras[Mês do Projeto],\"<=\" & 1,TBCompras[Até],\">=\"& 1,TBCompras[Meta:Atividade],LEFT(B8,FIND(\" \",B8,1)-1),TBCompras[Tipo de Material],\"CONSUMO\")","v":0},{"$f":"SUMIFS(TBCompras[Valor Total Item (R$)],TBCompras[Mês do Projeto],\"<=\" & 2,TBCompras[Até],\">=\"& 2,TBCompras[Meta:Atividade],LEFT(B8,FIND(\" \",B8,1)-1),TBCompras[Tipo de Material],\"CONSUMO\")","v":0},{"$f":"SUMIFS(TBCompras[Valor Total Item (R$)],TBCompras[Mês do Projeto],\"<=\" & 3,TBCompras[Até],\">=\"& 3,TBCompras[Meta:Atividade],LEFT(B8,FIND(\" \",B8,1)-1),TBCompras[Tipo de Material],\"CONSUMO\")","v":0},{"$f":"SUMIFS(TBCompras[Valor Total Item (R$)],TBCompras[Mês do Projeto],\"<=\" & 4,TBCompras[Até],\">=\"& 4,TBCompras[Meta:Atividade],LEFT(B8,FIND(\" \",B8,1)-1),TBCompras[Tipo de Material],\"CONSUMO\")","v":0},{"$f":"SUMIFS(TBCompras[Valor Total Item (R$)],TBCompras[Mês do Projeto],\"<=\" & 5,TBCompras[Até],\">=\"& 5,TBCompras[Meta:Atividade],LEFT(B8,FIND(\" \",B8,1)-1),TBCompras[Tipo de Material],\"CONSUMO\")","v":0},{"$f":"SUMIFS(TBCompras[Valor Total Item (R$)],TBCompras[Mês do Projeto],\"<=\" & 6,TBCompras[Até],\">=\"& 6,TBCompras[Meta:Atividade],LEFT(B8,FIND(\" \",B8,1)-1),TBCompras[Tipo de Material],\"CONSUMO\")","v":0},{"$f":"SUMIFS(TBCompras[Valor Total Item (R$)],TBCompras[Mês do Projeto],\"<=\" & 7,TBCompras[Até],\">=\"& 7,TBCompras[Meta:Atividade],LEFT(B8,FIND(\" \",B8,1)-1),TBCompras[Tipo de Material],\"CONSUMO\")","v":0},{"$f":"SUMIFS(TBCompras[Valor Total Item (R$)],TBCompras[Mês do Projeto],\"<=\" & 8,TBCompras[Até],\">=\"& 8,TBCompras[Meta:Atividade],LEFT(B8,FIND(\" \",B8,1)-1),TBCompras[Tipo de Material],\"CONSUMO\")","v":0},{"$f":"SUMIFS(TBCompras[Valor Total Item (R$)],TBCompras[Mês do Projeto],\"<=\" & 9,TBCompras[Até],\">=\"& 9,TBCompras[Meta:Atividade],LEFT(B8,FIND(\" \",B8,1)-1),TBCompras[Tipo de Material],\"CONSUMO\")","v":0},{"$f":"SUMIFS(TBCompras[Valor Total Item (R$)],TBCompras[Mês do Projeto],\"<=\" & 10,TBCompras[Até],\">=\"& 10,TBCompras[Meta:Atividade],LEFT(B8,FIND(\" \",B8,1)-1),TBCompras[Tipo de Material],\"CONSUMO\")","v":0},{"$f":"SUMIFS(TBCompras[Valor Total Item (R$)],TBCompras[Mês do Projeto],\"<=\" & 11,TBCompras[Até],\">=\"& 11,TBCompras[Meta:Atividade],LEFT(B8,FIND(\" \",B8,1)-1),TBCompras[Tipo de Material],\"CONSUMO\")","v":0},{"$f":"SUMIFS(TBCompras[Valor Total Item (R$)],TBCompras[Mês do Projeto],\"<=\" & 12,TBCompras[Até],\">=\"& 12,TBCompras[Meta:Atividade],LEFT(B8,FIND(\" \",B8,1)-1),TBCompras[Tipo de Material],\"CONSUMO\")","v":0},{"$f":"SUMIFS(TBCompras[Valor Total Item (R$)],TBCompras[Mês do Projeto],\"<=\" & 13,TBCompras[Até],\">=\"& 13,TBCompras[Meta:Atividade],LEFT(B8,FIND(\" \",B8,1)-1),TBCompras[Tipo de Material],\"CONSUMO\")","v":0},{"$f":"SUMIFS(TBCompras[Valor Total Item (R$)],TBCompras[Mês do Projeto],\"<=\" & 14,TBCompras[Até],\">=\"& 14,TBCompras[Meta:Atividade],LEFT(B8,FIND(\" \",B8,1)-1),TBCompras[Tipo de Material],\"CONSUMO\")","v":0},{"$f":"SUMIFS(TBCompras[Valor Total Item (R$)],TBCompras[Mês do Projeto],\"<=\" & 15,TBCompras[Até],\">=\"& 15,TBCompras[Meta:Atividade],LEFT(B8,FIND(\" \",B8,1)-1),TBCompras[Tipo de Material],\"CONSUMO\")","v":0},{"$f":"SUMIFS(TBCompras[Valor Total Item (R$)],TBCompras[Mês do Projeto],\"<=\" & 16,TBCompras[Até],\">=\"& 16,TBCompras[Meta:Atividade],LEFT(B8,FIND(\" \",B8,1)-1),TBCompras[Tipo de Material],\"CONSUMO\")","v":0},{"$f":"SUMIFS(TBCompras[Valor Total Item (R$)],TBCompras[Mês do Projeto],\"<=\" & 17,TBCompras[Até],\">=\"& 17,TBCompras[Meta:Atividade],LEFT(B8,FIND(\" \",B8,1)-1),TBCompras[Tipo de Material],\"CONSUMO\")","v":0},{"$f":"SUMIFS(TBCompras[Valor Total Item (R$)],TBCompras[Mês do Projeto],\"<=\" & 18,TBCompras[Até],\">=\"& 18,TBCompras[Meta:Atividade],LEFT(B8,FIND(\" \",B8,1)-1),TBCompras[Tipo de Material],\"CONSUMO\")","v":0},{"$f":"SUMIFS(TBCompras[Valor Total Item (R$)],TBCompras[Mês do Projeto],\"<=\" & 19,TBCompras[Até],\">=\"& 19,TBCompras[Meta:Atividade],LEFT(B8,FIND(\" \",B8,1)-1),TBCompras[Tipo de Material],\"CONSUMO\")","v":0},{"$f":"SUMIFS(TBCompras[Valor Total Item (R$)],TBCompras[Mês do Projeto],\"<=\" & 20,TBCompras[Até],\">=\"& 20,TBCompras[Meta:Atividade],LEFT(B8,FIND(\" \",B8,1)-1),TBCompras[Tipo de Material],\"CONSUMO\")","v":0},{"$f":"SUMIFS(TBCompras[Valor Total Item (R$)],TBCompras[Mês do Projeto],\"<=\" & 21,TBCompras[Até],\">=\"& 21,TBCompras[Meta:Atividade],LEFT(B8,FIND(\" \",B8,1)-1),TBCompras[Tipo de Material],\"CONSUMO\")","v":0},{"$f":"SUMIFS(TBCompras[Valor Total Item (R$)],TBCompras[Mês do Projeto],\"<=\" & 22,TBCompras[Até],\">=\"& 22,TBCompras[Meta:Atividade],LEFT(B8,FIND(\" \",B8,1)-1),TBCompras[Tipo de Material],\"CONSUMO\")","v":0},{"$f":"SUMIFS(TBCompras[Valor Total Item (R$)],TBCompras[Mês do Projeto],\"<=\" & 23,TBCompras[Até],\">=\"& 23,TBCompras[Meta:Atividade],LEFT(B8,FIND(\" \",B8,1)-1),TBCompras[Tipo de Material],\"CONSUMO\")","v":0},{"$f":"SUMIFS(TBCompras[Valor Total Item (R$)],TBCompras[Mês do Projeto],\"<=\" & 24,TBCompras[Até],\">=\"& 24,TBCompras[Meta:Atividade],LEFT(B8,FIND(\" \",B8,1)-1),TBCompras[Tipo de Material],\"CONSUMO\")","v":0},{"$f":"SUMIFS(TBCompras[Valor Total Item (R$)],TBCompras[Mês do Projeto],\"<=\" & 25,TBCompras[Até],\">=\"& 25,TBCompras[Meta:Atividade],LEFT(B8,FIND(\" \",B8,1)-1),TBCompras[Tipo de Material],\"CONSUMO\")","v":0},{"$f":"SUMIFS(TBCompras[Valor Total Item (R$)],TBCompras[Mês do Projeto],\"<=\" & 26,TBCompras[Até],\">=\"& 26,TBCompras[Meta:Atividade],LEFT(B8,FIND(\" \",B8,1)-1),TBCompras[Tipo de Material],\"CONSUMO\")","v":0},{"$f":"SUMIFS(TBCompras[Valor Total Item (R$)],TBCompras[Mês do Projeto],\"<=\" & 27,TBCompras[Até],\">=\"& 27,TBCompras[Meta:Atividade],LEFT(B8,FIND(\" \",B8,1)-1),TBCompras[Tipo de Material],\"CONSUMO\")","v":0},{"$f":"SUMIFS(TBCompras[Valor Total Item (R$)],TBCompras[Mês do Projeto],\"<=\" & 28,TBCompras[Até],\">=\"& 28,TBCompras[Meta:Atividade],LEFT(B8,FIND(\" \",B8,1)-1),TBCompras[Tipo de Material],\"CONSUMO\")","v":0},{"$f":"SUMIFS(TBCompras[Valor Total Item (R$)],TBCompras[Mês do Projeto],\"<=\" & 29,TBCompras[Até],\">=\"& 29,TBCompras[Meta:Atividade],LEFT(B8,FIND(\" \",B8,1)-1),TBCompras[Tipo de Material],\"CONSUMO\")","v":0},{"$f":"SUMIFS(TBCompras[Valor Total Item (R$)],TBCompras[Mês do Projeto],\"<=\" & 30,TBCompras[Até],\">=\"& 30,TBCompras[Meta:Atividade],LEFT(B8,FIND(\" \",B8,1)-1),TBCompras[Tipo de Material],\"CONSUMO\")","v":0},{"$f":"SUMIFS(TBCompras[Valor Total Item (R$)],TBCompras[Mês do Projeto],\"<=\" & 31,TBCompras[Até],\">=\"& 31,TBCompras[Meta:Atividade],LEFT(B8,FIND(\" \",B8,1)-1),TBCompras[Tipo de Material],\"CONSUMO\")","v":0},{"$f":"SUMIFS(TBCompras[Valor Total Item (R$)],TBCompras[Mês do Projeto],\"<=\" & 32,TBCompras[Até],\">=\"& 32,TBCompras[Meta:Atividade],LEFT(B8,FIND(\" \",B8,1)-1),TBCompras[Tipo de Material],\"CONSUMO\")","v":0},{"$f":"SUMIFS(TBCompras[Valor Total Item (R$)],TBCompras[Mês do Projeto],\"<=\" & 33,TBCompras[Até],\">=\"& 33,TBCompras[Meta:Atividade],LEFT(B8,FIND(\" \",B8,1)-1),TBCompras[Tipo de Material],\"CONSUMO\")","v":0},{"$f":"SUMIFS(TBCompras[Valor Total Item (R$)],TBCompras[Mês do Projeto],\"<=\" & 34,TBCompras[Até],\">=\"& 34,TBCompras[Meta:Atividade],LEFT(B8,FIND(\" \",B8,1)-1),TBCompras[Tipo de Material],\"CONSUMO\")","v":0},{"$f":"SUMIFS(TBCompras[Valor Total Item (R$)],TBCompras[Mês do Projeto],\"<=\" & 35,TBCompras[Até],\">=\"& 35,TBCompras[Meta:Atividade],LEFT(B8,FIND(\" \",B8,1)-1),TBCompras[Tipo de Material],\"CONSUMO\")","v":0},{"$f":"SUMIFS(TBCompras[Valor Total Item (R$)],TBCompras[Mês do Projeto],\"<=\" & 36,TBCompras[Até],\">=\"& 36,TBCompras[Meta:Atividade],LEFT(B8,FIND(\" \",B8,1)-1),TBCompras[Tipo de Material],\"CONSUMO\")","v":0},0]
[null,null,"Equipamentos",{"$f":"SUMIFS(TBCompras[Valor Total Item (R$)],TBCompras[Mês do Projeto],\"<=\" & 1,TBCompras[Até],\">=\"& 1,TBCompras[Meta:Atividade],LEFT(B8,FIND(\" \",B8,1)-1),TBCompras[Tipo de Material],\"EQUIPAMENTO\")","v":0},{"$f":"SUMIFS(TBCompras[Valor Total Item (R$)],TBCompras[Mês do Projeto],\"<=\" & 2,TBCompras[Até],\">=\"& 2,TBCompras[Meta:Atividade],LEFT(B8,FIND(\" \",B8,1)-1),TBCompras[Tipo de Material],\"EQUIPAMENTO\")","v":0},{"$f":"SUMIFS(TBCompras[Valor Total Item (R$)],TBCompras[Mês do Projeto],\"<=\" & 3,TBCompras[Até],\">=\"& 3,TBCompras[Meta:Atividade],LEFT(B8,FIND(\" \",B8,1)-1),TBCompras[Tipo de Material],\"EQUIPAMENTO\")","v":0},{"$f":"SUMIFS(TBCompras[Valor Total Item (R$)],TBCompras[Mês do Projeto],\"<=\" & 4,TBCompras[Até],\">=\"& 4,TBCompras[Meta:Atividade],LEFT(B8,FIND(\" \",B8,1)-1),TBCompras[Tipo de Material],\"EQUIPAMENTO\")","v":0},{"$f":"SUMIFS(TBCompras[Valor Total Item (R$)],TBCompras[Mês do Projeto],\"<=\" & 5,TBCompras[Até],\">=\"& 5,TBCompras[Meta:Atividade],LEFT(B8,FIND(\" \",B8,1)-1),TBCompras[Tipo de Material],\"EQUIPAMENTO\")","v":0},{"$f":"SUMIFS(TBCompras[Valor Total Item (R$)],TBCompras[Mês do Projeto],\"<=\" & 6,TBCompras[Até],\">=\"& 6,TBCompras[Meta:Atividade],LEFT(B8,FIND(\" \",B8,1)-1),TBCompras[Tipo de Material],\"EQUIPAMENTO\")","v":0},{"$f":"SUMIFS(TBCompras[Valor Total Item (R$)],TBCompras[Mês do Projeto],\"<=\" & 7,TBCompras[Até],\">=\"& 7,TBCompras[Meta:Atividade],LEFT(B8,FIND(\" \",B8,1)-1),TBCompras[Tipo de Material],\"EQUIPAMENTO\")","v":0},{"$f":"SUMIFS(TBCompras[Valor Total Item (R$)],TBCompras[Mês do Projeto],\"<=\" & 8,TBCompras[Até],\">=\"& 8,TBCompras[Meta:Atividade],LEFT(B8,FIND(\" \",B8,1)-1),TBCompras[Tipo de Material],\"EQUIPAMENTO\")","v":0},{"$f":"SUMIFS(TBCompras[Valor Total Item (R$)],TBCompras[Mês do Projeto],\"<=\" & 9,TBCompras[Até],\">=\"& 9,TBCompras[Meta:Atividade],LEFT(B8,FIND(\" \",B8,1)-1),TBCompras[Tipo de Material],\"EQUIPAMENTO\")","v":0},{"$f":"SUMIFS(TBCompras[Valor Total Item (R$)],TBCompras[Mês do Projeto],\"<=\" & 10,TBCompras[Até],\">=\"& 10,TBCompras[Meta:Atividade],LEFT(B8,FIND(\" \",B8,1)-1),TBCompras[Tipo de Material],\"EQUIPAMENTO\")","v":0},{"$f":"SUMIFS(TBCompras[Valor Total Item (R$)],TBCompras[Mês do Projeto],\"<=\" & 11,TBCompras[Até],\">=\"& 11,TBCompras[Meta:Atividade],LEFT(B8,FIND(\" \",B8,1)-1),TBCompras[Tipo de Material],\"EQUIPAMENTO\")","v":0},{"$f":"SUMIFS(TBCompras[Valor Total Item (R$)],TBCompras[Mês do Projeto],\"<=\" & 12,TBCompras[Até],\">=\"& 12,TBCompras[Meta:Atividade],LEFT(B8,FIND(\" \",B8,1)-1),TBCompras[Tipo de Material],\"EQUIPAMENTO\")","v":0},{"$f":"SUMIFS(TBCompras[Valor Total Item (R$)],TBCompras[Mês do Projeto],\"<=\" & 13,TBCompras[Até],\">=\"& 13,TBCompras[Meta:Atividade],LEFT(B8,FIND(\" \",B8,1)-1),TBCompras[Tipo de Material],\"EQUIPAMENTO\")","v":0},{"$f":"SUMIFS(TBCompras[Valor Total Item (R$)],TBCompras[Mês do Projeto],\"<=\" & 14,TBCompras[Até],\">=\"& 14,TBCompras[Meta:Atividade],LEFT(B8,FIND(\" \",B8,1)-1),TBCompras[Tipo de Material],\"EQUIPAMENTO\")","v":0},{"$f":"SUMIFS(TBCompras[Valor Total Item (R$)],TBCompras[Mês do Projeto],\"<=\" & 15,TBCompras[Até],\">=\"& 15,TBCompras[Meta:Atividade],LEFT(B8,FIND(\" \",B8,1)-1),TBCompras[Tipo de Material],\"EQUIPAMENTO\")","v":0},{"$f":"SUMIFS(TBCompras[Valor Total Item (R$)],TBCompras[Mês do Projeto],\"<=\" & 16,TBCompras[Até],\">=\"& 16,TBCompras[Meta:Atividade],LEFT(B8,FIND(\" \",B8,1)-1),TBCompras[Tipo de Material],\"EQUIPAMENTO\")","v":0},{"$f":"SUMIFS(TBCompras[Valor Total Item (R$)],TBCompras[Mês do Projeto],\"<=\" & 17,TBCompras[Até],\">=\"& 17,TBCompras[Meta:Atividade],LEFT(B8,FIND(\" \",B8,1)-1),TBCompras[Tipo de Material],\"EQUIPAMENTO\")","v":0},{"$f":"SUMIFS(TBCompras[Valor Total Item (R$)],TBCompras[Mês do Projeto],\"<=\" & 18,TBCompras[Até],\">=\"& 18,TBCompras[Meta:Atividade],LEFT(B8,FIND(\" \",B8,1)-1),TBCompras[Tipo de Material],\"EQUIPAMENTO\")","v":0},{"$f":"SUMIFS(TBCompras[Valor Total Item (R$)],TBCompras[Mês do Projeto],\"<=\" & 19,TBCompras[Até],\">=\"& 19,TBCompras[Meta:Atividade],LEFT(B8,FIND(\" \",B8,1)-1),TBCompras[Tipo de Material],\"EQUIPAMENTO\")","v":0},{"$f":"SUMIFS(TBCompras[Valor Total Item (R$)],TBCompras[Mês do Projeto],\"<=\" & 20,TBCompras[Até],\">=\"& 20,TBCompras[Meta:Atividade],LEFT(B8,FIND(\" \",B8,1)-1),TBCompras[Tipo de Material],\"EQUIPAMENTO\")","v":0},{"$f":"SUMIFS(TBCompras[Valor Total Item (R$)],TBCompras[Mês do Projeto],\"<=\" & 21,TBCompras[Até],\">=\"& 21,TBCompras[Meta:Atividade],LEFT(B8,FIND(\" \",B8,1)-1),TBCompras[Tipo de Material],\"EQUIPAMENTO\")","v":0},{"$f":"SUMIFS(TBCompras[Valor Total Item (R$)],TBCompras[Mês do Projeto],\"<=\" & 22,TBCompras[Até],\">=\"& 22,TBCompras[Meta:Atividade],LEFT(B8,FIND(\" \",B8,1)-1),TBCompras[Tipo de Material],\"EQUIPAMENTO\")","v":0},{"$f":"SUMIFS(TBCompras[Valor Total Item (R$)],TBCompras[Mês do Projeto],\"<=\" & 23,TBCompras[Até],\">=\"& 23,TBCompras[Meta:Atividade],LEFT(B8,FIND(\" \",B8,1)-1),TBCompras[Tipo de Material],\"EQUIPAMENTO\")","v":0},{"$f":"SUMIFS(TBCompras[Valor Total Item (R$)],TBCompras[Mês do Projeto],\"<=\" & 24,TBCompras[Até],\">=\"& 24,TBCompras[Meta:Atividade],LEFT(B8,FIND(\" \",B8,1)-1),TBCompras[Tipo de Material],\"EQUIPAMENTO\")","v":0},{"$f":"SUMIFS(TBCompras[Valor Total Item (R$)],TBCompras[Mês do Projeto],\"<=\" & 25,TBCompras[Até],\">=\"& 25,TBCompras[Meta:Atividade],LEFT(B8,FIND(\" \",B8,1)-1),TBCompras[Tipo de Material],\"EQUIPAMENTO\")","v":0},{"$f":"SUMIFS(TBCompras[Valor Total Item (R$)],TBCompras[Mês do Projeto],\"<=\" & 26,TBCompras[Até],\">=\"& 26,TBCompras[Meta:Atividade],LEFT(B8,FIND(\" \",B8,1)-1),TBCompras[Tipo de Material],\"EQUIPAMENTO\")","v":0},{"$f":"SUMIFS(TBCompras[Valor Total Item (R$)],TBCompras[Mês do Projeto],\"<=\" & 27,TBCompras[Até],\">=\"& 27,TBCompras[Meta:Atividade],LEFT(B8,FIND(\" \",B8,1)-1),TBCompras[Tipo de Material],\"EQUIPAMENTO\")","v":0},{"$f":"SUMIFS(TBCompras[Valor Total Item (R$)],TBCompras[Mês do Projeto],\"<=\" & 28,TBCompras[Até],\">=\"& 28,TBCompras[Meta:Atividade],LEFT(B8,FIND(\" \",B8,1)-1),TBCompras[Tipo de Material],\"EQUIPAMENTO\")","v":0},{"$f":"SUMIFS(TBCompras[Valor Total Item (R$)],TBCompras[Mês do Projeto],\"<=\" & 29,TBCompras[Até],\">=\"& 29,TBCompras[Meta:Atividade],LEFT(B8,FIND(\" \",B8,1)-1),TBCompras[Tipo de Material],\"EQUIPAMENTO\")","v":0},{"$f":"SUMIFS(TBCompras[Valor Total Item (R$)],TBCompras[Mês do Projeto],\"<=\" & 30,TBCompras[Até],\">=\"& 30,TBCompras[Meta:Atividade],LEFT(B8,FIND(\" \",B8,1)-1),TBCompras[Tipo de Material],\"EQUIPAMENTO\")","v":0},{"$f":"SUMIFS(TBCompras[Valor Total Item (R$)],TBCompras[Mês do Projeto],\"<=\" & 31,TBCompras[Até],\">=\"& 31,TBCompras[Meta:Atividade],LEFT(B8,FIND(\" \",B8,1)-1),TBCompras[Tipo de Material],\"EQUIPAMENTO\")","v":0},{"$f":"SUMIFS(TBCompras[Valor Total Item (R$)],TBCompras[Mês do Projeto],\"<=\" & 32,TBCompras[Até],\">=\"& 32,TBCompras[Meta:Atividade],LEFT(B8,FIND(\" \",B8,1)-1),TBCompras[Tipo de Material],\"EQUIPAMENTO\")","v":0},{"$f":"SUMIFS(TBCompras[Valor Total Item (R$)],TBCompras[Mês do Projeto],\"<=\" & 33,TBCompras[Até],\">=\"& 33,TBCompras[Meta:Atividade],LEFT(B8,FIND(\" \",B8,1)-1),TBCompras[Tipo de Material],\"EQUIPAMENTO\")","v":0},{"$f":"SUMIFS(TBCompras[Valor Total Item (R$)],TBCompras[Mês do Projeto],\"<=\" & 34,TBCompras[Até],\">=\"& 34,TBCompras[Meta:Atividade],LEFT(B8,FIND(\" \",B8,1)-1),TBCompras[Tipo de Material],\"EQUIPAMENTO\")","v":0},{"$f":"SUMIFS(TBCompras[Valor Total Item (R$)],TBCompras[Mês do Projeto],\"<=\" & 35,TBCompras[Até],\">=\"& 35,TBCompras[Meta:Atividade],LEFT(B8,FIND(\" \",B8,1)-1),TBCompras[Tipo de Material],\"EQUIPAMENTO\")","v":0},{"$f":"SUMIFS(TBCompras[Valor Total Item (R$)],TBCompras[Mês do Projeto],\"<=\" & 36,TBCompras[Até],\">=\"& 36,TBCompras[Meta:Atividade],LEFT(B8,FIND(\" \",B8,1)-1),TBCompras[Tipo de Material],\"EQUIPAMENTO\")","v":0},0]
[null,null,"Total Atividade 1.1",{"$f":"SUBTOTAL(9,D8:D13)","v":0},0,0,0,0,0,0,0,0,0,0,0,0,0,0,0,0,0,0,0,0,0,0,0,0,0,0,0,0,0,0,0,0,0,0,0,0]
[null,"1.2 - Desenvolver e validar métodos de controle de qualidade","Pessoa Física",{"$f":"SUMIFS(TbPessoas[Custo Total Mensal],TbPessoas[A partir do mês],\"<=\" & 1,TbPessoas[Até],\">=\"& 1,TbPessoas[Meta:Atividade],LEFT(B15,FIND(\" \",B15,1)-1))","v":0},{"$f":"SUMIFS(TbPessoas[Custo Total Mensal],TbPessoas[A partir do mês],\"<=\" & 2,TbPessoas[Até],\">=\"& 2,TbPessoas[Meta:Atividade],LEFT(B15,FIND(\" \",B15,1)-1))","v":0},{"$f":"SUMIFS(TbPessoas[Custo Total Mensal],TbPessoas[A partir do mês],\"<=\" & 3,TbPessoas[Até],\">=\"& 3,TbPessoas[Meta:Atividade],LEFT(B15,FIND(\" \",B15,1)-1))","v":0},{"$f":"SUMIFS(TbPessoas[Custo Total Mensal],TbPessoas[A partir do mês],\"<=\" & 4,TbPessoas[Até],\">=\"& 4,TbPessoas[Meta:Atividade],LEFT(B15,FIND(\" \",B15,1)-1))","v":0},{"$f":"SUMIFS(TbPessoas[Custo Total Mensal],TbPessoas[A partir do mês],\"<=\" & 5,TbPessoas[Até],\">=\"& 5,TbPessoas[Meta:Atividade],LEFT(B15,FIND(\" \",B15,1)-1))","v":0},{"$f":"SUMIFS(TbPessoas[Custo Total Mensal],TbPessoas[A partir do mês],\"<=\" & 6,TbPessoas[Até],\">=\"& 6,TbPessoas[Meta:Atividade],LEFT(B15,FIND(\" \",B15,1)-1))","v":0},{"$f":"SUMIFS(TbPessoas[Custo Total Mensal],TbPessoas[A partir do mês],\"<=\" & 7,TbPessoas[Até],\">=\"& 7,TbPessoas[Meta:Atividade],LEFT(B15,FIND(\" \",B15,1)-1))","v":0},{"$f":"SUMIFS(TbPessoas[Custo Total Mensal],TbPessoas[A partir do mês],\"<=\" & 8,TbPessoas[Até],\">=\"& 8,TbPessoas[Meta:Atividade],LEFT(B15,FIND(\" \",B15,1)-1))","v":0},{"$f":"SUMIFS(TbPessoas[Custo Total Mensal],TbPessoas[A partir do mês],\"<=\" & 9,TbPessoas[Até],\">=\"& 9,TbPessoas[Meta:Atividade],LEFT(B15,FIND(\" \",B15,1)-1))","v":0},{"$f":"SUMIFS(TbPessoas[Custo Total Mensal],TbPessoas[A partir do mês],\"<=\" & 10,TbPessoas[Até],\">=\"& 10,TbPessoas[Meta:Atividade],LEFT(B15,FIND(\" \",B15,1)-1))","v":0},{"$f":"SUMIFS(TbPessoas[Custo Total Mensal],TbPessoas[A partir do mês],\"<=\" & 11,TbPessoas[Até],\">=\"& 11,TbPessoas[Meta:Atividade],LEFT(B15,FIND(\" \",B15,1)-1))","v":0},{"$f":"SUMIFS(TbPessoas[Custo Total Mensal],TbPessoas[A partir do mês],\"<=\" & 12,TbPessoas[Até],\">=\"& 12,TbPessoas[Meta:Atividade],LEFT(B15,FIND(\" \",B15,1)-1))","v":0},{"$f":"SUMIFS(TbPessoas[Custo Total Mensal],TbPessoas[A partir do mês],\"<=\" & 13,TbPessoas[Até],\">=\"& 13,TbPessoas[Meta:Atividade],LEFT(B15,FIND(\" \",B15,1)-1))","v":0},{"$f":"SUMIFS(TbPessoas[Custo Total Mensal],TbPessoas[A partir do mês],\"<=\" & 14,TbPessoas[Até],\">=\"& 14,TbPessoas[Meta:Atividade],LEFT(B15,FIND(\" \",B15,1)-1))","v":0},{"$f":"SUMIFS(TbPessoas[Custo Total Mensal],TbPessoas[A partir do mês],\"<=\" & 15,TbPessoas[Até],\">=\"& 15,TbPessoas[Meta:Atividade],LEFT(B15,FIND(\" \",B15,1)-1))","v":0},{"$f":"SUMIFS(TbPessoas[Custo Total Mensal],TbPessoas[A partir do mês],\"<=\" & 16,TbPessoas[Até],\">=\"& 16,TbPessoas[Meta:Atividade],LEFT(B15,FIND(\" \",B15,1)-1))","v":0},{"$f":"SUMIFS(TbPessoas[Custo Total Mensal],TbPessoas[A partir do mês],\"<=\" & 17,TbPessoas[Até],\">=\"& 17,TbPessoas[Meta:Atividade],LEFT(B15,FIND(\" \",B15,1)-1))","v":0},{"$f":"SUMIFS(TbPessoas[Custo Total Mensal],TbPessoas[A partir do mês],\"<=\" & 18,TbPessoas[Até],\">=\"& 18,TbPessoas[Meta:Atividade],LEFT(B15,FIND(\" \",B15,1)-1))","v":0},{"$f":"SUMIFS(TbPessoas[Custo Total Mensal],TbPessoas[A partir do mês],\"<=\" & 19,TbPessoas[Até],\">=\"& 19,TbPessoas[Meta:Atividade],LEFT(B15,FIND(\" \",B15,1)-1))","v":0},{"$f":"SUMIFS(TbPessoas[Custo Total Mensal],TbPessoas[A partir do mês],\"<=\" & 20,TbPessoas[Até],\">=\"& 20,TbPessoas[Meta:Atividade],LEFT(B15,FIND(\" \",B15,1)-1))","v":0},{"$f":"SUMIFS(TbPessoas[Custo Total Mensal],TbPessoas[A partir do mês],\"<=\" & 21,TbPessoas[Até],\">=\"& 21,TbPessoas[Meta:Atividade],LEFT(B15,FIND(\" \",B15,1)-1))","v":0},{"$f":"SUMIFS(TbPessoas[Custo Total Mensal],TbPessoas[A partir do mês],\"<=\" & 22,TbPessoas[Até],\">=\"& 22,TbPessoas[Meta:Atividade],LEFT(B15,FIND(\" \",B15,1)-1))","v":0},{"$f":"SUMIFS(TbPessoas[Custo Total Mensal],TbPessoas[A partir do mês],\"<=\" & 23,TbPessoas[Até],\">=\"& 23,TbPessoas[Meta:Atividade],LEFT(B15,FIND(\" \",B15,1)-1))","v":0},{"$f":"SUMIFS(TbPessoas[Custo Total Mensal],TbPessoas[A partir do mês],\"<=\" & 24,TbPessoas[Até],\">=\"& 24,TbPessoas[Meta:Atividade],LEFT(B15,FIND(\" \",B15,1)-1))","v":0},{"$f":"SUMIFS(TbPessoas[Custo Total Mensal],TbPessoas[A partir do mês],\"<=\" & 25,TbPessoas[Até],\">=\"& 25,TbPessoas[Meta:Atividade],LEFT(B15,FIND(\" \",B15,1)-1))","v":0},{"$f":"SUMIFS(TbPessoas[Custo Total Mensal],TbPessoas[A partir do mês],\"<=\" & 26,TbPessoas[Até],\">=\"& 26,TbPessoas[Meta:Atividade],LEFT(B15,FIND(\" \",B15,1)-1))","v":0},{"$f":"SUMIFS(TbPessoas[Custo Total Mensal],TbPessoas[A partir do mês],\"<=\" & 27,TbPessoas[Até],\">=\"& 27,TbPessoas[Meta:Atividade],LEFT(B15,FIND(\" \",B15,1)-1))","v":0},{"$f":"SUMIFS(TbPessoas[Custo Total Mensal],TbPessoas[A partir do mês],\"<=\" & 28,TbPessoas[Até],\">=\"& 28,TbPessoas[Meta:Atividade],LEFT(B15,FIND(\" \",B15,1)-1))","v":0},{"$f":"SUMIFS(TbPessoas[Custo Total Mensal],TbPessoas[A partir do mês],\"<=\" & 29,TbPessoas[Até],\">=\"& 29,TbPessoas[Meta:Atividade],LEFT(B15,FIND(\" \",B15,1)-1))","v":0},{"$f":"SUMIFS(TbPessoas[Custo Total Mensal],TbPessoas[A partir do mês],\"<=\" & 30,TbPessoas[Até],\">=\"& 30,TbPessoas[Meta:Atividade],LEFT(B15,FIND(\" \",B15,1)-1))","v":0},{"$f":"SUMIFS(TbPessoas[Custo Total Mensal],TbPessoas[A partir do mês],\"<=\" & 31,TbPessoas[Até],\">=\"& 31,TbPessoas[Meta:Atividade],LEFT(B15,FIND(\" \",B15,1)-1))","v":0},{"$f":"SUMIFS(TbPessoas[Custo Total Mensal],TbPessoas[A partir do mês],\"<=\" & 32,TbPessoas[Até],\">=\"& 32,TbPessoas[Meta:Atividade],LEFT(B15,FIND(\" \",B15,1)-1))","v":0},{"$f":"SUMIFS(TbPessoas[Custo Total Mensal],TbPessoas[A partir do mês],\"<=\" & 33,TbPessoas[Até],\">=\"& 33,TbPessoas[Meta:Atividade],LEFT(B15,FIND(\" \",B15,1)-1))","v":0},{"$f":"SUMIFS(TbPessoas[Custo Total Mensal],TbPessoas[A partir do mês],\"<=\" & 34,TbPessoas[Até],\">=\"& 34,TbPessoas[Meta:Atividade],LEFT(B15,FIND(\" \",B15,1)-1))","v":0},{"$f":"SUMIFS(TbPessoas[Custo Total Mensal],TbPessoas[A partir do mês],\"<=\" & 35,TbPessoas[Até],\">=\"& 35,TbPessoas[Meta:Atividade],LEFT(B15,FIND(\" \",B15,1)-1))","v":0},{"$f":"SUMIFS(TbPessoas[Custo Total Mensal],TbPessoas[A partir do mês],\"<=\" & 36,TbPessoas[Até],\">=\"& 36,TbPessoas[Meta:Atividade],LEFT(B15,FIND(\" \",B15,1)-1))","v":0},{"$f":"SUM(D15:AM15)","v":0}]
[null,null,"Pessoa Jurídica",{"$f":"SUMIFS(TBCompras[Valor Total Item (R$)],TBCompras[Mês do Projeto],\"<=\" & 1,TBCompras[Até],\">=\"& 1,TBCompras[Meta:Atividade],LEFT(B15,FIND(\" \",B15,1)-1),TBCompras[Tipo de Material],\"SERVIÇO\")","v":0},{"$f":"SUMIFS(TBCompras[Valor Total Item (R$)],TBCompras[Mês do Projeto],\"<=\" & 2,TBCompras[Até],\">=\"& 2,TBCompras[Meta:Atividade],LEFT(B15,FIND(\" \",B15,1)-1),TBCompras[Tipo de Material],\"SERVIÇO\")","v":0},{"$f":"SUMIFS(TBCompras[Valor Total Item (R$)],TBCompras[Mês do Projeto],\"<=\" & 3,TBCompras[Até],\">=\"& 3,TBCompras[Meta:Atividade],LEFT(B15,FIND(\" \",B15,1)-1),TBCompras[Tipo de Material],\"SERVIÇO\")","v":0},{"$f":"SUMIFS(TBCompras[Valor Total Item (R$)],TBCompras[Mês do Projeto],\"<=\" & 4,TBCompras[Até],\">=\"& 4,TBCompras[Meta:Atividade],LEFT(B15,FIND(\" \",B15,1)-1),TBCompras[Tipo de Material],\"SERVIÇO\")","v":0},{"$f":"SUMIFS(TBCompras[Valor Total Item (R$)],TBCompras[Mês do Projeto],\"<=\" & 5,TBCompras[Até],\">=\"& 5,TBCompras[Meta:Atividade],LEFT(B15,FIND(\" \",B15,1)-1),TBCompras[Tipo de Material],\"SERVIÇO\")","v":0},{"$f":"SUMIFS(TBCompras[Valor Total Item (R$)],TBCompras[Mês do Projeto],\"<=\" & 6,TBCompras[Até],\">=\"& 6,TBCompras[Meta:Atividade],LEFT(B15,FIND(\" \",B15,1)-1),TBCompras[Tipo de Material],\"SERVIÇO\")","v":0},{"$f":"SUMIFS(TBCompras[Valor Total Item (R$)],TBCompras[Mês do Projeto],\"<=\" & 7,TBCompras[Até],\">=\"& 7,TBCompras[Meta:Atividade],LEFT(B15,FIND(\" \",B15,1)-1),TBCompras[Tipo de Material],\"SERVIÇO\")","v":0},{"$f":"SUMIFS(TBCompras[Valor Total Item (R$)],TBCompras[Mês do Projeto],\"<=\" & 8,TBCompras[Até],\">=\"& 8,TBCompras[Meta:Atividade],LEFT(B15,FIND(\" \",B15,1)-1),TBCompras[Tipo de Material],\"SERVIÇO\")","v":0},{"$f":"SUMIFS(TBCompras[Valor Total Item (R$)],TBCompras[Mês do Projeto],\"<=\" & 9,TBCompras[Até],\">=\"& 9,TBCompras[Meta:Atividade],LEFT(B15,FIND(\" \",B15,1)-1),TBCompras[Tipo de Material],\"SERVIÇO\")","v":0},{"$f":"SUMIFS(TBCompras[Valor Total Item (R$)],TBCompras[Mês do Projeto],\"<=\" & 10,TBCompras[Até],\">=\"& 10,TBCompras[Meta:Atividade],LEFT(B15,FIND(\" \",B15,1)-1),TBCompras[Tipo de Material],\"SERVIÇO\")","v":0},{"$f":"SUMIFS(TBCompras[Valor Total Item (R$)],TBCompras[Mês do Projeto],\"<=\" & 11,TBCompras[Até],\">=\"& 11,TBCompras[Meta:Atividade],LEFT(B15,FIND(\" \",B15,1)-1),TBCompras[Tipo de Material],\"SERVIÇO\")","v":0},{"$f":"SUMIFS(TBCompras[Valor Total Item (R$)],TBCompras[Mês do Projeto],\"<=\" & 12,TBCompras[Até],\">=\"& 12,TBCompras[Meta:Atividade],LEFT(B15,FIND(\" \",B15,1)-1),TBCompras[Tipo de Material],\"SERVIÇO\")","v":0},{"$f":"SUMIFS(TBCompras[Valor Total Item (R$)],TBCompras[Mês do Projeto],\"<=\" & 13,TBCompras[Até],\">=\"& 13,TBCompras[Meta:Atividade],LEFT(B15,FIND(\" \",B15,1)-1),TBCompras[Tipo de Material],\"SERVIÇO\")","v":0},{"$f":"SUMIFS(TBCompras[Valor Total Item (R$)],TBCompras[Mês do Projeto],\"<=\" & 14,TBCompras[Até],\">=\"& 14,TBCompras[Meta:Atividade],LEFT(B15,FIND(\" \",B15,1)-1),TBCompras[Tipo de Material],\"SERVIÇO\")","v":0},{"$f":"SUMIFS(TBCompras[Valor Total Item (R$)],TBCompras[Mês do Projeto],\"<=\" & 15,TBCompras[Até],\">=\"& 15,TBCompras[Meta:Atividade],LEFT(B15,FIND(\" \",B15,1)-1),TBCompras[Tipo de Material],\"SERVIÇO\")","v":0},{"$f":"SUMIFS(TBCompras[Valor Total Item (R$)],TBCompras[Mês do Projeto],\"<=\" & 16,TBCompras[Até],\">=\"& 16,TBCompras[Meta:Atividade],LEFT(B15,FIND(\" \",B15,1)-1),TBCompras[Tipo de Material],\"SERVIÇO\")","v":0},{"$f":"SUMIFS(TBCompras[Valor Total Item (R$)],TBCompras[Mês do Projeto],\"<=\" & 17,TBCompras[Até],\">=\"& 17,TBCompras[Meta:Atividade],LEFT(B15,FIND(\" \",B15,1)-1),TBCompras[Tipo de Material],\"SERVIÇO\")","v":0},{"$f":"SUMIFS(TBCompras[Valor Total Item (R$)],TBCompras[Mês do Projeto],\"<=\" & 18,TBCompras[Até],\">=\"& 18,TBCompras[Meta:Atividade],LEFT(B15,FIND(\" \",B15,1)-1),TBCompras[Tipo de Material],\"SERVIÇO\")","v":0},{"$f":"SUMIFS(TBCompras[Valor Total Item (R$)],TBCompras[Mês do Projeto],\"<=\" & 19,TBCompras[Até],\">=\"& 19,TBCompras[Meta:Atividade],LEFT(B15,FIND(\" \",B15,1)-1),TBCompras[Tipo de Material],\"SERVIÇO\")","v":0},{"$f":"SUMIFS(TBCompras[Valor Total Item (R$)],TBCompras[Mês do Projeto],\"<=\" & 20,TBCompras[Até],\">=\"& 20,TBCompras[Meta:Atividade],LEFT(B15,FIND(\" \",B15,1)-1),TBCompras[Tipo de Material],\"SERVIÇO\")","v":0},{"$f":"SUMIFS(TBCompras[Valor Total Item (R$)],TBCompras[Mês do Projeto],\"<=\" & 21,TBCompras[Até],\">=\"& 21,TBCompras[Meta:Atividade],LEFT(B15,FIND(\" \",B15,1)-1),TBCompras[Tipo de Material],\"SERVIÇO\")","v":0},{"$f":"SUMIFS(TBCompras[Valor Total Item (R$)],TBCompras[Mês do Projeto],\"<=\" & 22,TBCompras[Até],\">=\"& 22,TBCompras[Meta:Atividade],LEFT(B15,FIND(\" \",B15,1)-1),TBCompras[Tipo de Material],\"SERVIÇO\")","v":0},{"$f":"SUMIFS(TBCompras[Valor Total Item (R$)],TBCompras[Mês do Projeto],\"<=\" & 23,TBCompras[Até],\">=\"& 23,TBCompras[Meta:Atividade],LEFT(B15,FIND(\" \",B15,1)-1),TBCompras[Tipo de Material],\"SERVIÇO\")","v":0},{"$f":"SUMIFS(TBCompras[Valor Total Item (R$)],TBCompras[Mês do Projeto],\"<=\" & 24,TBCompras[Até],\">=\"& 24,TBCompras[Meta:Atividade],LEFT(B15,FIND(\" \",B15,1)-1),TBCompras[Tipo de Material],\"SERVIÇO\")","v":0},{"$f":"SUMIFS(TBCompras[Valor Total Item (R$)],TBCompras[Mês do Projeto],\"<=\" & 25,TBCompras[Até],\">=\"& 25,TBCompras[Meta:Atividade],LEFT(B15,FIND(\" \",B15,1)-1),TBCompras[Tipo de Material],\"SERVIÇO\")","v":0},{"$f":"SUMIFS(TBCompras[Valor Total Item (R$)],TBCompras[Mês do Projeto],\"<=\" & 26,TBCompras[Até],\">=\"& 26,TBCompras[Meta:Atividade],LEFT(B15,FIND(\" \",B15,1)-1),TBCompras[Tipo de Material],\"SERVIÇO\")","v":0},{"$f":"SUMIFS(TBCompras[Valor Total Item (R$)],TBCompras[Mês do Projeto],\"<=\" & 27,TBCompras[Até],\">=\"& 27,TBCompras[Meta:Atividade],LEFT(B15,FIND(\" \",B15,1)-1),TBCompras[Tipo de Material],\"SERVIÇO\")","v":0},{"$f":"SUMIFS(TBCompras[Valor Total Item (R$)],TBCompras[Mês do Projeto],\"<=\" & 28,TBCompras[Até],\">=\"& 28,TBCompras[Meta:Atividade],LEFT(B15,FIND(\" \",B15,1)-1),TBCompras[Tipo de Material],\"SERVIÇO\")","v":0},{"$f":"SUMIFS(TBCompras[Valor Total Item (R$)],TBCompras[Mês do Projeto],\"<=\" & 29,TBCompras[Até],\">=\"& 29,TBCompras[Meta:Atividade],LEFT(B15,FIND(\" \",B15,1)-1),TBCompras[Tipo de Material],\"SERVIÇO\")","v":0},{"$f":"SUMIFS(TBCompras[Valor Total Item (R$)],TBCompras[Mês do Projeto],\"<=\" & 30,TBCompras[Até],\">=\"& 30,TBCompras[Meta:Atividade],LEFT(B15,FIND(\" \",B15,1)-1),TBCompras[Tipo de Material],\"SERVIÇO\")","v":0},{"$f":"SUMIFS(TBCompras[Valor Total Item (R$)],TBCompras[Mês do Projeto],\"<=\" & 31,TBCompras[Até],\">=\"& 31,TBCompras[Meta:Atividade],LEFT(B15,FIND(\" \",B15,1)-1),TBCompras[Tipo de Material],\"SERVIÇO\")","v":0},{"$f":"SUMIFS(TBCompras[Valor Total Item (R$)],TBCompras[Mês do Projeto],\"<=\" & 32,TBCompras[Até],\">=\"& 32,TBCompras[Meta:Atividade],LEFT(B15,FIND(\" \",B15,1)-1),TBCompras[Tipo de Material],\"SERVIÇO\")","v":0},{"$f":"SUMIFS(TBCompras[Valor Total Item (R$)],TBCompras[Mês do Projeto],\"<=\" & 33,TBCompras[Até],\">=\"& 33,TBCompras[Meta:Atividade],LEFT(B15,FIND(\" \",B15,1)-1),TBCompras[Tipo de Material],\"SERVIÇO\")","v":0},{"$f":"SUMIFS(TBCompras[Valor Total Item (R$)],TBCompras[Mês do Projeto],\"<=\" & 34,TBCompras[Até],\">=\"& 34,TBCompras[Meta:Atividade],LEFT(B15,FIND(\" \",B15,1)-1),TBCompras[Tipo de Material],\"SERVIÇO\")","v":0},{"$f":"SUMIFS(TBCompras[Valor Total Item (R$)],TBCompras[Mês do Projeto],\"<=\" & 35,TBCompras[Até],\">=\"& 35,TBCompras[Meta:Atividade],LEFT(B15,FIND(\" \",B15,1)-1),TBCompras[Tipo de Material],\"SERVIÇO\")","v":0},{"$f":"SUMIFS(TBCompras[Valor Total Item (R$)],TBCompras[Mês do Projeto],\"<=\" & 36,TBCompras[Até],\">=\"& 36,TBCompras[Meta:Atividade],LEFT(B15,FIND(\" \",B15,1)-1),TBCompras[Tipo de Material],\"SERVIÇO\")","v":0},0]
[null,null,"Passagens",{"$f":"SUMIFS(TbPassagens[Valor Total Passagem],TbPassagens[A partir do mês],\"<=\" & 1,TbPassagens[Até],\">=\"& 1,TbPassagens[Meta:Atividade],LEFT(B15,FIND(\" \",B15,1)-1))","v":0},{"$f":"SUMIFS(TbPassagens[Valor Total Passagem],TbPassagens[A partir do mês],\"<=\" & 2,TbPassagens[Até],\">=\"& 2,TbPassagens[Meta:Atividade],LEFT(B15,FIND(\" \",B15,1)-1))","v":0},{"$f":"SUMIFS(TbPassagens[Valor Total Passagem],TbPassagens[A partir do mês],\"<=\" & 3,TbPassagens[Até],\">=\"& 3,TbPassagens[Meta:Atividade],LEFT(B15,FIND(\" \",B15,1)-1))","v":0},{"$f":"SUMIFS(TbPassagens[Valor Total Passagem],TbPassagens[A partir do mês],\"<=\" & 4,TbPassagens[Até],\">=\"& 4,TbPassagens[Meta:Atividade],LEFT(B15,FIND(\" \",B15,1)-1))","v":0},{"$f":"SUMIFS(TbPassagens[Valor Total Passagem],TbPassagens[A partir do mês],\"<=\" & 5,TbPassagens[Até],\">=\"& 5,TbPassagens[Meta:Atividade],LEFT(B15,FIND(\" \",B15,1)-1))","v":0},{"$f":"SUMIFS(TbPassagens[Valor Total Passagem],TbPassagens[A partir do mês],\"<=\" & 6,TbPassagens[Até],\">=\"& 6,TbPassagens[Meta:Atividade],LEFT(B15,FIND(\" \",B15,1)-1))","v":0},{"$f":"SUMIFS(TbPassagens[Valor Total Passagem],TbPassagens[A partir do mês],\"<=\" & 7,TbPassagens[Até],\">=\"& 7,TbPassagens[Meta:Atividade],LEFT(B15,FIND(\" \",B15,1)-1))","v":0},{"$f":"SUMIFS(TbPassagens[Valor Total Passagem],TbPassagens[A partir do mês],\"<=\" & 8,TbPassagens[Até],\">=\"& 8,TbPassagens[Meta:Atividade],LEFT(B15,FIND(\" \",B15,1)-1))","v":0},{"$f":"SUMIFS(TbPassagens[Valor Total Passagem],TbPassagens[A partir do mês],\"<=\" & 9,TbPassagens[Até],\">=\"& 9,TbPassagens[Meta:Atividade],LEFT(B15,FIND(\" \",B15,1)-1))","v":0},{"$f":"SUMIFS(TbPassagens[Valor Total Passagem],TbPassagens[A partir do mês],\"<=\" & 10,TbPassagens[Até],\">=\"& 10,TbPassagens[Meta:Atividade],LEFT(B15,FIND(\" \",B15,1)-1))","v":0},{"$f":"SUMIFS(TbPassagens[Valor Total Passagem],TbPassagens[A partir do mês],\"<=\" & 11,TbPassagens[Até],\">=\"& 11,TbPassagens[Meta:Atividade],LEFT(B15,FIND(\" \",B15,1)-1))","v":0},{"$f":"SUMIFS(TbPassagens[Valor Total Passagem],TbPassagens[A partir do mês],\"<=\" & 12,TbPassagens[Até],\">=\"& 12,TbPassagens[Meta:Atividade],LEFT(B15,FIND(\" \",B15,1)-1))","v":0},{"$f":"SUMIFS(TbPassagens[Valor Total Passagem],TbPassagens[A partir do mês],\"<=\" & 13,TbPassagens[Até],\">=\"& 13,TbPassagens[Meta:Atividade],LEFT(B15,FIND(\" \",B15,1)-1))","v":0},{"$f":"SUMIFS(TbPassagens[Valor Total Passagem],TbPassagens[A partir do mês],\"<=\" & 14,TbPassagens[Até],\">=\"& 14,TbPassagens[Meta:Atividade],LEFT(B15,FIND(\" \",B15,1)-1))","v":0},{"$f":"SUMIFS(TbPassagens[Valor Total Passagem],TbPassagens[A partir do mês],\"<=\" & 15,TbPassagens[Até],\">=\"& 15,TbPassagens[Meta:Atividade],LEFT(B15,FIND(\" \",B15,1)-1))","v":0},{"$f":"SUMIFS(TbPassagens[Valor Total Passagem],TbPassagens[A partir do mês],\"<=\" & 16,TbPassagens[Até],\">=\"& 16,TbPassagens[Meta:Atividade],LEFT(B15,FIND(\" \",B15,1)-1))","v":0},{"$f":"SUMIFS(TbPassagens[Valor Total Passagem],TbPassagens[A partir do mês],\"<=\" & 17,TbPassagens[Até],\">=\"& 17,TbPassagens[Meta:Atividade],LEFT(B15,FIND(\" \",B15,1)-1))","v":0},{"$f":"SUMIFS(TbPassagens[Valor Total Passagem],TbPassagens[A partir do mês],\"<=\" & 18,TbPassagens[Até],\">=\"& 18,TbPassagens[Meta:Atividade],LEFT(B15,FIND(\" \",B15,1)-1))","v":0},{"$f":"SUMIFS(TbPassagens[Valor Total Passagem],TbPassagens[A partir do mês],\"<=\" & 19,TbPassagens[Até],\">=\"& 19,TbPassagens[Meta:Atividade],LEFT(B15,FIND(\" \",B15,1)-1))","v":0},{"$f":"SUMIFS(TbPassagens[Valor Total Passagem],TbPassagens[A partir do mês],\"<=\" & 20,TbPassagens[Até],\">=\"& 20,TbPassagens[Meta:Atividade],LEFT(B15,FIND(\" \",B15,1)-1))","v":0},{"$f":"SUMIFS(TbPassagens[Valor Total Passagem],TbPassagens[A partir do mês],\"<=\" & 21,TbPassagens[Até],\">=\"& 21,TbPassagens[Meta:Atividade],LEFT(B15,FIND(\" \",B15,1)-1))","v":0},{"$f":"SUMIFS(TbPassagens[Valor Total Passagem],TbPassagens[A partir do mês],\"<=\" & 22,TbPassagens[Até],\">=\"& 22,TbPassagens[Meta:Atividade],LEFT(B15,FIND(\" \",B15,1)-1))","v":0},{"$f":"SUMIFS(TbPassagens[Valor Total Passagem],TbPassagens[A partir do mês],\"<=\" & 23,TbPassagens[Até],\">=\"& 23,TbPassagens[Meta:Atividade],LEFT(B15,FIND(\" \",B15,1)-1))","v":0},{"$f":"SUMIFS(TbPassagens[Valor Total Passagem],TbPassagens[A partir do mês],\"<=\" & 24,TbPassagens[Até],\">=\"& 24,TbPassagens[Meta:Atividade],LEFT(B15,FIND(\" \",B15,1)-1))","v":0},{"$f":"SUMIFS(TbPassagens[Valor Total Passagem],TbPassagens[A partir do mês],\"<=\" & 25,TbPassagens[Até],\">=\"& 25,TbPassagens[Meta:Atividade],LEFT(B15,FIND(\" \",B15,1)-1))","v":0},{"$f":"SUMIFS(TbPassagens[Valor Total Passagem],TbPassagens[A partir do mês],\"<=\" & 26,TbPassagens[Até],\">=\"& 26,TbPassagens[Meta:Atividade],LEFT(B15,FIND(\" \",B15,1)-1))","v":0},{"$f":"SUMIFS(TbPassagens[Valor Total Passagem],TbPassagens[A partir do mês],\"<=\" & 27,TbPassagens[Até],\">=\"& 27,TbPassagens[Meta:Atividade],LEFT(B15,FIND(\" \",B15,1)-1))","v":0},{"$f":"SUMIFS(TbPassagens[Valor Total Passagem],TbPassagens[A partir do mês],\"<=\" & 28,TbPassagens[Até],\">=\"& 28,TbPassagens[Meta:Atividade],LEFT(B15,FIND(\" \",B15,1)-1))","v":0},{"$f":"SUMIFS(TbPassagens[Valor Total Passagem],TbPassagens[A partir do mês],\"<=\" & 29,TbPassagens[Até],\">=\"& 29,TbPassagens[Meta:Atividade],LEFT(B15,FIND(\" \",B15,1)-1))","v":0},{"$f":"SUMIFS(TbPassagens[Valor Total Passagem],TbPassagens[A partir do mês],\"<=\" & 30,TbPassagens[Até],\">=\"& 30,TbPassagens[Meta:Atividade],LEFT(B15,FIND(\" \",B15,1)-1))","v":0},{"$f":"SUMIFS(TbPassagens[Valor Total Passagem],TbPassagens[A partir do mês],\"<=\" & 31,TbPassagens[Até],\">=\"& 31,TbPassagens[Meta:Atividade],LEFT(B15,FIND(\" \",B15,1)-1))","v":0},{"$f":"SUMIFS(TbPassagens[Valor Total Passagem],TbPassagens[A partir do mês],\"<=\" & 32,TbPassagens[Até],\">=\"& 32,TbPassagens[Meta:Atividade],LEFT(B15,FIND(\" \",B15,1)-1))","v":0},{"$f":"SUMIFS(TbPassagens[Valor Total Passagem],TbPassagens[A partir do mês],\"<=\" & 33,TbPassagens[Até],\">=\"& 33,TbPassagens[Meta:Atividade],LEFT(B15,FIND(\" \",B15,1)-1))","v":0},{"$f":"SUMIFS(TbPassagens[Valor Total Passagem],TbPassagens[A partir do mês],\"<=\" & 34,TbPassagens[Até],\">=\"& 34,TbPassagens[Meta:Atividade],LEFT(B15,FIND(\" \",B15,1)-1))","v":0},{"$f":"SUMIFS(TbPassagens[Valor Total Passagem],TbPassagens[A partir do mês],\"<=\" & 35,TbPassagens[Até],\">=\"& 35,TbPassagens[Meta:Atividade],LEFT(B15,FIND(\" \",B15,1)-1))","v":0},{"$f":"SUMIFS(TbPassagens[Valor Total Passagem],TbPassagens[A partir do mês],\"<=\" & 36,TbPassagens[Até],\">=\"& 36,TbPassagens[Meta:Atividade],LEFT(B15,FIND(\" \",B15,1)-1))","v":0},0]
[null,null,"Diárias",{"$f":"SUMIFS(TbPassagens[Valor Total Diária],TbPassagens[A partir do mês],\"<=\" & 1,TbPassagens[Até],\">=\"& 1,TbPassagens[Meta:Atividade],LEFT(B15,FIND(\" \",B15,1)-1))","v":0},{"$f":"SUMIFS(TbPassagens[Valor Total Diária],TbPassagens[A partir do mês],\"<=\" & 2,TbPassagens[Até],\">=\"& 2,TbPassagens[Meta:Atividade],LEFT(B15,FIND(\" \",B15,1)-1))","v":0},{"$f":"SUMIFS(TbPassagens[Valor Total Diária],TbPassagens[A partir do mês],\"<=\" & 3,TbPassagens[Até],\">=\"& 3,TbPassagens[Meta:Atividade],LEFT(B15,FIND(\" \",B15,1)-1))","v":0},{"$f":"SUMIFS(TbPassagens[Valor Total Diária],TbPassagens[A partir do mês],\"<=\" & 4,TbPassagens[Até],\">=\"& 4,TbPassagens[Meta:Atividade],LEFT(B15,FIND(\" \",B15,1)-1))","v":0},{"$f":"SUMIFS(TbPassagens[Valor Total Diária],TbPassagens[A partir do mês],\"<=\" & 5,TbPassagens[Até],\">=\"& 5,TbPassagens[Meta:Atividade],LEFT(B15,FIND(\" \",B15,1)-1))","v":0},{"$f":"SUMIFS(TbPassagens[Valor Total Diária],TbPassagens[A partir do mês],\"<=\" & 6,TbPassagens[Até],\">=\"& 6,TbPassagens[Meta:Atividade],LEFT(B15,FIND(\" \",B15,1)-1))","v":0},{"$f":"SUMIFS(TbPassagens[Valor Total Diária],TbPassagens[A partir do mês],\"<=\" & 7,TbPassagens[Até],\">=\"& 7,TbPassagens[Meta:Atividade],LEFT(B15,FIND(\" \",B15,1)-1))","v":0},{"$f":"SUMIFS(TbPassagens[Valor Total Diária],TbPassagens[A partir do mês],\"<=\" & 8,TbPassagens[Até],\">=\"& 8,TbPassagens[Meta:Atividade],LEFT(B15,FIND(\" \",B15,1)-1))","v":0},{"$f":"SUMIFS(TbPassagens[Valor Total Diária],TbPassagens[A partir do mês],\"<=\" & 9,TbPassagens[Até],\">=\"& 9,TbPassagens[Meta:Atividade],LEFT(B15,FIND(\" \",B15,1)-1))","v":0},{"$f":"SUMIFS(TbPassagens[Valor Total Diária],TbPassagens[A partir do mês],\"<=\" & 10,TbPassagens[Até],\">=\"& 10,TbPassagens[Meta:Atividade],LEFT(B15,FIND(\" \",B15,1)-1))","v":0},{"$f":"SUMIFS(TbPassagens[Valor Total Diária],TbPassagens[A partir do mês],\"<=\" & 11,TbPassagens[Até],\">=\"& 11,TbPassagens[Meta:Atividade],LEFT(B15,FIND(\" \",B15,1)-1))","v":0},{"$f":"SUMIFS(TbPassagens[Valor Total Diária],TbPassagens[A partir do mês],\"<=\" & 12,TbPassagens[Até],\">=\"& 12,TbPassagens[Meta:Atividade],LEFT(B15,FIND(\" \",B15,1)-1))","v":0},{"$f":"SUMIFS(TbPassagens[Valor Total Diária],TbPassagens[A partir do mês],\"<=\" & 13,TbPassagens[Até],\">=\"& 13,TbPassagens[Meta:Atividade],LEFT(B15,FIND(\" \",B15,1)-1))","v":0},{"$f":"SUMIFS(TbPassagens[Valor Total Diária],TbPassagens[A partir do mês],\"<=\" & 14,TbPassagens[Até],\">=\"& 14,TbPassagens[Meta:Atividade],LEFT(B15,FIND(\" \",B15,1)-1))","v":0},{"$f":"SUMIFS(TbPassagens[Valor Total Diária],TbPassagens[A partir do mês],\"<=\" & 15,TbPassagens[Até],\">=\"& 15,TbPassagens[Meta:Atividade],LEFT(B15,FIND(\" \",B15,1)-1))","v":0},{"$f":"SUMIFS(TbPassagens[Valor Total Diária],TbPassagens[A partir do mês],\"<=\" & 16,TbPassagens[Até],\">=\"& 16,TbPassagens[Meta:Atividade],LEFT(B15,FIND(\" \",B15,1)-1))","v":0},{"$f":"SUMIFS(TbPassagens[Valor Total Diária],TbPassagens[A partir do mês],\"<=\" & 17,TbPassagens[Até],\">=\"& 17,TbPassagens[Meta:Atividade],LEFT(B15,FIND(\" \",B15,1)-1))","v":0},{"$f":"SUMIFS(TbPassagens[Valor Total Diária],TbPassagens[A partir do mês],\"<=\" & 18,TbPassagens[Até],\">=\"& 18,TbPassagens[Meta:Atividade],LEFT(B15,FIND(\" \",B15,1)-1))","v":0},{"$f":"SUMIFS(TbPassagens[Valor Total Diária],TbPassagens[A partir do mês],\"<=\" & 19,TbPassagens[Até],\">=\"& 19,TbPassagens[Meta:Atividade],LEFT(B15,FIND(\" \",B15,1)-1))","v":0},{"$f":"SUMIFS(TbPassagens[Valor Total Diária],TbPassagens[A partir do mês],\"<=\" & 20,TbPassagens[Até],\">=\"& 20,TbPassagens[Meta:Atividade],LEFT(B15,FIND(\" \",B15,1)-1))","v":0},{"$f":"SUMIFS(TbPassagens[Valor Total Diária],TbPassagens[A partir do mês],\"<=\" & 21,TbPassagens[Até],\">=\"& 21,TbPassagens[Meta:Atividade],LEFT(B15,FIND(\" \",B15,1)-1))","v":0},{"$f":"SUMIFS(TbPassagens[Valor Total Diária],TbPassagens[A partir do mês],\"<=\" & 22,TbPassagens[Até],\">=\"& 22,TbPassagens[Meta:Atividade],LEFT(B15,FIND(\" \",B15,1)-1))","v":0},{"$f":"SUMIFS(TbPassagens[Valor Total Diária],TbPassagens[A partir do mês],\"<=\" & 23,TbPassagens[Até],\">=\"& 23,TbPassagens[Meta:Atividade],LEFT(B15,FIND(\" \",B15,1)-1))","v":0},{"$f":"SUMIFS(TbPassagens[Valor Total Diária],TbPassagens[A partir do mês],\"<=\" & 24,TbPassagens[Até],\">=\"& 24,TbPassagens[Meta:Atividade],LEFT(B15,FIND(\" \",B15,1)-1))","v":0},{"$f":"SUMIFS(TbPassagens[Valor Total Diária],TbPassagens[A partir do mês],\"<=\" & 25,TbPassagens[Até],\">=\"& 25,TbPassagens[Meta:Atividade],LEFT(B15,FIND(\" \",B15,1)-1))","v":0},{"$f":"SUMIFS(TbPassagens[Valor Total Diária],TbPassagens[A partir do mês],\"<=\" & 26,TbPassagens[Até],\">=\"& 26,TbPassagens[Meta:Atividade],LEFT(B15,FIND(\" \",B15,1)-1))","v":0},{"$f":"SUMIFS(TbPassagens[Valor Total Diária],TbPassagens[A partir do mês],\"<=\" & 27,TbPassagens[Até],\">=\"& 27,TbPassagens[Meta:Atividade],LEFT(B15,FIND(\" \",B15,1)-1))","v":0},{"$f":"SUMIFS(TbPassagens[Valor Total Diária],TbPassagens[A partir do mês],\"<=\" & 28,TbPassagens[Até],\">=\"& 28,TbPassagens[Meta:Atividade],LEFT(B15,FIND(\" \",B15,1)-1))","v":0},{"$f":"SUMIFS(TbPassagens[Valor Total Diária],TbPassagens[A partir do mês],\"<=\" & 29,TbPassagens[Até],\">=\"& 29,TbPassagens[Meta:Atividade],LEFT(B15,FIND(\" \",B15,1)-1))","v":0},{"$f":"SUMIFS(TbPassagens[Valor Total Diária],TbPassagens[A partir do mês],\"<=\" & 30,TbPassagens[Até],\">=\"& 30,TbPassagens[Meta:Atividade],LEFT(B15,FIND(\" \",B15,1)-1))","v":0},{"$f":"SUMIFS(TbPassagens[Valor Total Diária],TbPassagens[A partir do mês],\"<=\" & 31,TbPassagens[Até],\">=\"& 31,TbPassagens[Meta:Atividade],LEFT(B15,FIND(\" \",B15,1)-1))","v":0},{"$f":"SUMIFS(TbPassagens[Valor Total Diária],TbPassagens[A partir do mês],\"<=\" & 32,TbPassagens[Até],\">=\"& 32,TbPassagens[Meta:Atividade],LEFT(B15,FIND(\" \",B15,1)-1))","v":0},{"$f":"SUMIFS(TbPassagens[Valor Total Diária],TbPassagens[A partir do mês],\"<=\" & 33,TbPassagens[Até],\">=\"& 33,TbPassagens[Meta:Atividade],LEFT(B15,FIND(\" \",B15,1)-1))","v":0},{"$f":"SUMIFS(TbPassagens[Valor Total Diária],TbPassagens[A partir do mês],\"<=\" & 34,TbPassagens[Até],\">=\"& 34,TbPassagens[Meta:Atividade],LEFT(B15,FIND(\" \",B15,1)-1))","v":0},{"$f":"SUMIFS(TbPassagens[Valor Total Diária],TbPassagens[A partir do mês],\"<=\" & 35,TbPassagens[Até],\">=\"& 35,TbPassagens[Meta:Atividade],LEFT(B15,FIND(\" \",B15,1)-1))","v":0},{"$f":"SUMIFS(TbPassagens[Valor Total Diária],TbPassagens[A partir do mês],\"<=\" & 36,TbPassagens[Até],\">=\"& 36,TbPassagens[Meta:Atividade],LEFT(B15,FIND(\" \",B15,1)-1))","v":0},0]
[null,null,"Material de Consumo",{"$f":"SUMIFS(TBCompras[Valor Total Item (R$)],TBCompras[Mês do Projeto],\"<=\" & 1,TBCompras[Até],\">=\"& 1,TBCompras[Meta:Atividade],LEFT(B15,FIND(\" \",B15,1)-1),TBCompras[Tipo de Material],\"CONSUMO\")","v":0},{"$f":"SUMIFS(TBCompras[Valor Total Item (R$)],TBCompras[Mês do Projeto],\"<=\" & 2,TBCompras[Até],\">=\"& 2,TBCompras[Meta:Atividade],LEFT(B15,FIND(\" \",B15,1)-1),TBCompras[Tipo de Material],\"CONSUMO\")","v":0},{"$f":"SUMIFS(TBCompras[Valor Total Item (R$)],TBCompras[Mês do Projeto],\"<=\" & 3,TBCompras[Até],\">=\"& 3,TBCompras[Meta:Atividade],LEFT(B15,FIND(\" \",B15,1)-1),TBCompras[Tipo de Material],\"CONSUMO\")","v":0},{"$f":"SUMIFS(TBCompras[Valor Total Item (R$)],TBCompras[Mês do Projeto],\"<=\" & 4,TBCompras[Até],\">=\"& 4,TBCompras[Meta:Atividade],LEFT(B15,FIND(\" \",B15,1)-1),TBCompras[Tipo de Material],\"CONSUMO\")","v":0},{"$f":"SUMIFS(TBCompras[Valor Total Item (R$)],TBCompras[Mês do Projeto],\"<=\" & 5,TBCompras[Até],\">=\"& 5,TBCompras[Meta:Atividade],LEFT(B15,FIND(\" \",B15,1)-1),TBCompras[Tipo de Material],\"CONSUMO\")","v":0},{"$f":"SUMIFS(TBCompras[Valor Total Item (R$)],TBCompras[Mês do Projeto],\"<=\" & 6,TBCompras[Até],\">=\"& 6,TBCompras[Meta:Atividade],LEFT(B15,FIND(\" \",B15,1)-1),TBCompras[Tipo de Material],\"CONSUMO\")","v":0},{"$f":"SUMIFS(TBCompras[Valor Total Item (R$)],TBCompras[Mês do Projeto],\"<=\" & 7,TBCompras[Até],\">=\"& 7,TBCompras[Meta:Atividade],LEFT(B15,FIND(\" \",B15,1)-1),TBCompras[Tipo de Material],\"CONSUMO\")","v":0},{"$f":"SUMIFS(TBCompras[Valor Total Item (R$)],TBCompras[Mês do Projeto],\"<=\" & 8,TBCompras[Até],\">=\"& 8,TBCompras[Meta:Atividade],LEFT(B15,FIND(\" \",B15,1)-1),TBCompras[Tipo de Material],\"CONSUMO\")","v":0},{"$f":"SUMIFS(TBCompras[Valor Total Item (R$)],TBCompras[Mês do Projeto],\"<=\" & 9,TBCompras[Até],\">=\"& 9,TBCompras[Meta:Atividade],LEFT(B15,FIND(\" \",B15,1)-1),TBCompras[Tipo de Material],\"CONSUMO\")","v":0},{"$f":"SUMIFS(TBCompras[Valor Total Item (R$)],TBCompras[Mês do Projeto],\"<=\" & 10,TBCompras[Até],\">=\"& 10,TBCompras[Meta:Atividade],LEFT(B15,FIND(\" \",B15,1)-1),TBCompras[Tipo de Material],\"CONSUMO\")","v":0},{"$f":"SUMIFS(TBCompras[Valor Total Item (R$)],TBCompras[Mês do Projeto],\"<=\" & 11,TBCompras[Até],\">=\"& 11,TBCompras[Meta:Atividade],LEFT(B15,FIND(\" \",B15,1)-1),TBCompras[Tipo de Material],\"CONSUMO\")","v":0},{"$f":"SUMIFS(TBCompras[Valor Total Item (R$)],TBCompras[Mês do Projeto],\"<=\" & 12,TBCompras[Até],\">=\"& 12,TBCompras[Meta:Atividade],LEFT(B15,FIND(\" \",B15,1)-1),TBCompras[Tipo de Material],\"CONSUMO\")","v":0},{"$f":"SUMIFS(TBCompras[Valor Total Item (R$)],TBCompras[Mês do Projeto],\"<=\" & 13,TBCompras[Até],\">=\"& 13,TBCompras[Meta:Atividade],LEFT(B15,FIND(\" \",B15,1)-1),TBCompras[Tipo de Material],\"CONSUMO\")","v":0},{"$f":"SUMIFS(TBCompras[Valor Total Item (R$)],TBCompras[Mês do Projeto],\"<=\" & 14,TBCompras[Até],\">=\"& 14,TBCompras[Meta:Atividade],LEFT(B15,FIND(\" \",B15,1)-1),TBCompras[Tipo de Material],\"CONSUMO\")","v":0},{"$f":"SUMIFS(TBCompras[Valor Total Item (R$)],TBCompras[Mês do Projeto],\"<=\" & 15,TBCompras[Até],\">=\"& 15,TBCompras[Meta:Atividade],LEFT(B15,FIND(\" \",B15,1)-1),TBCompras[Tipo de Material],\"CONSUMO\")","v":0},{"$f":"SUMIFS(TBCompras[Valor Total Item (R$)],TBCompras[Mês do Projeto],\"<=\" & 16,TBCompras[Até],\">=\"& 16,TBCompras[Meta:Atividade],LEFT(B15,FIND(\" \",B15,1)-1),TBCompras[Tipo de Material],\"CONSUMO\")","v":0},{"$f":"SUMIFS(TBCompras[Valor Total Item (R$)],TBCompras[Mês do Projeto],\"<=\" & 17,TBCompras[Até],\">=\"& 17,TBCompras[Meta:Atividade],LEFT(B15,FIND(\" \",B15,1)-1),TBCompras[Tipo de Material],\"CONSUMO\")","v":0},{"$f":"SUMIFS(TBCompras[Valor Total Item (R$)],TBCompras[Mês do Projeto],\"<=\" & 18,TBCompras[Até],\">=\"& 18,TBCompras[Meta:Atividade],LEFT(B15,FIND(\" \",B15,1)-1),TBCompras[Tipo de Material],\"CONSUMO\")","v":0},{"$f":"SUMIFS(TBCompras[Valor Total Item (R$)],TBCompras[Mês do Projeto],\"<=\" & 19,TBCompras[Até],\">=\"& 19,TBCompras[Meta:Atividade],LEFT(B15,FIND(\" \",B15,1)-1),TBCompras[Tipo de Material],\"CONSUMO\")","v":0},{"$f":"SUMIFS(TBCompras[Valor Total Item (R$)],TBCompras[Mês do Projeto],\"<=\" & 20,TBCompras[Até],\">=\"& 20,TBCompras[Meta:Atividade],LEFT(B15,FIND(\" \",B15,1)-1),TBCompras[Tipo de Material],\"CONSUMO\")","v":0},{"$f":"SUMIFS(TBCompras[Valor Total Item (R$)],TBCompras[Mês do Projeto],\"<=\" & 21,TBCompras[Até],\">=\"& 21,TBCompras[Meta:Atividade],LEFT(B15,FIND(\" \",B15,1)-1),TBCompras[Tipo de Material],\"CONSUMO\")","v":0},{"$f":"SUMIFS(TBCompras[Valor Total Item (R$)],TBCompras[Mês do Projeto],\"<=\" & 22,TBCompras[Até],\">=\"& 22,TBCompras[Meta:Atividade],LEFT(B15,FIND(\" \",B15,1)-1),TBCompras[Tipo de Material],\"CONSUMO\")","v":0},{"$f":"SUMIFS(TBCompras[Valor Total Item (R$)],TBCompras[Mês do Projeto],\"<=\" & 23,TBCompras[Até],\">=\"& 23,TBCompras[Meta:Atividade],LEFT(B15,FIND(\" \",B15,1)-1),TBCompras[Tipo de Material],\"CONSUMO\")","v":0},{"$f":"SUMIFS(TBCompras[Valor Total Item (R$)],TBCompras[Mês do Projeto],\"<=\" & 24,TBCompras[Até],\">=\"& 24,TBCompras[Meta:Atividade],LEFT(B15,FIND(\" \",B15,1)-1),TBCompras[Tipo de Material],\"CONSUMO\")","v":0},{"$f":"SUMIFS(TBCompras[Valor Total Item (R$)],TBCompras[Mês do Projeto],\"<=\" & 25,TBCompras[Até],\">=\"& 25,TBCompras[Meta:Atividade],LEFT(B15,FIND(\" \",B15,1)-1),TBCompras[Tipo de Material],\"CONSUMO\")","v":0},{"$f":"SUMIFS(TBCompras[Valor Total Item (R$)],TBCompras[Mês do Projeto],\"<=\" & 26,TBCompras[Até],\">=\"& 26,TBCompras[Meta:Atividade],LEFT(B15,FIND(\" \",B15,1)-1),TBCompras[Tipo de Material],\"CONSUMO\")","v":0},{"$f":"SUMIFS(TBCompras[Valor Total Item (R$)],TBCompras[Mês do Projeto],\"<=\" & 27,TBCompras[Até],\">=\"& 27,TBCompras[Meta:Atividade],LEFT(B15,FIND(\" \",B15,1)-1),TBCompras[Tipo de Material],\"CONSUMO\")","v":0},{"$f":"SUMIFS(TBCompras[Valor Total Item (R$)],TBCompras[Mês do Projeto],\"<=\" & 28,TBCompras[Até],\">=\"& 28,TBCompras[Meta:Atividade],LEFT(B15,FIND(\" \",B15,1)-1),TBCompras[Tipo de Material],\"CONSUMO\")","v":0},{"$f":"SUMIFS(TBCompras[Valor Total Item (R$)],TBCompras[Mês do Projeto],\"<=\" & 29,TBCompras[Até],\">=\"& 29,TBCompras[Meta:Atividade],LEFT(B15,FIND(\" \",B15,1)-1),TBCompras[Tipo de Material],\"CONSUMO\")","v":0},{"$f":"SUMIFS(TBCompras[Valor Total Item (R$)],TBCompras[Mês do Projeto],\"<=\" & 30,TBCompras[Até],\">=\"& 30,TBCompras[Meta:Atividade],LEFT(B15,FIND(\" \",B15,1)-1),TBCompras[Tipo de Material],\"CONSUMO\")","v":0},{"$f":"SUMIFS(TBCompras[Valor Total Item (R$)],TBCompras[Mês do Projeto],\"<=\" & 31,TBCompras[Até],\">=\"& 31,TBCompras[Meta:Atividade],LEFT(B15,FIND(\" \",B15,1)-1),TBCompras[Tipo de Material],\"CONSUMO\")","v":0},{"$f":"SUMIFS(TBCompras[Valor Total Item (R$)],TBCompras[Mês do Projeto],\"<=\" & 32,TBCompras[Até],\">=\"& 32,TBCompras[Meta:Atividade],LEFT(B15,FIND(\" \",B15,1)-1),TBCompras[Tipo de Material],\"CONSUMO\")","v":0},{"$f":"SUMIFS(TBCompras[Valor Total Item (R$)],TBCompras[Mês do Projeto],\"<=\" & 33,TBCompras[Até],\">=\"& 33,TBCompras[Meta:Atividade],LEFT(B15,FIND(\" \",B15,1)-1),TBCompras[Tipo de Material],\"CONSUMO\")","v":0},{"$f":"SUMIFS(TBCompras[Valor Total Item (R$)],TBCompras[Mês do Projeto],\"<=\" & 34,TBCompras[Até],\">=\"& 34,TBCompras[Meta:Atividade],LEFT(B15,FIND(\" \",B15,1)-1),TBCompras[Tipo de Material],\"CONSUMO\")","v":0},{"$f":"SUMIFS(TBCompras[Valor Total Item (R$)],TBCompras[Mês do Projeto],\"<=\" & 35,TBCompras[Até],\">=\"& 35,TBCompras[Meta:Atividade],LEFT(B15,FIND(\" \",B15,1)-1),TBCompras[Tipo de Material],\"CONSUMO\")","v":0},{"$f":"SUMIFS(TBCompras[Valor Total Item (R$)],TBCompras[Mês do Projeto],\"<=\" & 36,TBCompras[Até],\">=\"& 36,TBCompras[Meta:Atividade],LEFT(B15,FIND(\" \",B15,1)-1),TBCompras[Tipo de Material],\"CONSUMO\")","v":0},0]
[null,null,"Equipamentos",{"$f":"SUMIFS(TBCompras[Valor Total Item (R$)],TBCompras[Mês do Projeto],\"<=\" & 1,TBCompras[Até],\">=\"& 1,TBCompras[Meta:Atividade],LEFT(B15,FIND(\" \",B15,1)-1),TBCompras[Tipo de Material],\"EQUIPAMENTO\")","v":0},{"$f":"SUMIFS(TBCompras[Valor Total Item (R$)],TBCompras[Mês do Projeto],\"<=\" & 2,TBCompras[Até],\">=\"& 2,TBCompras[Meta:Atividade],LEFT(B15,FIND(\" \",B15,1)-1),TBCompras[Tipo de Material],\"EQUIPAMENTO\")","v":0},{"$f":"SUMIFS(TBCompras[Valor Total Item (R$)],TBCompras[Mês do Projeto],\"<=\" & 3,TBCompras[Até],\">=\"& 3,TBCompras[Meta:Atividade],LEFT(B15,FIND(\" \",B15,1)-1),TBCompras[Tipo de Material],\"EQUIPAMENTO\")","v":0},{"$f":"SUMIFS(TBCompras[Valor Total Item (R$)],TBCompras[Mês do Projeto],\"<=\" & 4,TBCompras[Até],\">=\"& 4,TBCompras[Meta:Atividade],LEFT(B15,FIND(\" \",B15,1)-1),TBCompras[Tipo de Material],\"EQUIPAMENTO\")","v":0},{"$f":"SUMIFS(TBCompras[Valor Total Item (R$)],TBCompras[Mês do Projeto],\"<=\" & 5,TBCompras[Até],\">=\"& 5,TBCompras[Meta:Atividade],LEFT(B15,FIND(\" \",B15,1)-1),TBCompras[Tipo de Material],\"EQUIPAMENTO\")","v":0},{"$f":"SUMIFS(TBCompras[Valor Total Item (R$)],TBCompras[Mês do Projeto],\"<=\" & 6,TBCompras[Até],\">=\"& 6,TBCompras[Meta:Atividade],LEFT(B15,FIND(\" \",B15,1)-1),TBCompras[Tipo de Material],\"EQUIPAMENTO\")","v":0},{"$f":"SUMIFS(TBCompras[Valor Total Item (R$)],TBCompras[Mês do Projeto],\"<=\" & 7,TBCompras[Até],\">=\"& 7,TBCompras[Meta:Atividade],LEFT(B15,FIND(\" \",B15,1)-1),TBCompras[Tipo de Material],\"EQUIPAMENTO\")","v":0},{"$f":"SUMIFS(TBCompras[Valor Total Item (R$)],TBCompras[Mês do Projeto],\"<=\" & 8,TBCompras[Até],\">=\"& 8,TBCompras[Meta:Atividade],LEFT(B15,FIND(\" \",B15,1)-1),TBCompras[Tipo de Material],\"EQUIPAMENTO\")","v":0},{"$f":"SUMIFS(TBCompras[Valor Total Item (R$)],TBCompras[Mês do Projeto],\"<=\" & 9,TBCompras[Até],\">=\"& 9,TBCompras[Meta:Atividade],LEFT(B15,FIND(\" \",B15,1)-1),TBCompras[Tipo de Material],\"EQUIPAMENTO\")","v":0},{"$f":"SUMIFS(TBCompras[Valor Total Item (R$)],TBCompras[Mês do Projeto],\"<=\" & 10,TBCompras[Até],\">=\"& 10,TBCompras[Meta:Atividade],LEFT(B15,FIND(\" \",B15,1)-1),TBCompras[Tipo de Material],\"EQUIPAMENTO\")","v":0},{"$f":"SUMIFS(TBCompras[Valor Total Item (R$)],TBCompras[Mês do Projeto],\"<=\" & 11,TBCompras[Até],\">=\"& 11,TBCompras[Meta:Atividade],LEFT(B15,FIND(\" \",B15,1)-1),TBCompras[Tipo de Material],\"EQUIPAMENTO\")","v":0},{"$f":"SUMIFS(TBCompras[Valor Total Item (R$)],TBCompras[Mês do Projeto],\"<=\" & 12,TBCompras[Até],\">=\"& 12,TBCompras[Meta:Atividade],LEFT(B15,FIND(\" \",B15,1)-1),TBCompras[Tipo de Material],\"EQUIPAMENTO\")","v":0},{"$f":"SUMIFS(TBCompras[Valor Total Item (R$)],TBCompras[Mês do Projeto],\"<=\" & 13,TBCompras[Até],\">=\"& 13,TBCompras[Meta:Atividade],LEFT(B15,FIND(\" \",B15,1)-1),TBCompras[Tipo de Material],\"EQUIPAMENTO\")","v":0},{"$f":"SUMIFS(TBCompras[Valor Total Item (R$)],TBCompras[Mês do Projeto],\"<=\" & 14,TBCompras[Até],\">=\"& 14,TBCompras[Meta:Atividade],LEFT(B15,FIND(\" \",B15,1)-1),TBCompras[Tipo de Material],\"EQUIPAMENTO\")","v":0},{"$f":"SUMIFS(TBCompras[Valor Total Item (R$)],TBCompras[Mês do Projeto],\"<=\" & 15,TBCompras[Até],\">=\"& 15,TBCompras[Meta:Atividade],LEFT(B15,FIND(\" \",B15,1)-1),TBCompras[Tipo de Material],\"EQUIPAMENTO\")","v":0},{"$f":"SUMIFS(TBCompras[Valor Total Item (R$)],TBCompras[Mês do Projeto],\"<=\" & 16,TBCompras[Até],\">=\"& 16,TBCompras[Meta:Atividade],LEFT(B15,FIND(\" \",B15,1)-1),TBCompras[Tipo de Material],\"EQUIPAMENTO\")","v":0},{"$f":"SUMIFS(TBCompras[Valor Total Item (R$)],TBCompras[Mês do Projeto],\"<=\" & 17,TBCompras[Até],\">=\"& 17,TBCompras[Meta:Atividade],LEFT(B15,FIND(\" \",B15,1)-1),TBCompras[Tipo de Material],\"EQUIPAMENTO\")","v":0},{"$f":"SUMIFS(TBCompras[Valor Total Item (R$)],TBCompras[Mês do Projeto],\"<=\" & 18,TBCompras[Até],\">=\"& 18,TBCompras[Meta:Atividade],LEFT(B15,FIND(\" \",B15,1)-1),TBCompras[Tipo de Material],\"EQUIPAMENTO\")","v":0},{"$f":"SUMIFS(TBCompras[Valor Total Item (R$)],TBCompras[Mês do Projeto],\"<=\" & 19,TBCompras[Até],\">=\"& 19,TBCompras[Meta:Atividade],LEFT(B15,FIND(\" \",B15,1)-1),TBCompras[Tipo de Material],\"EQUIPAMENTO\")","v":0},{"$f":"SUMIFS(TBCompras[Valor Total Item (R$)],TBCompras[Mês do Projeto],\"<=\" & 20,TBCompras[Até],\">=\"& 20,TBCompras[Meta:Atividade],LEFT(B15,FIND(\" \",B15,1)-1),TBCompras[Tipo de Material],\"EQUIPAMENTO\")","v":0},{"$f":"SUMIFS(TBCompras[Valor Total Item (R$)],TBCompras[Mês do Projeto],\"<=\" & 21,TBCompras[Até],\">=\"& 21,TBCompras[Meta:Atividade],LEFT(B15,FIND(\" \",B15,1)-1),TBCompras[Tipo de Material],\"EQUIPAMENTO\")","v":0},{"$f":"SUMIFS(TBCompras[Valor Total Item (R$)],TBCompras[Mês do Projeto],\"<=\" & 22,TBCompras[Até],\">=\"& 22,TBCompras[Meta:Atividade],LEFT(B15,FIND(\" \",B15,1)-1),TBCompras[Tipo de Material],\"EQUIPAMENTO\")","v":0},{"$f":"SUMIFS(TBCompras[Valor Total Item (R$)],TBCompras[Mês do Projeto],\"<=\" & 23,TBCompras[Até],\">=\"& 23,TBCompras[Meta:Atividade],LEFT(B15,FIND(\" \",B15,1)-1),TBCompras[Tipo de Material],\"EQUIPAMENTO\")","v":0},{"$f":"SUMIFS(TBCompras[Valor Total Item (R$)],TBCompras[Mês do Projeto],\"<=\" & 24,TBCompras[Até],\">=\"& 24,TBCompras[Meta:Atividade],LEFT(B15,FIND(\" \",B15,1)-1),TBCompras[Tipo de Material],\"EQUIPAMENTO\")","v":0},{"$f":"SUMIFS(TBCompras[Valor Total Item (R$)],TBCompras[Mês do Projeto],\"<=\" & 25,TBCompras[Até],\">=\"& 25,TBCompras[Meta:Atividade],LEFT(B15,FIND(\" \",B15,1)-1),TBCompras[Tipo de Material],\"EQUIPAMENTO\")","v":0},{"$f":"SUMIFS(TBCompras[Valor Total Item (R$)],TBCompras[Mês do Projeto],\"<=\" & 26,TBCompras[Até],\">=\"& 26,TBCompras[Meta:Atividade],LEFT(B15,FIND(\" \",B15,1)-1),TBCompras[Tipo de Material],\"EQUIPAMENTO\")","v":0},{"$f":"SUMIFS(TBCompras[Valor Total Item (R$)],TBCompras[Mês do Projeto],\"<=\" & 27,TBCompras[Até],\">=\"& 27,TBCompras[Meta:Atividade],LEFT(B15,FIND(\" \",B15,1)-1),TBCompras[Tipo de Material],\"EQUIPAMENTO\")","v":0},{"$f":"SUMIFS(TBCompras[Valor Total Item (R$)],TBCompras[Mês do Projeto],\"<=\" & 28,TBCompras[Até],\">=\"& 28,TBCompras[Meta:Atividade],LEFT(B15,FIND(\" \",B15,1)-1),TBCompras[Tipo de Material],\"EQUIPAMENTO\")","v":0},{"$f":"SUMIFS(TBCompras[Valor Total Item (R$)],TBCompras[Mês do Projeto],\"<=\" & 29,TBCompras[Até],\">=\"& 29,TBCompras[Meta:Atividade],LEFT(B15,FIND(\" \",B15,1)-1),TBCompras[Tipo de Material],\"EQUIPAMENTO\")","v":0},{"$f":"SUMIFS(TBCompras[Valor Total Item (R$)],TBCompras[Mês do Projeto],\"<=\" & 30,TBCompras[Até],\">=\"& 30,TBCompras[Meta:Atividade],LEFT(B15,FIND(\" \",B15,1)-1),TBCompras[Tipo de Material],\"EQUIPAMENTO\")","v":0},{"$f":"SUMIFS(TBCompras[Valor Total Item (R$)],TBCompras[Mês do Projeto],\"<=\" & 31,TBCompras[Até],\">=\"& 31,TBCompras[Meta:Atividade],LEFT(B15,FIND(\" \",B15,1)-1),TBCompras[Tipo de Material],\"EQUIPAMENTO\")","v":0},{"$f":"SUMIFS(TBCompras[Valor Total Item (R$)],TBCompras[Mês do Projeto],\"<=\" & 32,TBCompras[Até],\">=\"& 32,TBCompras[Meta:Atividade],LEFT(B15,FIND(\" \",B15,1)-1),TBCompras[Tipo de Material],\"EQUIPAMENTO\")","v":0},{"$f":"SUMIFS(TBCompras[Valor Total Item (R$)],TBCompras[Mês do Projeto],\"<=\" & 33,TBCompras[Até],\">=\"& 33,TBCompras[Meta:Atividade],LEFT(B15,FIND(\" \",B15,1)-1),TBCompras[Tipo de Material],\"EQUIPAMENTO\")","v":0},{"$f":"SUMIFS(TBCompras[Valor Total Item (R$)],TBCompras[Mês do Projeto],\"<=\" & 34,TBCompras[Até],\">=\"& 34,TBCompras[Meta:Atividade],LEFT(B15,FIND(\" \",B15,1)-1),TBCompras[Tipo de Material],\"EQUIPAMENTO\")","v":0},{"$f":"SUMIFS(TBCompras[Valor Total Item (R$)],TBCompras[Mês do Projeto],\"<=\" & 35,TBCompras[Até],\">=\"& 35,TBCompras[Meta:Atividade],LEFT(B15,FIND(\" \",B15,1)-1),TBCompras[Tipo de Material],\"EQUIPAMENTO\")","v":0},{"$f":"SUMIFS(TBCompras[Valor Total Item (R$)],TBCompras[Mês do Projeto],\"<=\" & 36,TBCompras[Até],\">=\"& 36,TBCompras[Meta:Atividade],LEFT(B15,FIND(\" \",B15,1)-1),TBCompras[Tipo de Material],\"EQUIPAMENTO\")","v":0},0]
[null,null,"Total Atividade 1.2",{"$f":"SUBTOTAL(9,D15:D20)","v":0},0,0,0,0,0,0,0,0,0,0,0,0,0,0,0,0,0,0,0,0,0,0,0,0,0,0,0,0,0,0,0,0,0,0,0,0]
[null,"1.3 - Estabelecer processo de produção e controle de qualidade em escala piloto","Pessoa Física",{"$f":"SUMIFS(TbPessoas[Custo Total Mensal],TbPessoas[A partir do mês],\"<=\" & 1,TbPessoas[Até],\">=\"& 1,TbPessoas[Meta:Atividade],LEFT(B22,FIND(\" \",B22,1)-1))","v":0},{"$f":"SUMIFS(TbPessoas[Custo Total Mensal],TbPessoas[A partir do mês],\"<=\" & 2,TbPessoas[Até],\">=\"& 2,TbPessoas[Meta:Atividade],LEFT(B22,FIND(\" \",B22,1)-1))","v":0},{"$f":"SUMIFS(TbPessoas[Custo Total Mensal],TbPessoas[A partir do mês],\"<=\" & 3,TbPessoas[Até],\">=\"& 3,TbPessoas[Meta:Atividade],LEFT(B22,FIND(\" \",B22,1)-1))","v":0},{"$f":"SUMIFS(TbPessoas[Custo Total Mensal],TbPessoas[A partir do mês],\"<=\" & 4,TbPessoas[Até],\">=\"& 4,TbPessoas[Meta:Atividade],LEFT(B22,FIND(\" \",B22,1)-1))","v":0},{"$f":"SUMIFS(TbPessoas[Custo Total Mensal],TbPessoas[A partir do mês],\"<=\" & 5,TbPessoas[Até],\">=\"& 5,TbPessoas[Meta:Atividade],LEFT(B22,FIND(\" \",B22,1)-1))","v":0},{"$f":"SUMIFS(TbPessoas[Custo Total Mensal],TbPessoas[A partir do mês],\"<=\" & 6,TbPessoas[Até],\">=\"& 6,TbPessoas[Meta:Atividade],LEFT(B22,FIND(\" \",B22,1)-1))","v":0},{"$f":"SUMIFS(TbPessoas[Custo Total Mensal],TbPessoas[A partir do mês],\"<=\" & 7,TbPessoas[Até],\">=\"& 7,TbPessoas[Meta:Atividade],LEFT(B22,FIND(\" \",B22,1)-1))","v":0},{"$f":"SUMIFS(TbPessoas[Custo Total Mensal],TbPessoas[A partir do mês],\"<=\" & 8,TbPessoas[Até],\">=\"& 8,TbPessoas[Meta:Atividade],LEFT(B22,FIND(\" \",B22,1)-1))","v":0},{"$f":"SUMIFS(TbPessoas[Custo Total Mensal],TbPessoas[A partir do mês],\"<=\" & 9,TbPessoas[Até],\">=\"& 9,TbPessoas[Meta:Atividade],LEFT(B22,FIND(\" \",B22,1)-1))","v":0},{"$f":"SUMIFS(TbPessoas[Custo Total Mensal],TbPessoas[A partir do mês],\"<=\" & 10,TbPessoas[Até],\">=\"& 10,TbPessoas[Meta:Atividade],LEFT(B22,FIND(\" \",B22,1)-1))","v":0},{"$f":"SUMIFS(TbPessoas[Custo Total Mensal],TbPessoas[A partir do mês],\"<=\" & 11,TbPessoas[Até],\">=\"& 11,TbPessoas[Meta:Atividade],LEFT(B22,FIND(\" \",B22,1)-1))","v":0},{"$f":"SUMIFS(TbPessoas[Custo Total Mensal],TbPessoas[A partir do mês],\"<=\" & 12,TbPessoas[Até],\">=\"& 12,TbPessoas[Meta:Atividade],LEFT(B22,FIND(\" \",B22,1)-1))","v":0},{"$f":"SUMIFS(TbPessoas[Custo Total Mensal],TbPessoas[A partir do mês],\"<=\" & 13,TbPessoas[Até],\">=\"& 13,TbPessoas[Meta:Atividade],LEFT(B22,FIND(\" \",B22,1)-1))","v":0},{"$f":"SUMIFS(TbPessoas[Custo Total Mensal],TbPessoas[A partir do mês],\"<=\" & 14,TbPessoas[Até],\">=\"& 14,TbPessoas[Meta:Atividade],LEFT(B22,FIND(\" \",B22,1)-1))","v":0},{"$f":"SUMIFS(TbPessoas[Custo Total Mensal],TbPessoas[A partir do mês],\"<=\" & 15,TbPessoas[Até],\">=\"& 15,TbPessoas[Meta:Atividade],LEFT(B22,FIND(\" \",B22,1)-1))","v":0},{"$f":"SUMIFS(TbPessoas[Custo Total Mensal],TbPessoas[A partir do mês],\"<=\" & 16,TbPessoas[Até],\">=\"& 16,TbPessoas[Meta:Atividade],LEFT(B22,FIND(\" \",B22,1)-1))","v":0},{"$f":"SUMIFS(TbPessoas[Custo Total Mensal],TbPessoas[A partir do mês],\"<=\" & 17,TbPessoas[Até],\">=\"& 17,TbPessoas[Meta:Atividade],LEFT(B22,FIND(\" \",B22,1)-1))","v":0},{"$f":"SUMIFS(TbPessoas[Custo Total Mensal],TbPessoas[A partir do mês],\"<=\" & 18,TbPessoas[Até],\">=\"& 18,TbPessoas[Meta:Atividade],LEFT(B22,FIND(\" \",B22,1)-1))","v":0},{"$f":"SUMIFS(TbPessoas[Custo Total Mensal],TbPessoas[A partir do mês],\"<=\" & 19,TbPessoas[Até],\">=\"& 19,TbPessoas[Meta:Atividade],LEFT(B22,FIND(\" \",B22,1)-1))","v":0},{"$f":"SUMIFS(TbPessoas[Custo Total Mensal],TbPessoas[A partir do mês],\"<=\" & 20,TbPessoas[Até],\">=\"& 20,TbPessoas[Meta:Atividade],LEFT(B22,FIND(\" \",B22,1)-1))","v":0},{"$f":"SUMIFS(TbPessoas[Custo Total Mensal],TbPessoas[A partir do mês],\"<=\" & 21,TbPessoas[Até],\">=\"& 21,TbPessoas[Meta:Atividade],LEFT(B22,FIND(\" \",B22,1)-1))","v":0},{"$f":"SUMIFS(TbPessoas[Custo Total Mensal],TbPessoas[A partir do mês],\"<=\" & 22,TbPessoas[Até],\">=\"& 22,TbPessoas[Meta:Atividade],LEFT(B22,FIND(\" \",B22,1)-1))","v":0},{"$f":"SUMIFS(TbPessoas[Custo Total Mensal],TbPessoas[A partir do mês],\"<=\" & 23,TbPessoas[Até],\">=\"& 23,TbPessoas[Meta:Atividade],LEFT(B22,FIND(\" \",B22,1)-1))","v":0},{"$f":"SUMIFS(TbPessoas[Custo Total Mensal],TbPessoas[A partir do mês],\"<=\" & 24,TbPessoas[Até],\">=\"& 24,TbPessoas[Meta:Atividade],LEFT(B22,FIND(\" \",B22,1)-1))","v":0},{"$f":"SUMIFS(TbPessoas[Custo Total Mensal],TbPessoas[A partir do mês],\"<=\" & 25,TbPessoas[Até],\">=\"& 25,TbPessoas[Meta:Atividade],LEFT(B22,FIND(\" \",B22,1)-1))","v":0},{"$f":"SUMIFS(TbPessoas[Custo Total Mensal],TbPessoas[A partir do mês],\"<=\" & 26,TbPessoas[Até],\">=\"& 26,TbPessoas[Meta:Atividade],LEFT(B22,FIND(\" \",B22,1)-1))","v":0},{"$f":"SUMIFS(TbPessoas[Custo Total Mensal],TbPessoas[A partir do mês],\"<=\" & 27,TbPessoas[Até],\">=\"& 27,TbPessoas[Meta:Atividade],LEFT(B22,FIND(\" \",B22,1)-1))","v":0},{"$f":"SUMIFS(TbPessoas[Custo Total Mensal],TbPessoas[A partir do mês],\"<=\" & 28,TbPessoas[Até],\">=\"& 28,TbPessoas[Meta:Atividade],LEFT(B22,FIND(\" \",B22,1)-1))","v":0},{"$f":"SUMIFS(TbPessoas[Custo Total Mensal],TbPessoas[A partir do mês],\"<=\" & 29,TbPessoas[Até],\">=\"& 29,TbPessoas[Meta:Atividade],LEFT(B22,FIND(\" \",B22,1)-1))","v":0},{"$f":"SUMIFS(TbPessoas[Custo Total Mensal],TbPessoas[A partir do mês],\"<=\" & 30,TbPessoas[Até],\">=\"& 30,TbPessoas[Meta:Atividade],LEFT(B22,FIND(\" \",B22,1)-1))","v":0},{"$f":"SUMIFS(TbPessoas[Custo Total Mensal],TbPessoas[A partir do mês],\"<=\" & 31,TbPessoas[Até],\">=\"& 31,TbPessoas[Meta:Atividade],LEFT(B22,FIND(\" \",B22,1)-1))","v":0},{"$f":"SUMIFS(TbPessoas[Custo Total Mensal],TbPessoas[A partir do mês],\"<=\" & 32,TbPessoas[Até],\">=\"& 32,TbPessoas[Meta:Atividade],LEFT(B22,FIND(\" \",B22,1)-1))","v":0},{"$f":"SUMIFS(TbPessoas[Custo Total Mensal],TbPessoas[A partir do mês],\"<=\" & 33,TbPessoas[Até],\">=\"& 33,TbPessoas[Meta:Atividade],LEFT(B22,FIND(\" \",B22,1)-1))","v":0},{"$f":"SUMIFS(TbPessoas[Custo Total Mensal],TbPessoas[A partir do mês],\"<=\" & 34,TbPessoas[Até],\">=\"& 34,TbPessoas[Meta:Atividade],LEFT(B22,FIND(\" \",B22,1)-1))","v":0},{"$f":"SUMIFS(TbPessoas[Custo Total Mensal],TbPessoas[A partir do mês],\"<=\" & 35,TbPessoas[Até],\">=\"& 35,TbPessoas[Meta:Atividade],LEFT(B22,FIND(\" \",B22,1)-1))","v":0},{"$f":"SUMIFS(TbPessoas[Custo Total Mensal],TbPessoas[A partir do mês],\"<=\" & 36,TbPessoas[Até],\">=\"& 36,TbPessoas[Meta:Atividade],LEFT(B22,FIND(\" \",B22,1)-1))","v":0},{"$f":"SUM(D22:AM22)","v":0}]
[null,null,"Pessoa Jurídica",{"$f":"SUMIFS(TBCompras[Valor Total Item (R$)],TBCompras[Mês do Projeto],\"<=\" & 1,TBCompras[Até],\">=\"& 1,TBCompras[Meta:Atividade],LEFT(B22,FIND(\" \",B22,1)-1),TBCompras[Tipo de Material],\"SERVIÇO\")","v":0},{"$f":"SUMIFS(TBCompras[Valor Total Item (R$)],TBCompras[Mês do Projeto],\"<=\" & 2,TBCompras[Até],\">=\"& 2,TBCompras[Meta:Atividade],LEFT(B22,FIND(\" \",B22,1)-1),TBCompras[Tipo de Material],\"SERVIÇO\")","v":0},{"$f":"SUMIFS(TBCompras[Valor Total Item (R$)],TBCompras[Mês do Projeto],\"<=\" & 3,TBCompras[Até],\">=\"& 3,TBCompras[Meta:Atividade],LEFT(B22,FIND(\" \",B22,1)-1),TBCompras[Tipo de Material],\"SERVIÇO\")","v":0},{"$f":"SUMIFS(TBCompras[Valor Total Item (R$)],TBCompras[Mês do Projeto],\"<=\" & 4,TBCompras[Até],\">=\"& 4,TBCompras[Meta:Atividade],LEFT(B22,FIND(\" \",B22,1)-1),TBCompras[Tipo de Material],\"SERVIÇO\")","v":0},{"$f":"SUMIFS(TBCompras[Valor Total Item (R$)],TBCompras[Mês do Projeto],\"<=\" & 5,TBCompras[Até],\">=\"& 5,TBCompras[Meta:Atividade],LEFT(B22,FIND(\" \",B22,1)-1),TBCompras[Tipo de Material],\"SERVIÇO\")","v":0},{"$f":"SUMIFS(TBCompras[Valor Total Item (R$)],TBCompras[Mês do Projeto],\"<=\" & 6,TBCompras[Até],\">=\"& 6,TBCompras[Meta:Atividade],LEFT(B22,FIND(\" \",B22,1)-1),TBCompras[Tipo de Material],\"SERVIÇO\")","v":0},{"$f":"SUMIFS(TBCompras[Valor Total Item (R$)],TBCompras[Mês do Projeto],\"<=\" & 7,TBCompras[Até],\">=\"& 7,TBCompras[Meta:Atividade],LEFT(B22,FIND(\" \",B22,1)-1),TBCompras[Tipo de Material],\"SERVIÇO\")","v":0},{"$f":"SUMIFS(TBCompras[Valor Total Item (R$)],TBCompras[Mês do Projeto],\"<=\" & 8,TBCompras[Até],\">=\"& 8,TBCompras[Meta:Atividade],LEFT(B22,FIND(\" \",B22,1)-1),TBCompras[Tipo de Material],\"SERVIÇO\")","v":0},{"$f":"SUMIFS(TBCompras[Valor Total Item (R$)],TBCompras[Mês do Projeto],\"<=\" & 9,TBCompras[Até],\">=\"& 9,TBCompras[Meta:Atividade],LEFT(B22,FIND(\" \",B22,1)-1),TBCompras[Tipo de Material],\"SERVIÇO\")","v":0},{"$f":"SUMIFS(TBCompras[Valor Total Item (R$)],TBCompras[Mês do Projeto],\"<=\" & 10,TBCompras[Até],\">=\"& 10,TBCompras[Meta:Atividade],LEFT(B22,FIND(\" \",B22,1)-1),TBCompras[Tipo de Material],\"SERVIÇO\")","v":0},{"$f":"SUMIFS(TBCompras[Valor Total Item (R$)],TBCompras[Mês do Projeto],\"<=\" & 11,TBCompras[Até],\">=\"& 11,TBCompras[Meta:Atividade],LEFT(B22,FIND(\" \",B22,1)-1),TBCompras[Tipo de Material],\"SERVIÇO\")","v":0},{"$f":"SUMIFS(TBCompras[Valor Total Item (R$)],TBCompras[Mês do Projeto],\"<=\" & 12,TBCompras[Até],\">=\"& 12,TBCompras[Meta:Atividade],LEFT(B22,FIND(\" \",B22,1)-1),TBCompras[Tipo de Material],\"SERVIÇO\")","v":0},{"$f":"SUMIFS(TBCompras[Valor Total Item (R$)],TBCompras[Mês do Projeto],\"<=\" & 13,TBCompras[Até],\">=\"& 13,TBCompras[Meta:Atividade],LEFT(B22,FIND(\" \",B22,1)-1),TBCompras[Tipo de Material],\"SERVIÇO\")","v":0},{"$f":"SUMIFS(TBCompras[Valor Total Item (R$)],TBCompras[Mês do Projeto],\"<=\" & 14,TBCompras[Até],\">=\"& 14,TBCompras[Meta:Atividade],LEFT(B22,FIND(\" \",B22,1)-1),TBCompras[Tipo de Material],\"SERVIÇO\")","v":0},{"$f":"SUMIFS(TBCompras[Valor Total Item (R$)],TBCompras[Mês do Projeto],\"<=\" & 15,TBCompras[Até],\">=\"& 15,TBCompras[Meta:Atividade],LEFT(B22,FIND(\" \",B22,1)-1),TBCompras[Tipo de Material],\"SERVIÇO\")","v":0},{"$f":"SUMIFS(TBCompras[Valor Total Item (R$)],TBCompras[Mês do Projeto],\"<=\" & 16,TBCompras[Até],\">=\"& 16,TBCompras[Meta:Atividade],LEFT(B22,FIND(\" \",B22,1)-1),TBCompras[Tipo de Material],\"SERVIÇO\")","v":0},{"$f":"SUMIFS(TBCompras[Valor Total Item (R$)],TBCompras[Mês do Projeto],\"<=\" & 17,TBCompras[Até],\">=\"& 17,TBCompras[Meta:Atividade],LEFT(B22,FIND(\" \",B22,1)-1),TBCompras[Tipo de Material],\"SERVIÇO\")","v":0},{"$f":"SUMIFS(TBCompras[Valor Total Item (R$)],TBCompras[Mês do Projeto],\"<=\" & 18,TBCompras[Até],\">=\"& 18,TBCompras[Meta:Atividade],LEFT(B22,FIND(\" \",B22,1)-1),TBCompras[Tipo de Material],\"SERVIÇO\")","v":0},{"$f":"SUMIFS(TBCompras[Valor Total Item (R$)],TBCompras[Mês do Projeto],\"<=\" & 19,TBCompras[Até],\">=\"& 19,TBCompras[Meta:Atividade],LEFT(B22,FIND(\" \",B22,1)-1),TBCompras[Tipo de Material],\"SERVIÇO\")","v":0},{"$f":"SUMIFS(TBCompras[Valor Total Item (R$)],TBCompras[Mês do Projeto],\"<=\" & 20,TBCompras[Até],\">=\"& 20,TBCompras[Meta:Atividade],LEFT(B22,FIND(\" \",B22,1)-1),TBCompras[Tipo de Material],\"SERVIÇO\")","v":0},{"$f":"SUMIFS(TBCompras[Valor Total Item (R$)],TBCompras[Mês do Projeto],\"<=\" & 21,TBCompras[Até],\">=\"& 21,TBCompras[Meta:Atividade],LEFT(B22,FIND(\" \",B22,1)-1),TBCompras[Tipo de Material],\"SERVIÇO\")","v":0},{"$f":"SUMIFS(TBCompras[Valor Total Item (R$)],TBCompras[Mês do Projeto],\"<=\" & 22,TBCompras[Até],\">=\"& 22,TBCompras[Meta:Atividade],LEFT(B22,FIND(\" \",B22,1)-1),TBCompras[Tipo de Material],\"SERVIÇO\")","v":0},{"$f":"SUMIFS(TBCompras[Valor Total Item (R$)],TBCompras[Mês do Projeto],\"<=\" & 23,TBCompras[Até],\">=\"& 23,TBCompras[Meta:Atividade],LEFT(B22,FIND(\" \",B22,1)-1),TBCompras[Tipo de Material],\"SERVIÇO\")","v":0},{"$f":"SUMIFS(TBCompras[Valor Total Item (R$)],TBCompras[Mês do Projeto],\"<=\" & 24,TBCompras[Até],\">=\"& 24,TBCompras[Meta:Atividade],LEFT(B22,FIND(\" \",B22,1)-1),TBCompras[Tipo de Material],\"SERVIÇO\")","v":0},{"$f":"SUMIFS(TBCompras[Valor Total Item (R$)],TBCompras[Mês do Projeto],\"<=\" & 25,TBCompras[Até],\">=\"& 25,TBCompras[Meta:Atividade],LEFT(B22,FIND(\" \",B22,1)-1),TBCompras[Tipo de Material],\"SERVIÇO\")","v":0},{"$f":"SUMIFS(TBCompras[Valor Total Item (R$)],TBCompras[Mês do Projeto],\"<=\" & 26,TBCompras[Até],\">=\"& 26,TBCompras[Meta:Atividade],LEFT(B22,FIND(\" \",B22,1)-1),TBCompras[Tipo de Material],\"SERVIÇO\")","v":0},{"$f":"SUMIFS(TBCompras[Valor Total Item (R$)],TBCompras[Mês do Projeto],\"<=\" & 27,TBCompras[Até],\">=\"& 27,TBCompras[Meta:Atividade],LEFT(B22,FIND(\" \",B22,1)-1),TBCompras[Tipo de Material],\"SERVIÇO\")","v":0},{"$f":"SUMIFS(TBCompras[Valor Total Item (R$)],TBCompras[Mês do Projeto],\"<=\" & 28,TBCompras[Até],\">=\"& 28,TBCompras[Meta:Atividade],LEFT(B22,FIND(\" \",B22,1)-1),TBCompras[Tipo de Material],\"SERVIÇO\")","v":0},{"$f":"SUMIFS(TBCompras[Valor Total Item (R$)],TBCompras[Mês do Projeto],\"<=\" & 29,TBCompras[Até],\">=\"& 29,TBCompras[Meta:Atividade],LEFT(B22,FIND(\" \",B22,1)-1),TBCompras[Tipo de Material],\"SERVIÇO\")","v":0},{"$f":"SUMIFS(TBCompras[Valor Total Item (R$)],TBCompras[Mês do Projeto],\"<=\" & 30,TBCompras[Até],\">=\"& 30,TBCompras[Meta:Atividade],LEFT(B22,FIND(\" \",B22,1)-1),TBCompras[Tipo de Material],\"SERVIÇO\")","v":0},{"$f":"SUMIFS(TBCompras[Valor Total Item (R$)],TBCompras[Mês do Projeto],\"<=\" & 31,TBCompras[Até],\">=\"& 31,TBCompras[Meta:Atividade],LEFT(B22,FIND(\" \",B22,1)-1),TBCompras[Tipo de Material],\"SERVIÇO\")","v":0},{"$f":"SUMIFS(TBCompras[Valor Total Item (R$)],TBCompras[Mês do Projeto],\"<=\" & 32,TBCompras[Até],\">=\"& 32,TBCompras[Meta:Atividade],LEFT(B22,FIND(\" \",B22,1)-1),TBCompras[Tipo de Material],\"SERVIÇO\")","v":0},{"$f":"SUMIFS(TBCompras[Valor Total Item (R$)],TBCompras[Mês do Projeto],\"<=\" & 33,TBCompras[Até],\">=\"& 33,TBCompras[Meta:Atividade],LEFT(B22,FIND(\" \",B22,1)-1),TBCompras[Tipo de Material],\"SERVIÇO\")","v":0},{"$f":"SUMIFS(TBCompras[Valor Total Item (R$)],TBCompras[Mês do Projeto],\"<=\" & 34,TBCompras[Até],\">=\"& 34,TBCompras[Meta:Atividade],LEFT(B22,FIND(\" \",B22,1)-1),TBCompras[Tipo de Material],\"SERVIÇO\")","v":0},{"$f":"SUMIFS(TBCompras[Valor Total Item (R$)],TBCompras[Mês do Projeto],\"<=\" & 35,TBCompras[Até],\">=\"& 35,TBCompras[Meta:Atividade],LEFT(B22,FIND(\" \",B22,1)-1),TBCompras[Tipo de Material],\"SERVIÇO\")","v":0},{"$f":"SUMIFS(TBCompras[Valor Total Item (R$)],TBCompras[Mês do Projeto],\"<=\" & 36,TBCompras[Até],\">=\"& 36,TBCompras[Meta:Atividade],LEFT(B22,FIND(\" \",B22,1)-1),TBCompras[Tipo de Material],\"SERVIÇO\")","v":0},0]
[null,null,"Passagens",{"$f":"SUMIFS(TbPassagens[Valor Total Passagem],TbPassagens[A partir do mês],\"<=\" & 1,TbPassagens[Até],\">=\"& 1,TbPassagens[Meta:Atividade],LEFT(B22,FIND(\" \",B22,1)-1))","v":0},{"$f":"SUMIFS(TbPassagens[Valor Total Passagem],TbPassagens[A partir do mês],\"<=\" & 2,TbPassagens[Até],\">=\"& 2,TbPassagens[Meta:Atividade],LEFT(B22,FIND(\" \",B22,1)-1))","v":0},{"$f":"SUMIFS(TbPassagens[Valor Total Passagem],TbPassagens[A partir do mês],\"<=\" & 3,TbPassagens[Até],\">=\"& 3,TbPassagens[Meta:Atividade],LEFT(B22,FIND(\" \",B22,1)-1))","v":0},{"$f":"SUMIFS(TbPassagens[Valor Total Passagem],TbPassagens[A partir do mês],\"<=\" & 4,TbPassagens[Até],\">=\"& 4,TbPassagens[Meta:Atividade],LEFT(B22,FIND(\" \",B22,1)-1))","v":0},{"$f":"SUMIFS(TbPassagens[Valor Total Passagem],TbPassagens[A partir do mês],\"<=\" & 5,TbPassagens[Até],\">=\"& 5,TbPassagens[Meta:Atividade],LEFT(B22,FIND(\" \",B22,1)-1))","v":0},{"$f":"SUMIFS(TbPassagens[Valor Total Passagem],TbPassagens[A partir do mês],\"<=\" & 6,TbPassagens[Até],\">=\"& 6,TbPassagens[Meta:Atividade],LEFT(B22,FIND(\" \",B22,1)-1))","v":0},{"$f":"SUMIFS(TbPassagens[Valor Total Passagem],TbPassagens[A partir do mês],\"<=\" & 7,TbPassagens[Até],\">=\"& 7,TbPassagens[Meta:Atividade],LEFT(B22,FIND(\" \",B22,1)-1))","v":0},{"$f":"SUMIFS(TbPassagens[Valor Total Passagem],TbPassagens[A partir do mês],\"<=\" & 8,TbPassagens[Até],\">=\"& 8,TbPassagens[Meta:Atividade],LEFT(B22,FIND(\" \",B22,1)-1))","v":0},{"$f":"SUMIFS(TbPassagens[Valor Total Passagem],TbPassagens[A partir do mês],\"<=\" & 9,TbPassagens[Até],\">=\"& 9,TbPassagens[Meta:Atividade],LEFT(B22,FIND(\" \",B22,1)-1))","v":0},{"$f":"SUMIFS(TbPassagens[Valor Total Passagem],TbPassagens[A partir do mês],\"<=\" & 10,TbPassagens[Até],\">=\"& 10,TbPassagens[Meta:Atividade],LEFT(B22,FIND(\" \",B22,1)-1))","v":0},{"$f":"SUMIFS(TbPassagens[Valor Total Passagem],TbPassagens[A partir do mês],\"<=\" & 11,TbPassagens[Até],\">=\"& 11,TbPassagens[Meta:Atividade],LEFT(B22,FIND(\" \",B22,1)-1))","v":0},{"$f":"SUMIFS(TbPassagens[Valor Total Passagem],TbPassagens[A partir do mês],\"<=\" & 12,TbPassagens[Até],\">=\"& 12,TbPassagens[Meta:Atividade],LEFT(B22,FIND(\" \",B22,1)-1))","v":0},{"$f":"SUMIFS(TbPassagens[Valor Total Passagem],TbPassagens[A partir do mês],\"<=\" & 13,TbPassagens[Até],\">=\"& 13,TbPassagens[Meta:Atividade],LEFT(B22,FIND(\" \",B22,1)-1))","v":0},{"$f":"SUMIFS(TbPassagens[Valor Total Passagem],TbPassagens[A partir do mês],\"<=\" & 14,TbPassagens[Até],\">=\"& 14,TbPassagens[Meta:Atividade],LEFT(B22,FIND(\" \",B22,1)-1))","v":0},{"$f":"SUMIFS(TbPassagens[Valor Total Passagem],TbPassagens[A partir do mês],\"<=\" & 15,TbPassagens[Até],\">=\"& 15,TbPassagens[Meta:Atividade],LEFT(B22,FIND(\" \",B22,1)-1))","v":0},{"$f":"SUMIFS(TbPassagens[Valor Total Passagem],TbPassagens[A partir do mês],\"<=\" & 16,TbPassagens[Até],\">=\"& 16,TbPassagens[Meta:Atividade],LEFT(B22,FIND(\" \",B22,1)-1))","v":0},{"$f":"SUMIFS(TbPassagens[Valor Total Passagem],TbPassagens[A partir do mês],\"<=\" & 17,TbPassagens[Até],\">=\"& 17,TbPassagens[Meta:Atividade],LEFT(B22,FIND(\" \",B22,1)-1))","v":0},{"$f":"SUMIFS(TbPassagens[Valor Total Passagem],TbPassagens[A partir do mês],\"<=\" & 18,TbPassagens[Até],\">=\"& 18,TbPassagens[Meta:Atividade],LEFT(B22,FIND(\" \",B22,1)-1))","v":0},{"$f":"SUMIFS(TbPassagens[Valor Total Passagem],TbPassagens[A partir do mês],\"<=\" & 19,TbPassagens[Até],\">=\"& 19,TbPassagens[Meta:Atividade],LEFT(B22,FIND(\" \",B22,1)-1))","v":0},{"$f":"SUMIFS(TbPassagens[Valor Total Passagem],TbPassagens[A partir do mês],\"<=\" & 20,TbPassagens[Até],\">=\"& 20,TbPassagens[Meta:Atividade],LEFT(B22,FIND(\" \",B22,1)-1))","v":0},{"$f":"SUMIFS(TbPassagens[Valor Total Passagem],TbPassagens[A partir do mês],\"<=\" & 21,TbPassagens[Até],\">=\"& 21,TbPassagens[Meta:Atividade],LEFT(B22,FIND(\" \",B22,1)-1))","v":0},{"$f":"SUMIFS(TbPassagens[Valor Total Passagem],TbPassagens[A partir do mês],\"<=\" & 22,TbPassagens[Até],\">=\"& 22,TbPassagens[Meta:Atividade],LEFT(B22,FIND(\" \",B22,1)-1))","v":0},{"$f":"SUMIFS(TbPassagens[Valor Total Passagem],TbPassagens[A partir do mês],\"<=\" & 23,TbPassagens[Até],\">=\"& 23,TbPassagens[Meta:Atividade],LEFT(B22,FIND(\" \",B22,1)-1))","v":0},{"$f":"SUMIFS(TbPassagens[Valor Total Passagem],TbPassagens[A partir do mês],\"<=\" & 24,TbPassagens[Até],\">=\"& 24,TbPassagens[Meta:Atividade],LEFT(B22,FIND(\" \",B22,1)-1))","v":0},{"$f":"SUMIFS(TbPassagens[Valor Total Passagem],TbPassagens[A partir do mês],\"<=\" & 25,TbPassagens[Até],\">=\"& 25,TbPassagens[Meta:Atividade],LEFT(B22,FIND(\" \",B22,1)-1))","v":0},{"$f":"SUMIFS(TbPassagens[Valor Total Passagem],TbPassagens[A partir do mês],\"<=\" & 26,TbPassagens[Até],\">=\"& 26,TbPassagens[Meta:Atividade],LEFT(B22,FIND(\" \",B22,1)-1))","v":0},{"$f":"SUMIFS(TbPassagens[Valor Total Passagem],TbPassagens[A partir do mês],\"<=\" & 27,TbPassagens[Até],\">=\"& 27,TbPassagens[Meta:Atividade],LEFT(B22,FIND(\" \",B22,1)-1))","v":0},{"$f":"SUMIFS(TbPassagens[Valor Total Passagem],TbPassagens[A partir do mês],\"<=\" & 28,TbPassagens[Até],\">=\"& 28,TbPassagens[Meta:Atividade],LEFT(B22,FIND(\" \",B22,1)-1))","v":0},{"$f":"SUMIFS(TbPassagens[Valor Total Passagem],TbPassagens[A partir do mês],\"<=\" & 29,TbPassagens[Até],\">=\"& 29,TbPassagens[Meta:Atividade],LEFT(B22,FIND(\" \",B22,1)-1))","v":0},{"$f":"SUMIFS(TbPassagens[Valor Total Passagem],TbPassagens[A partir do mês],\"<=\" & 30,TbPassagens[Até],\">=\"& 30,TbPassagens[Meta:Atividade],LEFT(B22,FIND(\" \",B22,1)-1))","v":0},{"$f":"SUMIFS(TbPassagens[Valor Total Passagem],TbPassagens[A partir do mês],\"<=\" & 31,TbPassagens[Até],\">=\"& 31,TbPassagens[Meta:Atividade],LEFT(B22,FIND(\" \",B22,1)-1))","v":0},{"$f":"SUMIFS(TbPassagens[Valor Total Passagem],TbPassagens[A partir do mês],\"<=\" & 32,TbPassagens[Até],\">=\"& 32,TbPassagens[Meta:Atividade],LEFT(B22,FIND(\" \",B22,1)-1))","v":0},{"$f":"SUMIFS(TbPassagens[Valor Total Passagem],TbPassagens[A partir do mês],\"<=\" & 33,TbPassagens[Até],\">=\"& 33,TbPassagens[Meta:Atividade],LEFT(B22,FIND(\" \",B22,1)-1))","v":0},{"$f":"SUMIFS(TbPassagens[Valor Total Passagem],TbPassagens[A partir do mês],\"<=\" & 34,TbPassagens[Até],\">=\"& 34,TbPassagens[Meta:Atividade],LEFT(B22,FIND(\" \",B22,1)-1))","v":0},{"$f":"SUMIFS(TbPassagens[Valor Total Passagem],TbPassagens[A partir do mês],\"<=\" & 35,TbPassagens[Até],\">=\"& 35,TbPassagens[Meta:Atividade],LEFT(B22,FIND(\" \",B22,1)-1))","v":0},{"$f":"SUMIFS(TbPassagens[Valor Total Passagem],TbPassagens[A partir do mês],\"<=\" & 36,TbPassagens[Até],\">=\"& 36,TbPassagens[Meta:Atividade],LEFT(B22,FIND(\" \",B22,1)-1))","v":0},0]
[null,null,"Diárias",{"$f":"SUMIFS(TbPassagens[Valor Total Diária],TbPassagens[A partir do mês],\"<=\" & 1,TbPassagens[Até],\">=\"& 1,TbPassagens[Meta:Atividade],LEFT(B22,FIND(\" \",B22,1)-1))","v":0},{"$f":"SUMIFS(TbPassagens[Valor Total Diária],TbPassagens[A partir do mês],\"<=\" & 2,TbPassagens[Até],\">=\"& 2,TbPassagens[Meta:Atividade],LEFT(B22,FIND(\" \",B22,1)-1))","v":0},{"$f":"SUMIFS(TbPassagens[Valor Total Diária],TbPassagens[A partir do mês],\"<=\" & 3,TbPassagens[Até],\">=\"& 3,TbPassagens[Meta:Atividade],LEFT(B22,FIND(\" \",B22,1)-1))","v":0},{"$f":"SUMIFS(TbPassagens[Valor Total Diária],TbPassagens[A partir do mês],\"<=\" & 4,TbPassagens[Até],\">=\"& 4,TbPassagens[Meta:Atividade],LEFT(B22,FIND(\" \",B22,1)-1))","v":0},{"$f":"SUMIFS(TbPassagens[Valor Total Diária],TbPassagens[A partir do mês],\"<=\" & 5,TbPassagens[Até],\">=\"& 5,TbPassagens[Meta:Atividade],LEFT(B22,FIND(\" \",B22,1)-1))","v":0},{"$f":"SUMIFS(TbPassagens[Valor Total Diária],TbPassagens[A partir do mês],\"<=\" & 6,TbPassagens[Até],\">=\"& 6,TbPassagens[Meta:Atividade],LEFT(B22,FIND(\" \",B22,1)-1))","v":0},{"$f":"SUMIFS(TbPassagens[Valor Total Diária],TbPassagens[A partir do mês],\"<=\" & 7,TbPassagens[Até],\">=\"& 7,TbPassagens[Meta:Atividade],LEFT(B22,FIND(\" \",B22,1)-1))","v":0},{"$f":"SUMIFS(TbPassagens[Valor Total Diária],TbPassagens[A partir do mês],\"<=\" & 8,TbPassagens[Até],\">=\"& 8,TbPassagens[Meta:Atividade],LEFT(B22,FIND(\" \",B22,1)-1))","v":0},{"$f":"SUMIFS(TbPassagens[Valor Total Diária],TbPassagens[A partir do mês],\"<=\" & 9,TbPassagens[Até],\">=\"& 9,TbPassagens[Meta:Atividade],LEFT(B22,FIND(\" \",B22,1)-1))","v":0},{"$f":"SUMIFS(TbPassagens[Valor Total Diária],TbPassagens[A partir do mês],\"<=\" & 10,TbPassagens[Até],\">=\"& 10,TbPassagens[Meta:Atividade],LEFT(B22,FIND(\" \",B22,1)-1))","v":0},{"$f":"SUMIFS(TbPassagens[Valor Total Diária],TbPassagens[A partir do mês],\"<=\" & 11,TbPassagens[Até],\">=\"& 11,TbPassagens[Meta:Atividade],LEFT(B22,FIND(\" \",B22,1)-1))","v":0},{"$f":"SUMIFS(TbPassagens[Valor Total Diária],TbPassagens[A partir do mês],\"<=\" & 12,TbPassagens[Até],\">=\"& 12,TbPassagens[Meta:Atividade],LEFT(B22,FIND(\" \",B22,1)-1))","v":0},{"$f":"SUMIFS(TbPassagens[Valor Total Diária],TbPassagens[A partir do mês],\"<=\" & 13,TbPassagens[Até],\">=\"& 13,TbPassagens[Meta:Atividade],LEFT(B22,FIND(\" \",B22,1)-1))","v":0},{"$f":"SUMIFS(TbPassagens[Valor Total Diária],TbPassagens[A partir do mês],\"<=\" & 14,TbPassagens[Até],\">=\"& 14,TbPassagens[Meta:Atividade],LEFT(B22,FIND(\" \",B22,1)-1))","v":0},{"$f":"SUMIFS(TbPassagens[Valor Total Diária],TbPassagens[A partir do mês],\"<=\" & 15,TbPassagens[Até],\">=\"& 15,TbPassagens[Meta:Atividade],LEFT(B22,FIND(\" \",B22,1)-1))","v":0},{"$f":"SUMIFS(TbPassagens[Valor Total Diária],TbPassagens[A partir do mês],\"<=\" & 16,TbPassagens[Até],\">=\"& 16,TbPassagens[Meta:Atividade],LEFT(B22,FIND(\" \",B22,1)-1))","v":0},{"$f":"SUMIFS(TbPassagens[Valor Total Diária],TbPassagens[A partir do mês],\"<=\" & 17,TbPassagens[Até],\">=\"& 17,TbPassagens[Meta:Atividade],LEFT(B22,FIND(\" \",B22,1)-1))","v":0},{"$f":"SUMIFS(TbPassagens[Valor Total Diária],TbPassagens[A partir do mês],\"<=\" & 18,TbPassagens[Até],\">=\"& 18,TbPassagens[Meta:Atividade],LEFT(B22,FIND(\" \",B22,1)-1))","v":0},{"$f":"SUMIFS(TbPassagens[Valor Total Diária],TbPassagens[A partir do mês],\"<=\" & 19,TbPassagens[Até],\">=\"& 19,TbPassagens[Meta:Atividade],LEFT(B22,FIND(\" \",B22,1)-1))","v":0},{"$f":"SUMIFS(TbPassagens[Valor Total Diária],TbPassagens[A partir do mês],\"<=\" & 20,TbPassagens[Até],\">=\"& 20,TbPassagens[Meta:Atividade],LEFT(B22,FIND(\" \",B22,1)-1))","v":0},{"$f":"SUMIFS(TbPassagens[Valor Total Diária],TbPassagens[A partir do mês],\"<=\" & 21,TbPassagens[Até],\">=\"& 21,TbPassagens[Meta:Atividade],LEFT(B22,FIND(\" \",B22,1)-1))","v":0},{"$f":"SUMIFS(TbPassagens[Valor Total Diária],TbPassagens[A partir do mês],\"<=\" & 22,TbPassagens[Até],\">=\"& 22,TbPassagens[Meta:Atividade],LEFT(B22,FIND(\" \",B22,1)-1))","v":0},{"$f":"SUMIFS(TbPassagens[Valor Total Diária],TbPassagens[A partir do mês],\"<=\" & 23,TbPassagens[Até],\">=\"& 23,TbPassagens[Meta:Atividade],LEFT(B22,FIND(\" \",B22,1)-1))","v":0},{"$f":"SUMIFS(TbPassagens[Valor Total Diária],TbPassagens[A partir do mês],\"<=\" & 24,TbPassagens[Até],\">=\"& 24,TbPassagens[Meta:Atividade],LEFT(B22,FIND(\" \",B22,1)-1))","v":0},{"$f":"SUMIFS(TbPassagens[Valor Total Diária],TbPassagens[A partir do mês],\"<=\" & 25,TbPassagens[Até],\">=\"& 25,TbPassagens[Meta:Atividade],LEFT(B22,FIND(\" \",B22,1)-1))","v":0},{"$f":"SUMIFS(TbPassagens[Valor Total Diária],TbPassagens[A partir do mês],\"<=\" & 26,TbPassagens[Até],\">=\"& 26,TbPassagens[Meta:Atividade],LEFT(B22,FIND(\" \",B22,1)-1))","v":0},{"$f":"SUMIFS(TbPassagens[Valor Total Diária],TbPassagens[A partir do mês],\"<=\" & 27,TbPassagens[Até],\">=\"& 27,TbPassagens[Meta:Atividade],LEFT(B22,FIND(\" \",B22,1)-1))","v":0},{"$f":"SUMIFS(TbPassagens[Valor Total Diária],TbPassagens[A partir do mês],\"<=\" & 28,TbPassagens[Até],\">=\"& 28,TbPassagens[Meta:Atividade],LEFT(B22,FIND(\" \",B22,1)-1))","v":0},{"$f":"SUMIFS(TbPassagens[Valor Total Diária],TbPassagens[A partir do mês],\"<=\" & 29,TbPassagens[Até],\">=\"& 29,TbPassagens[Meta:Atividade],LEFT(B22,FIND(\" \",B22,1)-1))","v":0},{"$f":"SUMIFS(TbPassagens[Valor Total Diária],TbPassagens[A partir do mês],\"<=\" & 30,TbPassagens[Até],\">=\"& 30,TbPassagens[Meta:Atividade],LEFT(B22,FIND(\" \",B22,1)-1))","v":0},{"$f":"SUMIFS(TbPassagens[Valor Total Diária],TbPassagens[A partir do mês],\"<=\" & 31,TbPassagens[Até],\">=\"& 31,TbPassagens[Meta:Atividade],LEFT(B22,FIND(\" \",B22,1)-1))","v":0},{"$f":"SUMIFS(TbPassagens[Valor Total Diária],TbPassagens[A partir do mês],\"<=\" & 32,TbPassagens[Até],\">=\"& 32,TbPassagens[Meta:Atividade],LEFT(B22,FIND(\" \",B22,1)-1))","v":0},{"$f":"SUMIFS(TbPassagens[Valor Total Diária],TbPassagens[A partir do mês],\"<=\" & 33,TbPassagens[Até],\">=\"& 33,TbPassagens[Meta:Atividade],LEFT(B22,FIND(\" \",B22,1)-1))","v":0},{"$f":"SUMIFS(TbPassagens[Valor Total Diária],TbPassagens[A partir do mês],\"<=\" & 34,TbPassagens[Até],\">=\"& 34,TbPassagens[Meta:Atividade],LEFT(B22,FIND(\" \",B22,1)-1))","v":0},{"$f":"SUMIFS(TbPassagens[Valor Total Diária],TbPassagens[A partir do mês],\"<=\" & 35,TbPassagens[Até],\">=\"& 35,TbPassagens[Meta:Atividade],LEFT(B22,FIND(\" \",B22,1)-1))","v":0},{"$f":"SUMIFS(TbPassagens[Valor Total Diária],TbPassagens[A partir do mês],\"<=\" & 36,TbPassagens[Até],\">=\"& 36,TbPassagens[Meta:Atividade],LEFT(B22,FIND(\" \",B22,1)-1))","v":0},0]
[null,null,"Material de Consumo",{"$f":"SUMIFS(TBCompras[Valor Total Item (R$)],TBCompras[Mês do Projeto],\"<=\" & 1,TBCompras[Até],\">=\"& 1,TBCompras[Meta:Atividade],LEFT(B22,FIND(\" \",B22,1)-1),TBCompras[Tipo de Material],\"CONSUMO\")","v":0},{"$f":"SUMIFS(TBCompras[Valor Total Item (R$)],TBCompras[Mês do Projeto],\"<=\" & 2,TBCompras[Até],\">=\"& 2,TBCompras[Meta:Atividade],LEFT(B22,FIND(\" \",B22,1)-1),TBCompras[Tipo de Material],\"CONSUMO\")","v":0},{"$f":"SUMIFS(TBCompras[Valor Total Item (R$)],TBCompras[Mês do Projeto],\"<=\" & 3,TBCompras[Até],\">=\"& 3,TBCompras[Meta:Atividade],LEFT(B22,FIND(\" \",B22,1)-1),TBCompras[Tipo de Material],\"CONSUMO\")","v":0},{"$f":"SUMIFS(TBCompras[Valor Total Item (R$)],TBCompras[Mês do Projeto],\"<=\" & 4,TBCompras[Até],\">=\"& 4,TBCompras[Meta:Atividade],LEFT(B22,FIND(\" \",B22,1)-1),TBCompras[Tipo de Material],\"CONSUMO\")","v":0},{"$f":"SUMIFS(TBCompras[Valor Total Item (R$)],TBCompras[Mês do Projeto],\"<=\" & 5,TBCompras[Até],\">=\"& 5,TBCompras[Meta:Atividade],LEFT(B22,FIND(\" \",B22,1)-1),TBCompras[Tipo de Material],\"CONSUMO\")","v":0},{"$f":"SUMIFS(TBCompras[Valor Total Item (R$)],TBCompras[Mês do Projeto],\"<=\" & 6,TBCompras[Até],\">=\"& 6,TBCompras[Meta:Atividade],LEFT(B22,FIND(\" \",B22,1)-1),TBCompras[Tipo de Material],\"CONSUMO\")","v":0},{"$f":"SUMIFS(TBCompras[Valor Total Item (R$)],TBCompras[Mês do Projeto],\"<=\" & 7,TBCompras[Até],\">=\"& 7,TBCompras[Meta:Atividade],LEFT(B22,FIND(\" \",B22,1)-1),TBCompras[Tipo de Material],\"CONSUMO\")","v":0},{"$f":"SUMIFS(TBCompras[Valor Total Item (R$)],TBCompras[Mês do Projeto],\"<=\" & 8,TBCompras[Até],\">=\"& 8,TBCompras[Meta:Atividade],LEFT(B22,FIND(\" \",B22,1)-1),TBCompras[Tipo de Material],\"CONSUMO\")","v":0},{"$f":"SUMIFS(TBCompras[Valor Total Item (R$)],TBCompras[Mês do Projeto],\"<=\" & 9,TBCompras[Até],\">=\"& 9,TBCompras[Meta:Atividade],LEFT(B22,FIND(\" \",B22,1)-1),TBCompras[Tipo de Material],\"CONSUMO\")","v":0},{"$f":"SUMIFS(TBCompras[Valor Total Item (R$)],TBCompras[Mês do Projeto],\"<=\" & 10,TBCompras[Até],\">=\"& 10,TBCompras[Meta:Atividade],LEFT(B22,FIND(\" \",B22,1)-1),TBCompras[Tipo de Material],\"CONSUMO\")","v":0},{"$f":"SUMIFS(TBCompras[Valor Total Item (R$)],TBCompras[Mês do Projeto],\"<=\" & 11,TBCompras[Até],\">=\"& 11,TBCompras[Meta:Atividade],LEFT(B22,FIND(\" \",B22,1)-1),TBCompras[Tipo de Material],\"CONSUMO\")","v":0},{"$f":"SUMIFS(TBCompras[Valor Total Item (R$)],TBCompras[Mês do Projeto],\"<=\" & 12,TBCompras[Até],\">=\"& 12,TBCompras[Meta:Atividade],LEFT(B22,FIND(\" \",B22,1)-1),TBCompras[Tipo de Material],\"CONSUMO\")","v":0},{"$f":"SUMIFS(TBCompras[Valor Total Item (R$)],TBCompras[Mês do Projeto],\"<=\" & 13,TBCompras[Até],\">=\"& 13,TBCompras[Meta:Atividade],LEFT(B22,FIND(\" \",B22,1)-1),TBCompras[Tipo de Material],\"CONSUMO\")","v":0},{"$f":"SUMIFS(TBCompras[Valor Total Item (R$)],TBCompras[Mês do Projeto],\"<=\" & 14,TBCompras[Até],\">=\"& 14,TBCompras[Meta:Atividade],LEFT(B22,FIND(\" \",B22,1)-1),TBCompras[Tipo de Material],\"CONSUMO\")","v":0},{"$f":"SUMIFS(TBCompras[Valor Total Item (R$)],TBCompras[Mês do Projeto],\"<=\" & 15,TBCompras[Até],\">=\"& 15,TBCompras[Meta:Atividade],LEFT(B22,FIND(\" \",B22,1)-1),TBCompras[Tipo de Material],\"CONSUMO\")","v":0},{"$f":"SUMIFS(TBCompras[Valor Total Item (R$)],TBCompras[Mês do Projeto],\"<=\" & 16,TBCompras[Até],\">=\"& 16,TBCompras[Meta:Atividade],LEFT(B22,FIND(\" \",B22,1)-1),TBCompras[Tipo de Material],\"CONSUMO\")","v":0},{"$f":"SUMIFS(TBCompras[Valor Total Item (R$)],TBCompras[Mês do Projeto],\"<=\" & 17,TBCompras[Até],\">=\"& 17,TBCompras[Meta:Atividade],LEFT(B22,FIND(\" \",B22,1)-1),TBCompras[Tipo de Material],\"CONSUMO\")","v":0},{"$f":"SUMIFS(TBCompras[Valor Total Item (R$)],TBCompras[Mês do Projeto],\"<=\" & 18,TBCompras[Até],\">=\"& 18,TBCompras[Meta:Atividade],LEFT(B22,FIND(\" \",B22,1)-1),TBCompras[Tipo de Material],\"CONSUMO\")","v":0},{"$f":"SUMIFS(TBCompras[Valor Total Item (R$)],TBCompras[Mês do Projeto],\"<=\" & 19,TBCompras[Até],\">=\"& 19,TBCompras[Meta:Atividade],LEFT(B22,FIND(\" \",B22,1)-1),TBCompras[Tipo de Material],\"CONSUMO\")","v":0},{"$f":"SUMIFS(TBCompras[Valor Total Item (R$)],TBCompras[Mês do Projeto],\"<=\" & 20,TBCompras[Até],\">=\"& 20,TBCompras[Meta:Atividade],LEFT(B22,FIND(\" \",B22,1)-1),TBCompras[Tipo de Material],\"CONSUMO\")","v":0},{"$f":"SUMIFS(TBCompras[Valor Total Item (R$)],TBCompras[Mês do Projeto],\"<=\" & 21,TBCompras[Até],\">=\"& 21,TBCompras[Meta:Atividade],LEFT(B22,FIND(\" \",B22,1)-1),TBCompras[Tipo de Material],\"CONSUMO\")","v":0},{"$f":"SUMIFS(TBCompras[Valor Total Item (R$)],TBCompras[Mês do Projeto],\"<=\" & 22,TBCompras[Até],\">=\"& 22,TBCompras[Meta:Atividade],LEFT(B22,FIND(\" \",B22,1)-1),TBCompras[Tipo de Material],\"CONSUMO\")","v":0},{"$f":"SUMIFS(TBCompras[Valor Total Item (R$)],TBCompras[Mês do Projeto],\"<=\" & 23,TBCompras[Até],\">=\"& 23,TBCompras[Meta:Atividade],LEFT(B22,FIND(\" \",B22,1)-1),TBCompras[Tipo de Material],\"CONSUMO\")","v":0},{"$f":"SUMIFS(TBCompras[Valor Total Item (R$)],TBCompras[Mês do Projeto],\"<=\" & 24,TBCompras[Até],\">=\"& 24,TBCompras[Meta:Atividade],LEFT(B22,FIND(\" \",B22,1)-1),TBCompras[Tipo de Material],\"CONSUMO\")","v":0},{"$f":"SUMIFS(TBCompras[Valor Total Item (R$)],TBCompras[Mês do Projeto],\"<=\" & 25,TBCompras[Até],\">=\"& 25,TBCompras[Meta:Atividade],LEFT(B22,FIND(\" \",B22,1)-1),TBCompras[Tipo de Material],\"CONSUMO\")","v":0},{"$f":"SUMIFS(TBCompras[Valor Total Item (R$)],TBCompras[Mês do Projeto],\"<=\" & 26,TBCompras[Até],\">=\"& 26,TBCompras[Meta:Atividade],LEFT(B22,FIND(\" \",B22,1)-1),TBCompras[Tipo de Material],\"CONSUMO\")","v":0},{"$f":"SUMIFS(TBCompras[Valor Total Item (R$)],TBCompras[Mês do Projeto],\"<=\" & 27,TBCompras[Até],\">=\"& 27,TBCompras[Meta:Atividade],LEFT(B22,FIND(\" \",B22,1)-1),TBCompras[Tipo de Material],\"CONSUMO\")","v":0},{"$f":"SUMIFS(TBCompras[Valor Total Item (R$)],TBCompras[Mês do Projeto],\"<=\" & 28,TBCompras[Até],\">=\"& 28,TBCompras[Meta:Atividade],LEFT(B22,FIND(\" \",B22,1)-1),TBCompras[Tipo de Material],\"CONSUMO\")","v":0},{"$f":"SUMIFS(TBCompras[Valor Total Item (R$)],TBCompras[Mês do Projeto],\"<=\" & 29,TBCompras[Até],\">=\"& 29,TBCompras[Meta:Atividade],LEFT(B22,FIND(\" \",B22,1)-1),TBCompras[Tipo de Material],\"CONSUMO\")","v":0},{"$f":"SUMIFS(TBCompras[Valor Total Item (R$)],TBCompras[Mês do Projeto],\"<=\" & 30,TBCompras[Até],\">=\"& 30,TBCompras[Meta:Atividade],LEFT(B22,FIND(\" \",B22,1)-1),TBCompras[Tipo de Material],\"CONSUMO\")","v":0},{"$f":"SUMIFS(TBCompras[Valor Total Item (R$)],TBCompras[Mês do Projeto],\"<=\" & 31,TBCompras[Até],\">=\"& 31,TBCompras[Meta:Atividade],LEFT(B22,FIND(\" \",B22,1)-1),TBCompras[Tipo de Material],\"CONSUMO\")","v":0},{"$f":"SUMIFS(TBCompras[Valor Total Item (R$)],TBCompras[Mês do Projeto],\"<=\" & 32,TBCompras[Até],\">=\"& 32,TBCompras[Meta:Atividade],LEFT(B22,FIND(\" \",B22,1)-1),TBCompras[Tipo de Material],\"CONSUMO\")","v":0},{"$f":"SUMIFS(TBCompras[Valor Total Item (R$)],TBCompras[Mês do Projeto],\"<=\" & 33,TBCompras[Até],\">=\"& 33,TBCompras[Meta:Atividade],LEFT(B22,FIND(\" \",B22,1)-1),TBCompras[Tipo de Material],\"CONSUMO\")","v":0},{"$f":"SUMIFS(TBCompras[Valor Total Item (R$)],TBCompras[Mês do Projeto],\"<=\" & 34,TBCompras[Até],\">=\"& 34,TBCompras[Meta:Atividade],LEFT(B22,FIND(\" \",B22,1)-1),TBCompras[Tipo de Material],\"CONSUMO\")","v":0},{"$f":"SUMIFS(TBCompras[Valor Total Item (R$)],TBCompras[Mês do Projeto],\"<=\" & 35,TBCompras[Até],\">=\"& 35,TBCompras[Meta:Atividade],LEFT(B22,FIND(\" \",B22,1)-1),TBCompras[Tipo de Material],\"CONSUMO\")","v":0},{"$f":"SUMIFS(TBCompras[Valor Total Item (R$)],TBCompras[Mês do Projeto],\"<=\" & 36,TBCompras[Até],\">=\"& 36,TBCompras[Meta:Atividade],LEFT(B22,FIND(\" \",B22,1)-1),TBCompras[Tipo de Material],\"CONSUMO\")","v":0},0]
[null,null,"Equipamentos",{"$f":"SUMIFS(TBCompras[Valor Total Item (R$)],TBCompras[Mês do Projeto],\"<=\" & 1,TBCompras[Até],\">=\"& 1,TBCompras[Meta:Atividade],LEFT(B22,FIND(\" \",B22,1)-1),TBCompras[Tipo de Material],\"EQUIPAMENTO\")","v":0},{"$f":"SUMIFS(TBCompras[Valor Total Item (R$)],TBCompras[Mês do Projeto],\"<=\" & 2,TBCompras[Até],\">=\"& 2,TBCompras[Meta:Atividade],LEFT(B22,FIND(\" \",B22,1)-1),TBCompras[Tipo de Material],\"EQUIPAMENTO\")","v":0},{"$f":"SUMIFS(TBCompras[Valor Total Item (R$)],TBCompras[Mês do Projeto],\"<=\" & 3,TBCompras[Até],\">=\"& 3,TBCompras[Meta:Atividade],LEFT(B22,FIND(\" \",B22,1)-1),TBCompras[Tipo de Material],\"EQUIPAMENTO\")","v":0},{"$f":"SUMIFS(TBCompras[Valor Total Item (R$)],TBCompras[Mês do Projeto],\"<=\" & 4,TBCompras[Até],\">=\"& 4,TBCompras[Meta:Atividade],LEFT(B22,FIND(\" \",B22,1)-1),TBCompras[Tipo de Material],\"EQUIPAMENTO\")","v":0},{"$f":"SUMIFS(TBCompras[Valor Total Item (R$)],TBCompras[Mês do Projeto],\"<=\" & 5,TBCompras[Até],\">=\"& 5,TBCompras[Meta:Atividade],LEFT(B22,FIND(\" \",B22,1)-1),TBCompras[Tipo de Material],\"EQUIPAMENTO\")","v":0},{"$f":"SUMIFS(TBCompras[Valor Total Item (R$)],TBCompras[Mês do Projeto],\"<=\" & 6,TBCompras[Até],\">=\"& 6,TBCompras[Meta:Atividade],LEFT(B22,FIND(\" \",B22,1)-1),TBCompras[Tipo de Material],\"EQUIPAMENTO\")","v":0},{"$f":"SUMIFS(TBCompras[Valor Total Item (R$)],TBCompras[Mês do Projeto],\"<=\" & 7,TBCompras[Até],\">=\"& 7,TBCompras[Meta:Atividade],LEFT(B22,FIND(\" \",B22,1)-1),TBCompras[Tipo de Material],\"EQUIPAMENTO\")","v":0},{"$f":"SUMIFS(TBCompras[Valor Total Item (R$)],TBCompras[Mês do Projeto],\"<=\" & 8,TBCompras[Até],\">=\"& 8,TBCompras[Meta:Atividade],LEFT(B22,FIND(\" \",B22,1)-1),TBCompras[Tipo de Material],\"EQUIPAMENTO\")","v":0},{"$f":"SUMIFS(TBCompras[Valor Total Item (R$)],TBCompras[Mês do Projeto],\"<=\" & 9,TBCompras[Até],\">=\"& 9,TBCompras[Meta:Atividade],LEFT(B22,FIND(\" \",B22,1)-1),TBCompras[Tipo de Material],\"EQUIPAMENTO\")","v":0},{"$f":"SUMIFS(TBCompras[Valor Total Item (R$)],TBCompras[Mês do Projeto],\"<=\" & 10,TBCompras[Até],\">=\"& 10,TBCompras[Meta:Atividade],LEFT(B22,FIND(\" \",B22,1)-1),TBCompras[Tipo de Material],\"EQUIPAMENTO\")","v":0},{"$f":"SUMIFS(TBCompras[Valor Total Item (R$)],TBCompras[Mês do Projeto],\"<=\" & 11,TBCompras[Até],\">=\"& 11,TBCompras[Meta:Atividade],LEFT(B22,FIND(\" \",B22,1)-1),TBCompras[Tipo de Material],\"EQUIPAMENTO\")","v":0},{"$f":"SUMIFS(TBCompras[Valor Total Item (R$)],TBCompras[Mês do Projeto],\"<=\" & 12,TBCompras[Até],\">=\"& 12,TBCompras[Meta:Atividade],LEFT(B22,FIND(\" \",B22,1)-1),TBCompras[Tipo de Material],\"EQUIPAMENTO\")","v":0},{"$f":"SUMIFS(TBCompras[Valor Total Item (R$)],TBCompras[Mês do Projeto],\"<=\" & 13,TBCompras[Até],\">=\"& 13,TBCompras[Meta:Atividade],LEFT(B22,FIND(\" \",B22,1)-1),TBCompras[Tipo de Material],\"EQUIPAMENTO\")","v":0},{"$f":"SUMIFS(TBCompras[Valor Total Item (R$)],TBCompras[Mês do Projeto],\"<=\" & 14,TBCompras[Até],\">=\"& 14,TBCompras[Meta:Atividade],LEFT(B22,FIND(\" \",B22,1)-1),TBCompras[Tipo de Material],\"EQUIPAMENTO\")","v":0},{"$f":"SUMIFS(TBCompras[Valor Total Item (R$)],TBCompras[Mês do Projeto],\"<=\" & 15,TBCompras[Até],\">=\"& 15,TBCompras[Meta:Atividade],LEFT(B22,FIND(\" \",B22,1)-1),TBCompras[Tipo de Material],\"EQUIPAMENTO\")","v":0},{"$f":"SUMIFS(TBCompras[Valor Total Item (R$)],TBCompras[Mês do Projeto],\"<=\" & 16,TBCompras[Até],\">=\"& 16,TBCompras[Meta:Atividade],LEFT(B22,FIND(\" \",B22,1)-1),TBCompras[Tipo de Material],\"EQUIPAMENTO\")","v":0},{"$f":"SUMIFS(TBCompras[Valor Total Item (R$)],TBCompras[Mês do Projeto],\"<=\" & 17,TBCompras[Até],\">=\"& 17,TBCompras[Meta:Atividade],LEFT(B22,FIND(\" \",B22,1)-1),TBCompras[Tipo de Material],\"EQUIPAMENTO\")","v":0},{"$f":"SUMIFS(TBCompras[Valor Total Item (R$)],TBCompras[Mês do Projeto],\"<=\" & 18,TBCompras[Até],\">=\"& 18,TBCompras[Meta:Atividade],LEFT(B22,FIND(\" \",B22,1)-1),TBCompras[Tipo de Material],\"EQUIPAMENTO\")","v":0},{"$f":"SUMIFS(TBCompras[Valor Total Item (R$)],TBCompras[Mês do Projeto],\"<=\" & 19,TBCompras[Até],\">=\"& 19,TBCompras[Meta:Atividade],LEFT(B22,FIND(\" \",B22,1)-1),TBCompras[Tipo de Material],\"EQUIPAMENTO\")","v":0},{"$f":"SUMIFS(TBCompras[Valor Total Item (R$)],TBCompras[Mês do Projeto],\"<=\" & 20,TBCompras[Até],\">=\"& 20,TBCompras[Meta:Atividade],LEFT(B22,FIND(\" \",B22,1)-1),TBCompras[Tipo de Material],\"EQUIPAMENTO\")","v":0},{"$f":"SUMIFS(TBCompras[Valor Total Item (R$)],TBCompras[Mês do Projeto],\"<=\" & 21,TBCompras[Até],\">=\"& 21,TBCompras[Meta:Atividade],LEFT(B22,FIND(\" \",B22,1)-1),TBCompras[Tipo de Material],\"EQUIPAMENTO\")","v":0},{"$f":"SUMIFS(TBCompras[Valor Total Item (R$)],TBCompras[Mês do Projeto],\"<=\" & 22,TBCompras[Até],\">=\"& 22,TBCompras[Meta:Atividade],LEFT(B22,FIND(\" \",B22,1)-1),TBCompras[Tipo de Material],\"EQUIPAMENTO\")","v":0},{"$f":"SUMIFS(TBCompras[Valor Total Item (R$)],TBCompras[Mês do Projeto],\"<=\" & 23,TBCompras[Até],\">=\"& 23,TBCompras[Meta:Atividade],LEFT(B22,FIND(\" \",B22,1)-1),TBCompras[Tipo de Material],\"EQUIPAMENTO\")","v":0},{"$f":"SUMIFS(TBCompras[Valor Total Item (R$)],TBCompras[Mês do Projeto],\"<=\" & 24,TBCompras[Até],\">=\"& 24,TBCompras[Meta:Atividade],LEFT(B22,FIND(\" \",B22,1)-1),TBCompras[Tipo de Material],\"EQUIPAMENTO\")","v":0},{"$f":"SUMIFS(TBCompras[Valor Total Item (R$)],TBCompras[Mês do Projeto],\"<=\" & 25,TBCompras[Até],\">=\"& 25,TBCompras[Meta:Atividade],LEFT(B22,FIND(\" \",B22,1)-1),TBCompras[Tipo de Material],\"EQUIPAMENTO\")","v":0},{"$f":"SUMIFS(TBCompras[Valor Total Item (R$)],TBCompras[Mês do Projeto],\"<=\" & 26,TBCompras[Até],\">=\"& 26,TBCompras[Meta:Atividade],LEFT(B22,FIND(\" \",B22,1)-1),TBCompras[Tipo de Material],\"EQUIPAMENTO\")","v":0},{"$f":"SUMIFS(TBCompras[Valor Total Item (R$)],TBCompras[Mês do Projeto],\"<=\" & 27,TBCompras[Até],\">=\"& 27,TBCompras[Meta:Atividade],LEFT(B22,FIND(\" \",B22,1)-1),TBCompras[Tipo de Material],\"EQUIPAMENTO\")","v":0},{"$f":"SUMIFS(TBCompras[Valor Total Item (R$)],TBCompras[Mês do Projeto],\"<=\" & 28,TBCompras[Até],\">=\"& 28,TBCompras[Meta:Atividade],LEFT(B22,FIND(\" \",B22,1)-1),TBCompras[Tipo de Material],\"EQUIPAMENTO\")","v":0},{"$f":"SUMIFS(TBCompras[Valor Total Item (R$)],TBCompras[Mês do Projeto],\"<=\" & 29,TBCompras[Até],\">=\"& 29,TBCompras[Meta:Atividade],LEFT(B22,FIND(\" \",B22,1)-1),TBCompras[Tipo de Material],\"EQUIPAMENTO\")","v":0},{"$f":"SUMIFS(TBCompras[Valor Total Item (R$)],TBCompras[Mês do Projeto],\"<=\" & 30,TBCompras[Até],\">=\"& 30,TBCompras[Meta:Atividade],LEFT(B22,FIND(\" \",B22,1)-1),TBCompras[Tipo de Material],\"EQUIPAMENTO\")","v":0},{"$f":"SUMIFS(TBCompras[Valor Total Item (R$)],TBCompras[Mês do Projeto],\"<=\" & 31,TBCompras[Até],\">=\"& 31,TBCompras[Meta:Atividade],LEFT(B22,FIND(\" \",B22,1)-1),TBCompras[Tipo de Material],\"EQUIPAMENTO\")","v":0},{"$f":"SUMIFS(TBCompras[Valor Total Item (R$)],TBCompras[Mês do Projeto],\"<=\" & 32,TBCompras[Até],\">=\"& 32,TBCompras[Meta:Atividade],LEFT(B22,FIND(\" \",B22,1)-1),TBCompras[Tipo de Material],\"EQUIPAMENTO\")","v":0},{"$f":"SUMIFS(TBCompras[Valor Total Item (R$)],TBCompras[Mês do Projeto],\"<=\" & 33,TBCompras[Até],\">=\"& 33,TBCompras[Meta:Atividade],LEFT(B22,FIND(\" \",B22,1)-1),TBCompras[Tipo de Material],\"EQUIPAMENTO\")","v":0},{"$f":"SUMIFS(TBCompras[Valor Total Item (R$)],TBCompras[Mês do Projeto],\"<=\" & 34,TBCompras[Até],\">=\"& 34,TBCompras[Meta:Atividade],LEFT(B22,FIND(\" \",B22,1)-1),TBCompras[Tipo de Material],\"EQUIPAMENTO\")","v":0},{"$f":"SUMIFS(TBCompras[Valor Total Item (R$)],TBCompras[Mês do Projeto],\"<=\" & 35,TBCompras[Até],\">=\"& 35,TBCompras[Meta:Atividade],LEFT(B22,FIND(\" \",B22,1)-1),TBCompras[Tipo de Material],\"EQUIPAMENTO\")","v":0},{"$f":"SUMIFS(TBCompras[Valor Total Item (R$)],TBCompras[Mês do Projeto],\"<=\" & 36,TBCompras[Até],\">=\"& 36,TBCompras[Meta:Atividade],LEFT(B22,FIND(\" \",B22,1)-1),TBCompras[Tipo de Material],\"EQUIPAMENTO\")","v":0},0]
[null,null,"Total Atividade 1.3",{"$f":"SUBTOTAL(9,D22:D27)","v":0},0,0,0,0,0,0,0,0,0,0,0,0,0,0,0,0,0,0,0,0,0,0,0,0,0,0,0,0,0,0,0,0,0,0,0,0]
[null,"Total da Meta 1",null,{"$f":"SUBTOTAL(9,D8:D28)","v":0},0,0,0,0,0,0,0,0,0,0,0,0,0,0,0,0,0,0,0,0,0,0,0,0,0,0,0,0,0,0,0,0,0,0,0,0]
["Meta 2 - Produção e certificação do banco de células Vero","2.1 - Transferência e estocagem do banco de células para Bio de acordo com normas da Anvisa para substrato da vacina","Pessoa Física",{"$f":"SUMIFS(TbPessoas[Custo Total Mensal],TbPessoas[A partir do mês],\"<=\" & 1,TbPessoas[Até],\">=\"& 1,TbPessoas[Meta:Atividade],LEFT(B30,FIND(\" \",B30,1)-1))","v":0},{"$f":"SUMIFS(TbPessoas[Custo Total Mensal],TbPessoas[A partir do mês],\"<=\" & 2,TbPessoas[Até],\">=\"& 2,TbPessoas[Meta:Atividade],LEFT(B30,FIND(\" \",B30,1)-1))","v":0},{"$f":"SUMIFS(TbPessoas[Custo Total Mensal],TbPessoas[A partir do mês],\"<=\" & 3,TbPessoas[Até],\">=\"& 3,TbPessoas[Meta:Atividade],LEFT(B30,FIND(\" \",B30,1)-1))","v":0},{"$f":"SUMIFS(TbPessoas[Custo Total Mensal],TbPessoas[A partir do mês],\"<=\" & 4,TbPessoas[Até],\">=\"& 4,TbPessoas[Meta:Atividade],LEFT(B30,FIND(\" \",B30,1)-1))","v":0},{"$f":"SUMIFS(TbPessoas[Custo Total Mensal],TbPessoas[A partir do mês],\"<=\" & 5,TbPessoas[Até],\">=\"& 5,TbPessoas[Meta:Atividade],LEFT(B30,FIND(\" \",B30,1)-1))","v":0},{"$f":"SUMIFS(TbPessoas[Custo Total Mensal],TbPessoas[A partir do mês],\"<=\" & 6,TbPessoas[Até],\">=\"& 6,TbPessoas[Meta:Atividade],LEFT(B30,FIND(\" \",B30,1)-1))","v":0},{"$f":"SUMIFS(TbPessoas[Custo Total Mensal],TbPessoas[A partir do mês],\"<=\" & 7,TbPessoas[Até],\">=\"& 7,TbPessoas[Meta:Atividade],LEFT(B30,FIND(\" \",B30,1)-1))","v":0},{"$f":"SUMIFS(TbPessoas[Custo Total Mensal],TbPessoas[A partir do mês],\"<=\" & 8,TbPessoas[Até],\">=\"& 8,TbPessoas[Meta:Atividade],LEFT(B30,FIND(\" \",B30,1)-1))","v":0},{"$f":"SUMIFS(TbPessoas[Custo Total Mensal],TbPessoas[A partir do mês],\"<=\" & 9,TbPessoas[Até],\">=\"& 9,TbPessoas[Meta:Atividade],LEFT(B30,FIND(\" \",B30,1)-1))","v":0},{"$f":"SUMIFS(TbPessoas[Custo Total Mensal],TbPessoas[A partir do mês],\"<=\" & 10,TbPessoas[Até],\">=\"& 10,TbPessoas[Meta:Atividade],LEFT(B30,FIND(\" \",B30,1)-1))","v":0},{"$f":"SUMIFS(TbPessoas[Custo Total Mensal],TbPessoas[A partir do mês],\"<=\" & 11,TbPessoas[Até],\">=\"& 11,TbPessoas[Meta:Atividade],LEFT(B30,FIND(\" \",B30,1)-1))","v":0},{"$f":"SUMIFS(TbPessoas[Custo Total Mensal],TbPessoas[A partir do mês],\"<=\" & 12,TbPessoas[Até],\">=\"& 12,TbPessoas[Meta:Atividade],LEFT(B30,FIND(\" \",B30,1)-1))","v":0},{"$f":"SUMIFS(TbPessoas[Custo Total Mensal],TbPessoas[A partir do mês],\"<=\" & 13,TbPessoas[Até],\">=\"& 13,TbPessoas[Meta:Atividade],LEFT(B30,FIND(\" \",B30,1)-1))","v":0},{"$f":"SUMIFS(TbPessoas[Custo Total Mensal],TbPessoas[A partir do mês],\"<=\" & 14,TbPessoas[Até],\">=\"& 14,TbPessoas[Meta:Atividade],LEFT(B30,FIND(\" \",B30,1)-1))","v":0},{"$f":"SUMIFS(TbPessoas[Custo Total Mensal],TbPessoas[A partir do mês],\"<=\" & 15,TbPessoas[Até],\">=\"& 15,TbPessoas[Meta:Atividade],LEFT(B30,FIND(\" \",B30,1)-1))","v":0},{"$f":"SUMIFS(TbPessoas[Custo Total Mensal],TbPessoas[A partir do mês],\"<=\" & 16,TbPessoas[Até],\">=\"& 16,TbPessoas[Meta:Atividade],LEFT(B30,FIND(\" \",B30,1)-1))","v":0},{"$f":"SUMIFS(TbPessoas[Custo Total Mensal],TbPessoas[A partir do mês],\"<=\" & 17,TbPessoas[Até],\">=\"& 17,TbPessoas[Meta:Atividade],LEFT(B30,FIND(\" \",B30,1)-1))","v":0},{"$f":"SUMIFS(TbPessoas[Custo Total Mensal],TbPessoas[A partir do mês],\"<=\" & 18,TbPessoas[Até],\">=\"& 18,TbPessoas[Meta:Atividade],LEFT(B30,FIND(\" \",B30,1)-1))","v":0},{"$f":"SUMIFS(TbPessoas[Custo Total Mensal],TbPessoas[A partir do mês],\"<=\" & 19,TbPessoas[Até],\">=\"& 19,TbPessoas[Meta:Atividade],LEFT(B30,FIND(\" \",B30,1)-1))","v":0},{"$f":"SUMIFS(TbPessoas[Custo Total Mensal],TbPessoas[A partir do mês],\"<=\" & 20,TbPessoas[Até],\">=\"& 20,TbPessoas[Meta:Atividade],LEFT(B30,FIND(\" \",B30,1)-1))","v":0},{"$f":"SUMIFS(TbPessoas[Custo Total Mensal],TbPessoas[A partir do mês],\"<=\" & 21,TbPessoas[Até],\">=\"& 21,TbPessoas[Meta:Atividade],LEFT(B30,FIND(\" \",B30,1)-1))","v":0},{"$f":"SUMIFS(TbPessoas[Custo Total Mensal],TbPessoas[A partir do mês],\"<=\" & 22,TbPessoas[Até],\">=\"& 22,TbPessoas[Meta:Atividade],LEFT(B30,FIND(\" \",B30,1)-1))","v":0},{"$f":"SUMIFS(TbPessoas[Custo Total Mensal],TbPessoas[A partir do mês],\"<=\" & 23,TbPessoas[Até],\">=\"& 23,TbPessoas[Meta:Atividade],LEFT(B30,FIND(\" \",B30,1)-1))","v":0},{"$f":"SUMIFS(TbPessoas[Custo Total Mensal],TbPessoas[A partir do mês],\"<=\" & 24,TbPessoas[Até],\">=\"& 24,TbPessoas[Meta:Atividade],LEFT(B30,FIND(\" \",B30,1)-1))","v":0},{"$f":"SUMIFS(TbPessoas[Custo Total Mensal],TbPessoas[A partir do mês],\"<=\" & 25,TbPessoas[Até],\">=\"& 25,TbPessoas[Meta:Atividade],LEFT(B30,FIND(\" \",B30,1)-1))","v":0},{"$f":"SUMIFS(TbPessoas[Custo Total Mensal],TbPessoas[A partir do mês],\"<=\" & 26,TbPessoas[Até],\">=\"& 26,TbPessoas[Meta:Atividade],LEFT(B30,FIND(\" \",B30,1)-1))","v":0},{"$f":"SUMIFS(TbPessoas[Custo Total Mensal],TbPessoas[A partir do mês],\"<=\" & 27,TbPessoas[Até],\">=\"& 27,TbPessoas[Meta:Atividade],LEFT(B30,FIND(\" \",B30,1)-1))","v":0},{"$f":"SUMIFS(TbPessoas[Custo Total Mensal],TbPessoas[A partir do mês],\"<=\" & 28,TbPessoas[Até],\">=\"& 28,TbPessoas[Meta:Atividade],LEFT(B30,FIND(\" \",B30,1)-1))","v":0},{"$f":"SUMIFS(TbPessoas[Custo Total Mensal],TbPessoas[A partir do mês],\"<=\" & 29,TbPessoas[Até],\">=\"& 29,TbPessoas[Meta:Atividade],LEFT(B30,FIND(\" \",B30,1)-1))","v":0},{"$f":"SUMIFS(TbPessoas[Custo Total Mensal],TbPessoas[A partir do mês],\"<=\" & 30,TbPessoas[Até],\">=\"& 30,TbPessoas[Meta:Atividade],LEFT(B30,FIND(\" \",B30,1)-1))","v":0},{"$f":"SUMIFS(TbPessoas[Custo Total Mensal],TbPessoas[A partir do mês],\"<=\" & 31,TbPessoas[Até],\">=\"& 31,TbPessoas[Meta:Atividade],LEFT(B30,FIND(\" \",B30,1)-1))","v":0},{"$f":"SUMIFS(TbPessoas[Custo Total Mensal],TbPessoas[A partir do mês],\"<=\" & 32,TbPessoas[Até],\">=\"& 32,TbPessoas[Meta:Atividade],LEFT(B30,FIND(\" \",B30,1)-1))","v":0},{"$f":"SUMIFS(TbPessoas[Custo Total Mensal],TbPessoas[A partir do mês],\"<=\" & 33,TbPessoas[Até],\">=\"& 33,TbPessoas[Meta:Atividade],LEFT(B30,FIND(\" \",B30,1)-1))","v":0},{"$f":"SUMIFS(TbPessoas[Custo Total Mensal],TbPessoas[A partir do mês],\"<=\" & 34,TbPessoas[Até],\">=\"& 34,TbPessoas[Meta:Atividade],LEFT(B30,FIND(\" \",B30,1)-1))","v":0},{"$f":"SUMIFS(TbPessoas[Custo Total Mensal],TbPessoas[A partir do mês],\"<=\" & 35,TbPessoas[Até],\">=\"& 35,TbPessoas[Meta:Atividade],LEFT(B30,FIND(\" \",B30,1)-1))","v":0},{"$f":"SUMIFS(TbPessoas[Custo Total Mensal],TbPessoas[A partir do mês],\"<=\" & 36,TbPessoas[Até],\">=\"& 36,TbPessoas[Meta:Atividade],LEFT(B30,FIND(\" \",B30,1)-1))","v":0},{"$f":"SUM(D30:AM30)","v":0}]
[null,null,"Pessoa Jurídica",{"$f":"SUMIFS(TBCompras[Valor Total Item (R$)],TBCompras[Mês do Projeto],\"<=\" & 1,TBCompras[Até],\">=\"& 1,TBCompras[Meta:Atividade],LEFT(B30,FIND(\" \",B30,1)-1),TBCompras[Tipo de Material],\"SERVIÇO\")","v":0},{"$f":"SUMIFS(TBCompras[Valor Total Item (R$)],TBCompras[Mês do Projeto],\"<=\" & 2,TBCompras[Até],\">=\"& 2,TBCompras[Meta:Atividade],LEFT(B30,FIND(\" \",B30,1)-1),TBCompras[Tipo de Material],\"SERVIÇO\")","v":0},{"$f":"SUMIFS(TBCompras[Valor Total Item (R$)],TBCompras[Mês do Projeto],\"<=\" & 3,TBCompras[Até],\">=\"& 3,TBCompras[Meta:Atividade],LEFT(B30,FIND(\" \",B30,1)-1),TBCompras[Tipo de Material],\"SERVIÇO\")","v":0},{"$f":"SUMIFS(TBCompras[Valor Total Item (R$)],TBCompras[Mês do Projeto],\"<=\" & 4,TBCompras[Até],\">=\"& 4,TBCompras[Meta:Atividade],LEFT(B30,FIND(\" \",B30,1)-1),TBCompras[Tipo de Material],\"SERVIÇO\")","v":0},{"$f":"SUMIFS(TBCompras[Valor Total Item (R$)],TBCompras[Mês do Projeto],\"<=\" & 5,TBCompras[Até],\">=\"& 5,TBCompras[Meta:Atividade],LEFT(B30,FIND(\" \",B30,1)-1),TBCompras[Tipo de Material],\"SERVIÇO\")","v":0},{"$f":"SUMIFS(TBCompras[Valor Total Item (R$)],TBCompras[Mês do Projeto],\"<=\" & 6,TBCompras[Até],\">=\"& 6,TBCompras[Meta:Atividade],LEFT(B30,FIND(\" \",B30,1)-1),TBCompras[Tipo de Material],\"SERVIÇO\")","v":0},{"$f":"SUMIFS(TBCompras[Valor Total Item (R$)],TBCompras[Mês do Projeto],\"<=\" & 7,TBCompras[Até],\">=\"& 7,TBCompras[Meta:Atividade],LEFT(B30,FIND(\" \",B30,1)-1),TBCompras[Tipo de Material],\"SERVIÇO\")","v":0},{"$f":"SUMIFS(TBCompras[Valor Total Item (R$)],TBCompras[Mês do Projeto],\"<=\" & 8,TBCompras[Até],\">=\"& 8,TBCompras[Meta:Atividade],LEFT(B30,FIND(\" \",B30,1)-1),TBCompras[Tipo de Material],\"SERVIÇO\")","v":0},{"$f":"SUMIFS(TBCompras[Valor Total Item (R$)],TBCompras[Mês do Projeto],\"<=\" & 9,TBCompras[Até],\">=\"& 9,TBCompras[Meta:Atividade],LEFT(B30,FIND(\" \",B30,1)-1),TBCompras[Tipo de Material],\"SERVIÇO\")","v":0},{"$f":"SUMIFS(TBCompras[Valor Total Item (R$)],TBCompras[Mês do Projeto],\"<=\" & 10,TBCompras[Até],\">=\"& 10,TBCompras[Meta:Atividade],LEFT(B30,FIND(\" \",B30,1)-1),TBCompras[Tipo de Material],\"SERVIÇO\")","v":0},{"$f":"SUMIFS(TBCompras[Valor Total Item (R$)],TBCompras[Mês do Projeto],\"<=\" & 11,TBCompras[Até],\">=\"& 11,TBCompras[Meta:Atividade],LEFT(B30,FIND(\" \",B30,1)-1),TBCompras[Tipo de Material],\"SERVIÇO\")","v":0},{"$f":"SUMIFS(TBCompras[Valor Total Item (R$)],TBCompras[Mês do Projeto],\"<=\" & 12,TBCompras[Até],\">=\"& 12,TBCompras[Meta:Atividade],LEFT(B30,FIND(\" \",B30,1)-1),TBCompras[Tipo de Material],\"SERVIÇO\")","v":0},{"$f":"SUMIFS(TBCompras[Valor Total Item (R$)],TBCompras[Mês do Projeto],\"<=\" & 13,TBCompras[Até],\">=\"& 13,TBCompras[Meta:Atividade],LEFT(B30,FIND(\" \",B30,1)-1),TBCompras[Tipo de Material],\"SERVIÇO\")","v":0},{"$f":"SUMIFS(TBCompras[Valor Total Item (R$)],TBCompras[Mês do Projeto],\"<=\" & 14,TBCompras[Até],\">=\"& 14,TBCompras[Meta:Atividade],LEFT(B30,FIND(\" \",B30,1)-1),TBCompras[Tipo de Material],\"SERVIÇO\")","v":0},{"$f":"SUMIFS(TBCompras[Valor Total Item (R$)],TBCompras[Mês do Projeto],\"<=\" & 15,TBCompras[Até],\">=\"& 15,TBCompras[Meta:Atividade],LEFT(B30,FIND(\" \",B30,1)-1),TBCompras[Tipo de Material],\"SERVIÇO\")","v":0},{"$f":"SUMIFS(TBCompras[Valor Total Item (R$)],TBCompras[Mês do Projeto],\"<=\" & 16,TBCompras[Até],\">=\"& 16,TBCompras[Meta:Atividade],LEFT(B30,FIND(\" \",B30,1)-1),TBCompras[Tipo de Material],\"SERVIÇO\")","v":0},{"$f":"SUMIFS(TBCompras[Valor Total Item (R$)],TBCompras[Mês do Projeto],\"<=\" & 17,TBCompras[Até],\">=\"& 17,TBCompras[Meta:Atividade],LEFT(B30,FIND(\" \",B30,1)-1),TBCompras[Tipo de Material],\"SERVIÇO\")","v":0},{"$f":"SUMIFS(TBCompras[Valor Total Item (R$)],TBCompras[Mês do Projeto],\"<=\" & 18,TBCompras[Até],\">=\"& 18,TBCompras[Meta:Atividade],LEFT(B30,FIND(\" \",B30,1)-1),TBCompras[Tipo de Material],\"SERVIÇO\")","v":0},{"$f":"SUMIFS(TBCompras[Valor Total Item (R$)],TBCompras[Mês do Projeto],\"<=\" & 19,TBCompras[Até],\">=\"& 19,TBCompras[Meta:Atividade],LEFT(B30,FIND(\" \",B30,1)-1),TBCompras[Tipo de Material],\"SERVIÇO\")","v":0},{"$f":"SUMIFS(TBCompras[Valor Total Item (R$)],TBCompras[Mês do Projeto],\"<=\" & 20,TBCompras[Até],\">=\"& 20,TBCompras[Meta:Atividade],LEFT(B30,FIND(\" \",B30,1)-1),TBCompras[Tipo de Material],\"SERVIÇO\")","v":0},{"$f":"SUMIFS(TBCompras[Valor Total Item (R$)],TBCompras[Mês do Projeto],\"<=\" & 21,TBCompras[Até],\">=\"& 21,TBCompras[Meta:Atividade],LEFT(B30,FIND(\" \",B30,1)-1),TBCompras[Tipo de Material],\"SERVIÇO\")","v":0},{"$f":"SUMIFS(TBCompras[Valor Total Item (R$)],TBCompras[Mês do Projeto],\"<=\" & 22,TBCompras[Até],\">=\"& 22,TBCompras[Meta:Atividade],LEFT(B30,FIND(\" \",B30,1)-1),TBCompras[Tipo de Material],\"SERVIÇO\")","v":0},{"$f":"SUMIFS(TBCompras[Valor Total Item (R$)],TBCompras[Mês do Projeto],\"<=\" & 23,TBCompras[Até],\">=\"& 23,TBCompras[Meta:Atividade],LEFT(B30,FIND(\" \",B30,1)-1),TBCompras[Tipo de Material],\"SERVIÇO\")","v":0},{"$f":"SUMIFS(TBCompras[Valor Total Item (R$)],TBCompras[Mês do Projeto],\"<=\" & 24,TBCompras[Até],\">=\"& 24,TBCompras[Meta:Atividade],LEFT(B30,FIND(\" \",B30,1)-1),TBCompras[Tipo de Material],\"SERVIÇO\")","v":0},{"$f":"SUMIFS(TBCompras[Valor Total Item (R$)],TBCompras[Mês do Projeto],\"<=\" & 25,TBCompras[Até],\">=\"& 25,TBCompras[Meta:Atividade],LEFT(B30,FIND(\" \",B30,1)-1),TBCompras[Tipo de Material],\"SERVIÇO\")","v":0},{"$f":"SUMIFS(TBCompras[Valor Total Item (R$)],TBCompras[Mês do Projeto],\"<=\" & 26,TBCompras[Até],\">=\"& 26,TBCompras[Meta:Atividade],LEFT(B30,FIND(\" \",B30,1)-1),TBCompras[Tipo de Material],\"SERVIÇO\")","v":0},{"$f":"SUMIFS(TBCompras[Valor Total Item (R$)],TBCompras[Mês do Projeto],\"<=\" & 27,TBCompras[Até],\">=\"& 27,TBCompras[Meta:Atividade],LEFT(B30,FIND(\" \",B30,1)-1),TBCompras[Tipo de Material],\"SERVIÇO\")","v":0},{"$f":"SUMIFS(TBCompras[Valor Total Item (R$)],TBCompras[Mês do Projeto],\"<=\" & 28,TBCompras[Até],\">=\"& 28,TBCompras[Meta:Atividade],LEFT(B30,FIND(\" \",B30,1)-1),TBCompras[Tipo de Material],\"SERVIÇO\")","v":0},{"$f":"SUMIFS(TBCompras[Valor Total Item (R$)],TBCompras[Mês do Projeto],\"<=\" & 29,TBCompras[Até],\">=\"& 29,TBCompras[Meta:Atividade],LEFT(B30,FIND(\" \",B30,1)-1),TBCompras[Tipo de Material],\"SERVIÇO\")","v":0},{"$f":"SUMIFS(TBCompras[Valor Total Item (R$)],TBCompras[Mês do Projeto],\"<=\" & 30,TBCompras[Até],\">=\"& 30,TBCompras[Meta:Atividade],LEFT(B30,FIND(\" \",B30,1)-1),TBCompras[Tipo de Material],\"SERVIÇO\")","v":0},{"$f":"SUMIFS(TBCompras[Valor Total Item (R$)],TBCompras[Mês do Projeto],\"<=\" & 31,TBCompras[Até],\">=\"& 31,TBCompras[Meta:Atividade],LEFT(B30,FIND(\" \",B30,1)-1),TBCompras[Tipo de Material],\"SERVIÇO\")","v":0},{"$f":"SUMIFS(TBCompras[Valor Total Item (R$)],TBCompras[Mês do Projeto],\"<=\" & 32,TBCompras[Até],\">=\"& 32,TBCompras[Meta:Atividade],LEFT(B30,FIND(\" \",B30,1)-1),TBCompras[Tipo de Material],\"SERVIÇO\")","v":0},{"$f":"SUMIFS(TBCompras[Valor Total Item (R$)],TBCompras[Mês do Projeto],\"<=\" & 33,TBCompras[Até],\">=\"& 33,TBCompras[Meta:Atividade],LEFT(B30,FIND(\" \",B30,1)-1),TBCompras[Tipo de Material],\"SERVIÇO\")","v":0},{"$f":"SUMIFS(TBCompras[Valor Total Item (R$)],TBCompras[Mês do Projeto],\"<=\" & 34,TBCompras[Até],\">=\"& 34,TBCompras[Meta:Atividade],LEFT(B30,FIND(\" \",B30,1)-1),TBCompras[Tipo de Material],\"SERVIÇO\")","v":0},{"$f":"SUMIFS(TBCompras[Valor Total Item (R$)],TBCompras[Mês do Projeto],\"<=\" & 35,TBCompras[Até],\">=\"& 35,TBCompras[Meta:Atividade],LEFT(B30,FIND(\" \",B30,1)-1),TBCompras[Tipo de Material],\"SERVIÇO\")","v":0},{"$f":"SUMIFS(TBCompras[Valor Total Item (R$)],TBCompras[Mês do Projeto],\"<=\" & 36,TBCompras[Até],\">=\"& 36,TBCompras[Meta:Atividade],LEFT(B30,FIND(\" \",B30,1)-1),TBCompras[Tipo de Material],\"SERVIÇO\")","v":0},0]
[null,null,"Passagens",{"$f":"SUMIFS(TbPassagens[Valor Total Passagem],TbPassagens[A partir do mês],\"<=\" & 1,TbPassagens[Até],\">=\"& 1,TbPassagens[Meta:Atividade],LEFT(B30,FIND(\" \",B30,1)-1))","v":0},{"$f":"SUMIFS(TbPassagens[Valor Total Passagem],TbPassagens[A partir do mês],\"<=\" & 2,TbPassagens[Até],\">=\"& 2,TbPassagens[Meta:Atividade],LEFT(B30,FIND(\" \",B30,1)-1))","v":0},{"$f":"SUMIFS(TbPassagens[Valor Total Passagem],TbPassagens[A partir do mês],\"<=\" & 3,TbPassagens[Até],\">=\"& 3,TbPassagens[Meta:Atividade],LEFT(B30,FIND(\" \",B30,1)-1))","v":0},{"$f":"SUMIFS(TbPassagens[Valor Total Passagem],TbPassagens[A partir do mês],\"<=\" & 4,TbPassagens[Até],\">=\"& 4,TbPassagens[Meta:Atividade],LEFT(B30,FIND(\" \",B30,1)-1))","v":0},{"$f":"SUMIFS(TbPassagens[Valor Total Passagem],TbPassagens[A partir do mês],\"<=\" & 5,TbPassagens[Até],\">=\"& 5,TbPassagens[Meta:Atividade],LEFT(B30,FIND(\" \",B30,1)-1))","v":0},{"$f":"SUMIFS(TbPassagens[Valor Total Passagem],TbPassagens[A partir do mês],\"<=\" & 6,TbPassagens[Até],\">=\"& 6,TbPassagens[Meta:Atividade],LEFT(B30,FIND(\" \",B30,1)-1))","v":0},{"$f":"SUMIFS(TbPassagens[Valor Total Passagem],TbPassagens[A partir do mês],\"<=\" & 7,TbPassagens[Até],\">=\"& 7,TbPassagens[Meta:Atividade],LEFT(B30,FIND(\" \",B30,1)-1))","v":0},{"$f":"SUMIFS(TbPassagens[Valor Total Passagem],TbPassagens[A partir do mês],\"<=\" & 8,TbPassagens[Até],\">=\"& 8,TbPassagens[Meta:Atividade],LEFT(B30,FIND(\" \",B30,1)-1))","v":0},{"$f":"SUMIFS(TbPassagens[Valor Total Passagem],TbPassagens[A partir do mês],\"<=\" & 9,TbPassagens[Até],\">=\"& 9,TbPassagens[Meta:Atividade],LEFT(B30,FIND(\" \",B30,1)-1))","v":0},{"$f":"SUMIFS(TbPassagens[Valor Total Passagem],TbPassagens[A partir do mês],\"<=\" & 10,TbPassagens[Até],\">=\"& 10,TbPassagens[Meta:Atividade],LEFT(B30,FIND(\" \",B30,1)-1))","v":0},{"$f":"SUMIFS(TbPassagens[Valor Total Passagem],TbPassagens[A partir do mês],\"<=\" & 11,TbPassagens[Até],\">=\"& 11,TbPassagens[Meta:Atividade],LEFT(B30,FIND(\" \",B30,1)-1))","v":0},{"$f":"SUMIFS(TbPassagens[Valor Total Passagem],TbPassagens[A partir do mês],\"<=\" & 12,TbPassagens[Até],\">=\"& 12,TbPassagens[Meta:Atividade],LEFT(B30,FIND(\" \",B30,1)-1))","v":0},{"$f":"SUMIFS(TbPassagens[Valor Total Passagem],TbPassagens[A partir do mês],\"<=\" & 13,TbPassagens[Até],\">=\"& 13,TbPassagens[Meta:Atividade],LEFT(B30,FIND(\" \",B30,1)-1))","v":0},{"$f":"SUMIFS(TbPassagens[Valor Total Passagem],TbPassagens[A partir do mês],\"<=\" & 14,TbPassagens[Até],\">=\"& 14,TbPassagens[Meta:Atividade],LEFT(B30,FIND(\" \",B30,1)-1))","v":0},{"$f":"SUMIFS(TbPassagens[Valor Total Passagem],TbPassagens[A partir do mês],\"<=\" & 15,TbPassagens[Até],\">=\"& 15,TbPassagens[Meta:Atividade],LEFT(B30,FIND(\" \",B30,1)-1))","v":0},{"$f":"SUMIFS(TbPassagens[Valor Total Passagem],TbPassagens[A partir do mês],\"<=\" & 16,TbPassagens[Até],\">=\"& 16,TbPassagens[Meta:Atividade],LEFT(B30,FIND(\" \",B30,1)-1))","v":0},{"$f":"SUMIFS(TbPassagens[Valor Total Passagem],TbPassagens[A partir do mês],\"<=\" & 17,TbPassagens[Até],\">=\"& 17,TbPassagens[Meta:Atividade],LEFT(B30,FIND(\" \",B30,1)-1))","v":0},{"$f":"SUMIFS(TbPassagens[Valor Total Passagem],TbPassagens[A partir do mês],\"<=\" & 18,TbPassagens[Até],\">=\"& 18,TbPassagens[Meta:Atividade],LEFT(B30,FIND(\" \",B30,1)-1))","v":0},{"$f":"SUMIFS(TbPassagens[Valor Total Passagem],TbPassagens[A partir do mês],\"<=\" & 19,TbPassagens[Até],\">=\"& 19,TbPassagens[Meta:Atividade],LEFT(B30,FIND(\" \",B30,1)-1))","v":0},{"$f":"SUMIFS(TbPassagens[Valor Total Passagem],TbPassagens[A partir do mês],\"<=\" & 20,TbPassagens[Até],\">=\"& 20,TbPassagens[Meta:Atividade],LEFT(B30,FIND(\" \",B30,1)-1))","v":0},{"$f":"SUMIFS(TbPassagens[Valor Total Passagem],TbPassagens[A partir do mês],\"<=\" & 21,TbPassagens[Até],\">=\"& 21,TbPassagens[Meta:Atividade],LEFT(B30,FIND(\" \",B30,1)-1))","v":0},{"$f":"SUMIFS(TbPassagens[Valor Total Passagem],TbPassagens[A partir do mês],\"<=\" & 22,TbPassagens[Até],\">=\"& 22,TbPassagens[Meta:Atividade],LEFT(B30,FIND(\" \",B30,1)-1))","v":0},{"$f":"SUMIFS(TbPassagens[Valor Total Passagem],TbPassagens[A partir do mês],\"<=\" & 23,TbPassagens[Até],\">=\"& 23,TbPassagens[Meta:Atividade],LEFT(B30,FIND(\" \",B30,1)-1))","v":0},{"$f":"SUMIFS(TbPassagens[Valor Total Passagem],TbPassagens[A partir do mês],\"<=\" & 24,TbPassagens[Até],\">=\"& 24,TbPassagens[Meta:Atividade],LEFT(B30,FIND(\" \",B30,1)-1))","v":0},{"$f":"SUMIFS(TbPassagens[Valor Total Passagem],TbPassagens[A partir do mês],\"<=\" & 25,TbPassagens[Até],\">=\"& 25,TbPassagens[Meta:Atividade],LEFT(B30,FIND(\" \",B30,1)-1))","v":0},{"$f":"SUMIFS(TbPassagens[Valor Total Passagem],TbPassagens[A partir do mês],\"<=\" & 26,TbPassagens[Até],\">=\"& 26,TbPassagens[Meta:Atividade],LEFT(B30,FIND(\" \",B30,1)-1))","v":0},{"$f":"SUMIFS(TbPassagens[Valor Total Passagem],TbPassagens[A partir do mês],\"<=\" & 27,TbPassagens[Até],\">=\"& 27,TbPassagens[Meta:Atividade],LEFT(B30,FIND(\" \",B30,1)-1))","v":0},{"$f":"SUMIFS(TbPassagens[Valor Total Passagem],TbPassagens[A partir do mês],\"<=\" & 28,TbPassagens[Até],\">=\"& 28,TbPassagens[Meta:Atividade],LEFT(B30,FIND(\" \",B30,1)-1))","v":0},{"$f":"SUMIFS(TbPassagens[Valor Total Passagem],TbPassagens[A partir do mês],\"<=\" & 29,TbPassagens[Até],\">=\"& 29,TbPassagens[Meta:Atividade],LEFT(B30,FIND(\" \",B30,1)-1))","v":0},{"$f":"SUMIFS(TbPassagens[Valor Total Passagem],TbPassagens[A partir do mês],\"<=\" & 30,TbPassagens[Até],\">=\"& 30,TbPassagens[Meta:Atividade],LEFT(B30,FIND(\" \",B30,1)-1))","v":0},{"$f":"SUMIFS(TbPassagens[Valor Total Passagem],TbPassagens[A partir do mês],\"<=\" & 31,TbPassagens[Até],\">=\"& 31,TbPassagens[Meta:Atividade],LEFT(B30,FIND(\" \",B30,1)-1))","v":0},{"$f":"SUMIFS(TbPassagens[Valor Total Passagem],TbPassagens[A partir do mês],\"<=\" & 32,TbPassagens[Até],\">=\"& 32,TbPassagens[Meta:Atividade],LEFT(B30,FIND(\" \",B30,1)-1))","v":0},{"$f":"SUMIFS(TbPassagens[Valor Total Passagem],TbPassagens[A partir do mês],\"<=\" & 33,TbPassagens[Até],\">=\"& 33,TbPassagens[Meta:Atividade],LEFT(B30,FIND(\" \",B30,1)-1))","v":0},{"$f":"SUMIFS(TbPassagens[Valor Total Passagem],TbPassagens[A partir do mês],\"<=\" & 34,TbPassagens[Até],\">=\"& 34,TbPassagens[Meta:Atividade],LEFT(B30,FIND(\" \",B30,1)-1))","v":0},{"$f":"SUMIFS(TbPassagens[Valor Total Passagem],TbPassagens[A partir do mês],\"<=\" & 35,TbPassagens[Até],\">=\"& 35,TbPassagens[Meta:Atividade],LEFT(B30,FIND(\" \",B30,1)-1))","v":0},{"$f":"SUMIFS(TbPassagens[Valor Total Passagem],TbPassagens[A partir do mês],\"<=\" & 36,TbPassagens[Até],\">=\"& 36,TbPassagens[Meta:Atividade],LEFT(B30,FIND(\" \",B30,1)-1))","v":0},0]
[null,null,"Diárias",{"$f":"SUMIFS(TbPassagens[Valor Total Diária],TbPassagens[A partir do mês],\"<=\" & 1,TbPassagens[Até],\">=\"& 1,TbPassagens[Meta:Atividade],LEFT(B30,FIND(\" \",B30,1)-1))","v":0},{"$f":"SUMIFS(TbPassagens[Valor Total Diária],TbPassagens[A partir do mês],\"<=\" & 2,TbPassagens[Até],\">=\"& 2,TbPassagens[Meta:Atividade],LEFT(B30,FIND(\" \",B30,1)-1))","v":0},{"$f":"SUMIFS(TbPassagens[Valor Total Diária],TbPassagens[A partir do mês],\"<=\" & 3,TbPassagens[Até],\">=\"& 3,TbPassagens[Meta:Atividade],LEFT(B30,FIND(\" \",B30,1)-1))","v":0},{"$f":"SUMIFS(TbPassagens[Valor Total Diária],TbPassagens[A partir do mês],\"<=\" & 4,TbPassagens[Até],\">=\"& 4,TbPassagens[Meta:Atividade],LEFT(B30,FIND(\" \",B30,1)-1))","v":0},{"$f":"SUMIFS(TbPassagens[Valor Total Diária],TbPassagens[A partir do mês],\"<=\" & 5,TbPassagens[Até],\">=\"& 5,TbPassagens[Meta:Atividade],LEFT(B30,FIND(\" \",B30,1)-1))","v":0},{"$f":"SUMIFS(TbPassagens[Valor Total Diária],TbPassagens[A partir do mês],\"<=\" & 6,TbPassagens[Até],\">=\"& 6,TbPassagens[Meta:Atividade],LEFT(B30,FIND(\" \",B30,1)-1))","v":0},{"$f":"SUMIFS(TbPassagens[Valor Total Diária],TbPassagens[A partir do mês],\"<=\" & 7,TbPassagens[Até],\">=\"& 7,TbPassagens[Meta:Atividade],LEFT(B30,FIND(\" \",B30,1)-1))","v":0},{"$f":"SUMIFS(TbPassagens[Valor Total Diária],TbPassagens[A partir do mês],\"<=\" & 8,TbPassagens[Até],\">=\"& 8,TbPassagens[Meta:Atividade],LEFT(B30,FIND(\" \",B30,1)-1))","v":0},{"$f":"SUMIFS(TbPassagens[Valor Total Diária],TbPassagens[A partir do mês],\"<=\" & 9,TbPassagens[Até],\">=\"& 9,TbPassagens[Meta:Atividade],LEFT(B30,FIND(\" \",B30,1)-1))","v":0},{"$f":"SUMIFS(TbPassagens[Valor Total Diária],TbPassagens[A partir do mês],\"<=\" & 10,TbPassagens[Até],\">=\"& 10,TbPassagens[Meta:Atividade],LEFT(B30,FIND(\" \",B30,1)-1))","v":0},{"$f":"SUMIFS(TbPassagens[Valor Total Diária],TbPassagens[A partir do mês],\"<=\" & 11,TbPassagens[Até],\">=\"& 11,TbPassagens[Meta:Atividade],LEFT(B30,FIND(\" \",B30,1)-1))","v":0},{"$f":"SUMIFS(TbPassagens[Valor Total Diária],TbPassagens[A partir do mês],\"<=\" & 12,TbPassagens[Até],\">=\"& 12,TbPassagens[Meta:Atividade],LEFT(B30,FIND(\" \",B30,1)-1))","v":0},{"$f":"SUMIFS(TbPassagens[Valor Total Diária],TbPassagens[A partir do mês],\"<=\" & 13,TbPassagens[Até],\">=\"& 13,TbPassagens[Meta:Atividade],LEFT(B30,FIND(\" \",B30,1)-1))","v":0},{"$f":"SUMIFS(TbPassagens[Valor Total Diária],TbPassagens[A partir do mês],\"<=\" & 14,TbPassagens[Até],\">=\"& 14,TbPassagens[Meta:Atividade],LEFT(B30,FIND(\" \",B30,1)-1))","v":0},{"$f":"SUMIFS(TbPassagens[Valor Total Diária],TbPassagens[A partir do mês],\"<=\" & 15,TbPassagens[Até],\">=\"& 15,TbPassagens[Meta:Atividade],LEFT(B30,FIND(\" \",B30,1)-1))","v":0},{"$f":"SUMIFS(TbPassagens[Valor Total Diária],TbPassagens[A partir do mês],\"<=\" & 16,TbPassagens[Até],\">=\"& 16,TbPassagens[Meta:Atividade],LEFT(B30,FIND(\" \",B30,1)-1))","v":0},{"$f":"SUMIFS(TbPassagens[Valor Total Diária],TbPassagens[A partir do mês],\"<=\" & 17,TbPassagens[Até],\">=\"& 17,TbPassagens[Meta:Atividade],LEFT(B30,FIND(\" \",B30,1)-1))","v":0},{"$f":"SUMIFS(TbPassagens[Valor Total Diária],TbPassagens[A partir do mês],\"<=\" & 18,TbPassagens[Até],\">=\"& 18,TbPassagens[Meta:Atividade],LEFT(B30,FIND(\" \",B30,1)-1))","v":0},{"$f":"SUMIFS(TbPassagens[Valor Total Diária],TbPassagens[A partir do mês],\"<=\" & 19,TbPassagens[Até],\">=\"& 19,TbPassagens[Meta:Atividade],LEFT(B30,FIND(\" \",B30,1)-1))","v":0},{"$f":"SUMIFS(TbPassagens[Valor Total Diária],TbPassagens[A partir do mês],\"<=\" & 20,TbPassagens[Até],\">=\"& 20,TbPassagens[Meta:Atividade],LEFT(B30,FIND(\" \",B30,1)-1))","v":0},{"$f":"SUMIFS(TbPassagens[Valor Total Diária],TbPassagens[A partir do mês],\"<=\" & 21,TbPassagens[Até],\">=\"& 21,TbPassagens[Meta:Atividade],LEFT(B30,FIND(\" \",B30,1)-1))","v":0},{"$f":"SUMIFS(TbPassagens[Valor Total Diária],TbPassagens[A partir do mês],\"<=\" & 22,TbPassagens[Até],\">=\"& 22,TbPassagens[Meta:Atividade],LEFT(B30,FIND(\" \",B30,1)-1))","v":0},{"$f":"SUMIFS(TbPassagens[Valor Total Diária],TbPassagens[A partir do mês],\"<=\" & 23,TbPassagens[Até],\">=\"& 23,TbPassagens[Meta:Atividade],LEFT(B30,FIND(\" \",B30,1)-1))","v":0},{"$f":"SUMIFS(TbPassagens[Valor Total Diária],TbPassagens[A partir do mês],\"<=\" & 24,TbPassagens[Até],\">=\"& 24,TbPassagens[Meta:Atividade],LEFT(B30,FIND(\" \",B30,1)-1))","v":0},{"$f":"SUMIFS(TbPassagens[Valor Total Diária],TbPassagens[A partir do mês],\"<=\" & 25,TbPassagens[Até],\">=\"& 25,TbPassagens[Meta:Atividade],LEFT(B30,FIND(\" \",B30,1)-1))","v":0},{"$f":"SUMIFS(TbPassagens[Valor Total Diária],TbPassagens[A partir do mês],\"<=\" & 26,TbPassagens[Até],\">=\"& 26,TbPassagens[Meta:Atividade],LEFT(B30,FIND(\" \",B30,1)-1))","v":0},{"$f":"SUMIFS(TbPassagens[Valor Total Diária],TbPassagens[A partir do mês],\"<=\" & 27,TbPassagens[Até],\">=\"& 27,TbPassagens[Meta:Atividade],LEFT(B30,FIND(\" \",B30,1)-1))","v":0},{"$f":"SUMIFS(TbPassagens[Valor Total Diária],TbPassagens[A partir do mês],\"<=\" & 28,TbPassagens[Até],\">=\"& 28,TbPassagens[Meta:Atividade],LEFT(B30,FIND(\" \",B30,1)-1))","v":0},{"$f":"SUMIFS(TbPassagens[Valor Total Diária],TbPassagens[A partir do mês],\"<=\" & 29,TbPassagens[Até],\">=\"& 29,TbPassagens[Meta:Atividade],LEFT(B30,FIND(\" \",B30,1)-1))","v":0},{"$f":"SUMIFS(TbPassagens[Valor Total Diária],TbPassagens[A partir do mês],\"<=\" & 30,TbPassagens[Até],\">=\"& 30,TbPassagens[Meta:Atividade],LEFT(B30,FIND(\" \",B30,1)-1))","v":0},{"$f":"SUMIFS(TbPassagens[Valor Total Diária],TbPassagens[A partir do mês],\"<=\" & 31,TbPassagens[Até],\">=\"& 31,TbPassagens[Meta:Atividade],LEFT(B30,FIND(\" \",B30,1)-1))","v":0},{"$f":"SUMIFS(TbPassagens[Valor Total Diária],TbPassagens[A partir do mês],\"<=\" & 32,TbPassagens[Até],\">=\"& 32,TbPassagens[Meta:Atividade],LEFT(B30,FIND(\" \",B30,1)-1))","v":0},{"$f":"SUMIFS(TbPassagens[Valor Total Diária],TbPassagens[A partir do mês],\"<=\" & 33,TbPassagens[Até],\">=\"& 33,TbPassagens[Meta:Atividade],LEFT(B30,FIND(\" \",B30,1)-1))","v":0},{"$f":"SUMIFS(TbPassagens[Valor Total Diária],TbPassagens[A partir do mês],\"<=\" & 34,TbPassagens[Até],\">=\"& 34,TbPassagens[Meta:Atividade],LEFT(B30,FIND(\" \",B30,1)-1))","v":0},{"$f":"SUMIFS(TbPassagens[Valor Total Diária],TbPassagens[A partir do mês],\"<=\" & 35,TbPassagens[Até],\">=\"& 35,TbPassagens[Meta:Atividade],LEFT(B30,FIND(\" \",B30,1)-1))","v":0},{"$f":"SUMIFS(TbPassagens[Valor Total Diária],TbPassagens[A partir do mês],\"<=\" & 36,TbPassagens[Até],\">=\"& 36,TbPassagens[Meta:Atividade],LEFT(B30,FIND(\" \",B30,1)-1))","v":0},0]
[null,null,"Material de Consumo",{"$f":"SUMIFS(TBCompras[Valor Total Item (R$)],TBCompras[Mês do Projeto],\"<=\" & 1,TBCompras[Até],\">=\"& 1,TBCompras[Meta:Atividade],LEFT(B30,FIND(\" \",B30,1)-1),TBCompras[Tipo de Material],\"CONSUMO\")","v":0},{"$f":"SUMIFS(TBCompras[Valor Total Item (R$)],TBCompras[Mês do Projeto],\"<=\" & 2,TBCompras[Até],\">=\"& 2,TBCompras[Meta:Atividade],LEFT(B30,FIND(\" \",B30,1)-1),TBCompras[Tipo de Material],\"CONSUMO\")","v":0},{"$f":"SUMIFS(TBCompras[Valor Total Item (R$)],TBCompras[Mês do Projeto],\"<=\" & 3,TBCompras[Até],\">=\"& 3,TBCompras[Meta:Atividade],LEFT(B30,FIND(\" \",B30,1)-1),TBCompras[Tipo de Material],\"CONSUMO\")","v":0},{"$f":"SUMIFS(TBCompras[Valor Total Item (R$)],TBCompras[Mês do Projeto],\"<=\" & 4,TBCompras[Até],\">=\"& 4,TBCompras[Meta:Atividade],LEFT(B30,FIND(\" \",B30,1)-1),TBCompras[Tipo de Material],\"CONSUMO\")","v":0},{"$f":"SUMIFS(TBCompras[Valor Total Item (R$)],TBCompras[Mês do Projeto],\"<=\" & 5,TBCompras[Até],\">=\"& 5,TBCompras[Meta:Atividade],LEFT(B30,FIND(\" \",B30,1)-1),TBCompras[Tipo de Material],\"CONSUMO\")","v":0},{"$f":"SUMIFS(TBCompras[Valor Total Item (R$)],TBCompras[Mês do Projeto],\"<=\" & 6,TBCompras[Até],\">=\"& 6,TBCompras[Meta:Atividade],LEFT(B30,FIND(\" \",B30,1)-1),TBCompras[Tipo de Material],\"CONSUMO\")","v":0},{"$f":"SUMIFS(TBCompras[Valor Total Item (R$)],TBCompras[Mês do Projeto],\"<=\" & 7,TBCompras[Até],\">=\"& 7,TBCompras[Meta:Atividade],LEFT(B30,FIND(\" \",B30,1)-1),TBCompras[Tipo de Material],\"CONSUMO\")","v":0},{"$f":"SUMIFS(TBCompras[Valor Total Item (R$)],TBCompras[Mês do Projeto],\"<=\" & 8,TBCompras[Até],\">=\"& 8,TBCompras[Meta:Atividade],LEFT(B30,FIND(\" \",B30,1)-1),TBCompras[Tipo de Material],\"CONSUMO\")","v":0},{"$f":"SUMIFS(TBCompras[Valor Total Item (R$)],TBCompras[Mês do Projeto],\"<=\" & 9,TBCompras[Até],\">=\"& 9,TBCompras[Meta:Atividade],LEFT(B30,FIND(\" \",B30,1)-1),TBCompras[Tipo de Material],\"CONSUMO\")","v":0},{"$f":"SUMIFS(TBCompras[Valor Total Item (R$)],TBCompras[Mês do Projeto],\"<=\" & 10,TBCompras[Até],\">=\"& 10,TBCompras[Meta:Atividade],LEFT(B30,FIND(\" \",B30,1)-1),TBCompras[Tipo de Material],\"CONSUMO\")","v":0},{"$f":"SUMIFS(TBCompras[Valor Total Item (R$)],TBCompras[Mês do Projeto],\"<=\" & 11,TBCompras[Até],\">=\"& 11,TBCompras[Meta:Atividade],LEFT(B30,FIND(\" \",B30,1)-1),TBCompras[Tipo de Material],\"CONSUMO\")","v":0},{"$f":"SUMIFS(TBCompras[Valor Total Item (R$)],TBCompras[Mês do Projeto],\"<=\" & 12,TBCompras[Até],\">=\"& 12,TBCompras[Meta:Atividade],LEFT(B30,FIND(\" \",B30,1)-1),TBCompras[Tipo de Material],\"CONSUMO\")","v":0},{"$f":"SUMIFS(TBCompras[Valor Total Item (R$)],TBCompras[Mês do Projeto],\"<=\" & 13,TBCompras[Até],\">=\"& 13,TBCompras[Meta:Atividade],LEFT(B30,FIND(\" \",B30,1)-1),TBCompras[Tipo de Material],\"CONSUMO\")","v":0},{"$f":"SUMIFS(TBCompras[Valor Total Item (R$)],TBCompras[Mês do Projeto],\"<=\" & 14,TBCompras[Até],\">=\"& 14,TBCompras[Meta:Atividade],LEFT(B30,FIND(\" \",B30,1)-1),TBCompras[Tipo de Material],\"CONSUMO\")","v":0},{"$f":"SUMIFS(TBCompras[Valor Total Item (R$)],TBCompras[Mês do Projeto],\"<=\" & 15,TBCompras[Até],\">=\"& 15,TBCompras[Meta:Atividade],LEFT(B30,FIND(\" \",B30,1)-1),TBCompras[Tipo de Material],\"CONSUMO\")","v":0},{"$f":"SUMIFS(TBCompras[Valor Total Item (R$)],TBCompras[Mês do Projeto],\"<=\" & 16,TBCompras[Até],\">=\"& 16,TBCompras[Meta:Atividade],LEFT(B30,FIND(\" \",B30,1)-1),TBCompras[Tipo de Material],\"CONSUMO\")","v":0},{"$f":"SUMIFS(TBCompras[Valor Total Item (R$)],TBCompras[Mês do Projeto],\"<=\" & 17,TBCompras[Até],\">=\"& 17,TBCompras[Meta:Atividade],LEFT(B30,FIND(\" \",B30,1)-1),TBCompras[Tipo de Material],\"CONSUMO\")","v":0},{"$f":"SUMIFS(TBCompras[Valor Total Item (R$)],TBCompras[Mês do Projeto],\"<=\" & 18,TBCompras[Até],\">=\"& 18,TBCompras[Meta:Atividade],LEFT(B30,FIND(\" \",B30,1)-1),TBCompras[Tipo de Material],\"CONSUMO\")","v":0},{"$f":"SUMIFS(TBCompras[Valor Total Item (R$)],TBCompras[Mês do Projeto],\"<=\" & 19,TBCompras[Até],\">=\"& 19,TBCompras[Meta:Atividade],LEFT(B30,FIND(\" \",B30,1)-1),TBCompras[Tipo de Material],\"CONSUMO\")","v":0},{"$f":"SUMIFS(TBCompras[Valor Total Item (R$)],TBCompras[Mês do Projeto],\"<=\" & 20,TBCompras[Até],\">=\"& 20,TBCompras[Meta:Atividade],LEFT(B30,FIND(\" \",B30,1)-1),TBCompras[Tipo de Material],\"CONSUMO\")","v":0},{"$f":"SUMIFS(TBCompras[Valor Total Item (R$)],TBCompras[Mês do Projeto],\"<=\" & 21,TBCompras[Até],\">=\"& 21,TBCompras[Meta:Atividade],LEFT(B30,FIND(\" \",B30,1)-1),TBCompras[Tipo de Material],\"CONSUMO\")","v":0},{"$f":"SUMIFS(TBCompras[Valor Total Item (R$)],TBCompras[Mês do Projeto],\"<=\" & 22,TBCompras[Até],\">=\"& 22,TBCompras[Meta:Atividade],LEFT(B30,FIND(\" \",B30,1)-1),TBCompras[Tipo de Material],\"CONSUMO\")","v":0},{"$f":"SUMIFS(TBCompras[Valor Total Item (R$)],TBCompras[Mês do Projeto],\"<=\" & 23,TBCompras[Até],\">=\"& 23,TBCompras[Meta:Atividade],LEFT(B30,FIND(\" \",B30,1)-1),TBCompras[Tipo de Material],\"CONSUMO\")","v":0},{"$f":"SUMIFS(TBCompras[Valor Total Item (R$)],TBCompras[Mês do Projeto],\"<=\" & 24,TBCompras[Até],\">=\"& 24,TBCompras[Meta:Atividade],LEFT(B30,FIND(\" \",B30,1)-1),TBCompras[Tipo de Material],\"CONSUMO\")","v":0},{"$f":"SUMIFS(TBCompras[Valor Total Item (R$)],TBCompras[Mês do Projeto],\"<=\" & 25,TBCompras[Até],\">=\"& 25,TBCompras[Meta:Atividade],LEFT(B30,FIND(\" \",B30,1)-1),TBCompras[Tipo de Material],\"CONSUMO\")","v":0},{"$f":"SUMIFS(TBCompras[Valor Total Item (R$)],TBCompras[Mês do Projeto],\"<=\" & 26,TBCompras[Até],\">=\"& 26,TBCompras[Meta:Atividade],LEFT(B30,FIND(\" \",B30,1)-1),TBCompras[Tipo de Material],\"CONSUMO\")","v":0},{"$f":"SUMIFS(TBCompras[Valor Total Item (R$)],TBCompras[Mês do Projeto],\"<=\" & 27,TBCompras[Até],\">=\"& 27,TBCompras[Meta:Atividade],LEFT(B30,FIND(\" \",B30,1)-1),TBCompras[Tipo de Material],\"CONSUMO\")","v":0},{"$f":"SUMIFS(TBCompras[Valor Total Item (R$)],TBCompras[Mês do Projeto],\"<=\" & 28,TBCompras[Até],\">=\"& 28,TBCompras[Meta:Atividade],LEFT(B30,FIND(\" \",B30,1)-1),TBCompras[Tipo de Material],\"CONSUMO\")","v":0},{"$f":"SUMIFS(TBCompras[Valor Total Item (R$)],TBCompras[Mês do Projeto],\"<=\" & 29,TBCompras[Até],\">=\"& 29,TBCompras[Meta:Atividade],LEFT(B30,FIND(\" \",B30,1)-1),TBCompras[Tipo de Material],\"CONSUMO\")","v":0},{"$f":"SUMIFS(TBCompras[Valor Total Item (R$)],TBCompras[Mês do Projeto],\"<=\" & 30,TBCompras[Até],\">=\"& 30,TBCompras[Meta:Atividade],LEFT(B30,FIND(\" \",B30,1)-1),TBCompras[Tipo de Material],\"CONSUMO\")","v":0},{"$f":"SUMIFS(TBCompras[Valor Total Item (R$)],TBCompras[Mês do Projeto],\"<=\" & 31,TBCompras[Até],\">=\"& 31,TBCompras[Meta:Atividade],LEFT(B30,FIND(\" \",B30,1)-1),TBCompras[Tipo de Material],\"CONSUMO\")","v":0},{"$f":"SUMIFS(TBCompras[Valor Total Item (R$)],TBCompras[Mês do Projeto],\"<=\" & 32,TBCompras[Até],\">=\"& 32,TBCompras[Meta:Atividade],LEFT(B30,FIND(\" \",B30,1)-1),TBCompras[Tipo de Material],\"CONSUMO\")","v":0},{"$f":"SUMIFS(TBCompras[Valor Total Item (R$)],TBCompras[Mês do Projeto],\"<=\" & 33,TBCompras[Até],\">=\"& 33,TBCompras[Meta:Atividade],LEFT(B30,FIND(\" \",B30,1)-1),TBCompras[Tipo de Material],\"CONSUMO\")","v":0},{"$f":"SUMIFS(TBCompras[Valor Total Item (R$)],TBCompras[Mês do Projeto],\"<=\" & 34,TBCompras[Até],\">=\"& 34,TBCompras[Meta:Atividade],LEFT(B30,FIND(\" \",B30,1)-1),TBCompras[Tipo de Material],\"CONSUMO\")","v":0},{"$f":"SUMIFS(TBCompras[Valor Total Item (R$)],TBCompras[Mês do Projeto],\"<=\" & 35,TBCompras[Até],\">=\"& 35,TBCompras[Meta:Atividade],LEFT(B30,FIND(\" \",B30,1)-1),TBCompras[Tipo de Material],\"CONSUMO\")","v":0},{"$f":"SUMIFS(TBCompras[Valor Total Item (R$)],TBCompras[Mês do Projeto],\"<=\" & 36,TBCompras[Até],\">=\"& 36,TBCompras[Meta:Atividade],LEFT(B30,FIND(\" \",B30,1)-1),TBCompras[Tipo de Material],\"CONSUMO\")","v":0},0]
[null,null,"Equipamentos",{"$f":"SUMIFS(TBCompras[Valor Total Item (R$)],TBCompras[Mês do Projeto],\"<=\" & 1,TBCompras[Até],\">=\"& 1,TBCompras[Meta:Atividade],LEFT(B30,FIND(\" \",B30,1)-1),TBCompras[Tipo de Material],\"EQUIPAMENTO\")","v":0},{"$f":"SUMIFS(TBCompras[Valor Total Item (R$)],TBCompras[Mês do Projeto],\"<=\" & 2,TBCompras[Até],\">=\"& 2,TBCompras[Meta:Atividade],LEFT(B30,FIND(\" \",B30,1)-1),TBCompras[Tipo de Material],\"EQUIPAMENTO\")","v":0},{"$f":"SUMIFS(TBCompras[Valor Total Item (R$)],TBCompras[Mês do Projeto],\"<=\" & 3,TBCompras[Até],\">=\"& 3,TBCompras[Meta:Atividade],LEFT(B30,FIND(\" \",B30,1)-1),TBCompras[Tipo de Material],\"EQUIPAMENTO\")","v":0},{"$f":"SUMIFS(TBCompras[Valor Total Item (R$)],TBCompras[Mês do Projeto],\"<=\" & 4,TBCompras[Até],\">=\"& 4,TBCompras[Meta:Atividade],LEFT(B30,FIND(\" \",B30,1)-1),TBCompras[Tipo de Material],\"EQUIPAMENTO\")","v":0},{"$f":"SUMIFS(TBCompras[Valor Total Item (R$)],TBCompras[Mês do Projeto],\"<=\" & 5,TBCompras[Até],\">=\"& 5,TBCompras[Meta:Atividade],LEFT(B30,FIND(\" \",B30,1)-1),TBCompras[Tipo de Material],\"EQUIPAMENTO\")","v":0},{"$f":"SUMIFS(TBCompras[Valor Total Item (R$)],TBCompras[Mês do Projeto],\"<=\" & 6,TBCompras[Até],\">=\"& 6,TBCompras[Meta:Atividade],LEFT(B30,FIND(\" \",B30,1)-1),TBCompras[Tipo de Material],\"EQUIPAMENTO\")","v":0},{"$f":"SUMIFS(TBCompras[Valor Total Item (R$)],TBCompras[Mês do Projeto],\"<=\" & 7,TBCompras[Até],\">=\"& 7,TBCompras[Meta:Atividade],LEFT(B30,FIND(\" \",B30,1)-1),TBCompras[Tipo de Material],\"EQUIPAMENTO\")","v":0},{"$f":"SUMIFS(TBCompras[Valor Total Item (R$)],TBCompras[Mês do Projeto],\"<=\" & 8,TBCompras[Até],\">=\"& 8,TBCompras[Meta:Atividade],LEFT(B30,FIND(\" \",B30,1)-1),TBCompras[Tipo de Material],\"EQUIPAMENTO\")","v":0},{"$f":"SUMIFS(TBCompras[Valor Total Item (R$)],TBCompras[Mês do Projeto],\"<=\" & 9,TBCompras[Até],\">=\"& 9,TBCompras[Meta:Atividade],LEFT(B30,FIND(\" \",B30,1)-1),TBCompras[Tipo de Material],\"EQUIPAMENTO\")","v":0},{"$f":"SUMIFS(TBCompras[Valor Total Item (R$)],TBCompras[Mês do Projeto],\"<=\" & 10,TBCompras[Até],\">=\"& 10,TBCompras[Meta:Atividade],LEFT(B30,FIND(\" \",B30,1)-1),TBCompras[Tipo de Material],\"EQUIPAMENTO\")","v":0},{"$f":"SUMIFS(TBCompras[Valor Total Item (R$)],TBCompras[Mês do Projeto],\"<=\" & 11,TBCompras[Até],\">=\"& 11,TBCompras[Meta:Atividade],LEFT(B30,FIND(\" \",B30,1)-1),TBCompras[Tipo de Material],\"EQUIPAMENTO\")","v":0},{"$f":"SUMIFS(TBCompras[Valor Total Item (R$)],TBCompras[Mês do Projeto],\"<=\" & 12,TBCompras[Até],\">=\"& 12,TBCompras[Meta:Atividade],LEFT(B30,FIND(\" \",B30,1)-1),TBCompras[Tipo de Material],\"EQUIPAMENTO\")","v":0},{"$f":"SUMIFS(TBCompras[Valor Total Item (R$)],TBCompras[Mês do Projeto],\"<=\" & 13,TBCompras[Até],\">=\"& 13,TBCompras[Meta:Atividade],LEFT(B30,FIND(\" \",B30,1)-1),TBCompras[Tipo de Material],\"EQUIPAMENTO\")","v":0},{"$f":"SUMIFS(TBCompras[Valor Total Item (R$)],TBCompras[Mês do Projeto],\"<=\" & 14,TBCompras[Até],\">=\"& 14,TBCompras[Meta:Atividade],LEFT(B30,FIND(\" \",B30,1)-1),TBCompras[Tipo de Material],\"EQUIPAMENTO\")","v":0},{"$f":"SUMIFS(TBCompras[Valor Total Item (R$)],TBCompras[Mês do Projeto],\"<=\" & 15,TBCompras[Até],\">=\"& 15,TBCompras[Meta:Atividade],LEFT(B30,FIND(\" \",B30,1)-1),TBCompras[Tipo de Material],\"EQUIPAMENTO\")","v":0},{"$f":"SUMIFS(TBCompras[Valor Total Item (R$)],TBCompras[Mês do Projeto],\"<=\" & 16,TBCompras[Até],\">=\"& 16,TBCompras[Meta:Atividade],LEFT(B30,FIND(\" \",B30,1)-1),TBCompras[Tipo de Material],\"EQUIPAMENTO\")","v":0},{"$f":"SUMIFS(TBCompras[Valor Total Item (R$)],TBCompras[Mês do Projeto],\"<=\" & 17,TBCompras[Até],\">=\"& 17,TBCompras[Meta:Atividade],LEFT(B30,FIND(\" \",B30,1)-1),TBCompras[Tipo de Material],\"EQUIPAMENTO\")","v":0},{"$f":"SUMIFS(TBCompras[Valor Total Item (R$)],TBCompras[Mês do Projeto],\"<=\" & 18,TBCompras[Até],\">=\"& 18,TBCompras[Meta:Atividade],LEFT(B30,FIND(\" \",B30,1)-1),TBCompras[Tipo de Material],\"EQUIPAMENTO\")","v":0},{"$f":"SUMIFS(TBCompras[Valor Total Item (R$)],TBCompras[Mês do Projeto],\"<=\" & 19,TBCompras[Até],\">=\"& 19,TBCompras[Meta:Atividade],LEFT(B30,FIND(\" \",B30,1)-1),TBCompras[Tipo de Material],\"EQUIPAMENTO\")","v":0},{"$f":"SUMIFS(TBCompras[Valor Total Item (R$)],TBCompras[Mês do Projeto],\"<=\" & 20,TBCompras[Até],\">=\"& 20,TBCompras[Meta:Atividade],LEFT(B30,FIND(\" \",B30,1)-1),TBCompras[Tipo de Material],\"EQUIPAMENTO\")","v":0},{"$f":"SUMIFS(TBCompras[Valor Total Item (R$)],TBCompras[Mês do Projeto],\"<=\" & 21,TBCompras[Até],\">=\"& 21,TBCompras[Meta:Atividade],LEFT(B30,FIND(\" \",B30,1)-1),TBCompras[Tipo de Material],\"EQUIPAMENTO\")","v":0},{"$f":"SUMIFS(TBCompras[Valor Total Item (R$)],TBCompras[Mês do Projeto],\"<=\" & 22,TBCompras[Até],\">=\"& 22,TBCompras[Meta:Atividade],LEFT(B30,FIND(\" \",B30,1)-1),TBCompras[Tipo de Material],\"EQUIPAMENTO\")","v":0},{"$f":"SUMIFS(TBCompras[Valor Total Item (R$)],TBCompras[Mês do Projeto],\"<=\" & 23,TBCompras[Até],\">=\"& 23,TBCompras[Meta:Atividade],LEFT(B30,FIND(\" \",B30,1)-1),TBCompras[Tipo de Material],\"EQUIPAMENTO\")","v":0},{"$f":"SUMIFS(TBCompras[Valor Total Item (R$)],TBCompras[Mês do Projeto],\"<=\" & 24,TBCompras[Até],\">=\"& 24,TBCompras[Meta:Atividade],LEFT(B30,FIND(\" \",B30,1)-1),TBCompras[Tipo de Material],\"EQUIPAMENTO\")","v":0},{"$f":"SUMIFS(TBCompras[Valor Total Item (R$)],TBCompras[Mês do Projeto],\"<=\" & 25,TBCompras[Até],\">=\"& 25,TBCompras[Meta:Atividade],LEFT(B30,FIND(\" \",B30,1)-1),TBCompras[Tipo de Material],\"EQUIPAMENTO\")","v":0},{"$f":"SUMIFS(TBCompras[Valor Total Item (R$)],TBCompras[Mês do Projeto],\"<=\" & 26,TBCompras[Até],\">=\"& 26,TBCompras[Meta:Atividade],LEFT(B30,FIND(\" \",B30,1)-1),TBCompras[Tipo de Material],\"EQUIPAMENTO\")","v":0},{"$f":"SUMIFS(TBCompras[Valor Total Item (R$)],TBCompras[Mês do Projeto],\"<=\" & 27,TBCompras[Até],\">=\"& 27,TBCompras[Meta:Atividade],LEFT(B30,FIND(\" \",B30,1)-1),TBCompras[Tipo de Material],\"EQUIPAMENTO\")","v":0},{"$f":"SUMIFS(TBCompras[Valor Total Item (R$)],TBCompras[Mês do Projeto],\"<=\" & 28,TBCompras[Até],\">=\"& 28,TBCompras[Meta:Atividade],LEFT(B30,FIND(\" \",B30,1)-1),TBCompras[Tipo de Material],\"EQUIPAMENTO\")","v":0},{"$f":"SUMIFS(TBCompras[Valor Total Item (R$)],TBCompras[Mês do Projeto],\"<=\" & 29,TBCompras[Até],\">=\"& 29,TBCompras[Meta:Atividade],LEFT(B30,FIND(\" \",B30,1)-1),TBCompras[Tipo de Material],\"EQUIPAMENTO\")","v":0},{"$f":"SUMIFS(TBCompras[Valor Total Item (R$)],TBCompras[Mês do Projeto],\"<=\" & 30,TBCompras[Até],\">=\"& 30,TBCompras[Meta:Atividade],LEFT(B30,FIND(\" \",B30,1)-1),TBCompras[Tipo de Material],\"EQUIPAMENTO\")","v":0},{"$f":"SUMIFS(TBCompras[Valor Total Item (R$)],TBCompras[Mês do Projeto],\"<=\" & 31,TBCompras[Até],\">=\"& 31,TBCompras[Meta:Atividade],LEFT(B30,FIND(\" \",B30,1)-1),TBCompras[Tipo de Material],\"EQUIPAMENTO\")","v":0},{"$f":"SUMIFS(TBCompras[Valor Total Item (R$)],TBCompras[Mês do Projeto],\"<=\" & 32,TBCompras[Até],\">=\"& 32,TBCompras[Meta:Atividade],LEFT(B30,FIND(\" \",B30,1)-1),TBCompras[Tipo de Material],\"EQUIPAMENTO\")","v":0},{"$f":"SUMIFS(TBCompras[Valor Total Item (R$)],TBCompras[Mês do Projeto],\"<=\" & 33,TBCompras[Até],\">=\"& 33,TBCompras[Meta:Atividade],LEFT(B30,FIND(\" \",B30,1)-1),TBCompras[Tipo de Material],\"EQUIPAMENTO\")","v":0},{"$f":"SUMIFS(TBCompras[Valor Total Item (R$)],TBCompras[Mês do Projeto],\"<=\" & 34,TBCompras[Até],\">=\"& 34,TBCompras[Meta:Atividade],LEFT(B30,FIND(\" \",B30,1)-1),TBCompras[Tipo de Material],\"EQUIPAMENTO\")","v":0},{"$f":"SUMIFS(TBCompras[Valor Total Item (R$)],TBCompras[Mês do Projeto],\"<=\" & 35,TBCompras[Até],\">=\"& 35,TBCompras[Meta:Atividade],LEFT(B30,FIND(\" \",B30,1)-1),TBCompras[Tipo de Material],\"EQUIPAMENTO\")","v":0},{"$f":"SUMIFS(TBCompras[Valor Total Item (R$)],TBCompras[Mês do Projeto],\"<=\" & 36,TBCompras[Até],\">=\"& 36,TBCompras[Meta:Atividade],LEFT(B30,FIND(\" \",B30,1)-1),TBCompras[Tipo de Material],\"EQUIPAMENTO\")","v":0},0]
[null,null,"Total Atividade 2.1",{"$f":"SUBTOTAL(9,D30:D35)","v":0},0,0,0,0,0,0,0,0,0,0,0,0,0,0,0,0,0,0,0,0,0,0,0,0,0,0,0,0,0,0,0,0,0,0,0,0]
[null,"Total da Meta 2",null,{"$f":"SUBTOTAL(9,D30:D36)","v":0},0,0,0,0,0,0,0,0,0,0,0,0,0,0,0,0,0,0,0,0,0,0,0,0,0,0,0,0,0,0,0,0,0,0,0,0]
["Meta 3 - Produção e certificação do Lote semente Viral","3.1 - Produção do Lote semente vacinal","Pessoa Física",{"$f":"SUMIFS(TbPessoas[Custo Total Mensal],TbPessoas[A partir do mês],\"<=\" & 1,TbPessoas[Até],\">=\"& 1,TbPessoas[Meta:Atividade],LEFT(B38,FIND(\" \",B38,1)-1))","v":0},{"$f":"SUMIFS(TbPessoas[Custo Total Mensal],TbPessoas[A partir do mês],\"<=\" & 2,TbPessoas[Até],\">=\"& 2,TbPessoas[Meta:Atividade],LEFT(B38,FIND(\" \",B38,1)-1))","v":0},{"$f":"SUMIFS(TbPessoas[Custo Total Mensal],TbPessoas[A partir do mês],\"<=\" & 3,TbPessoas[Até],\">=\"& 3,TbPessoas[Meta:Atividade],LEFT(B38,FIND(\" \",B38,1)-1))","v":0},{"$f":"SUMIFS(TbPessoas[Custo Total Mensal],TbPessoas[A partir do mês],\"<=\" & 4,TbPessoas[Até],\">=\"& 4,TbPessoas[Meta:Atividade],LEFT(B38,FIND(\" \",B38,1)-1))","v":0},{"$f":"SUMIFS(TbPessoas[Custo Total Mensal],TbPessoas[A partir do mês],\"<=\" & 5,TbPessoas[Até],\">=\"& 5,TbPessoas[Meta:Atividade],LEFT(B38,FIND(\" \",B38,1)-1))","v":0},{"$f":"SUMIFS(TbPessoas[Custo Total Mensal],TbPessoas[A partir do mês],\"<=\" & 6,TbPessoas[Até],\">=\"& 6,TbPessoas[Meta:Atividade],LEFT(B38,FIND(\" \",B38,1)-1))","v":0},{"$f":"SUMIFS(TbPessoas[Custo Total Mensal],TbPessoas[A partir do mês],\"<=\" & 7,TbPessoas[Até],\">=\"& 7,TbPessoas[Meta:Atividade],LEFT(B38,FIND(\" \",B38,1)-1))","v":0},{"$f":"SUMIFS(TbPessoas[Custo Total Mensal],TbPessoas[A partir do mês],\"<=\" & 8,TbPessoas[Até],\">=\"& 8,TbPessoas[Meta:Atividade],LEFT(B38,FIND(\" \",B38,1)-1))","v":0},{"$f":"SUMIFS(TbPessoas[Custo Total Mensal],TbPessoas[A partir do mês],\"<=\" & 9,TbPessoas[Até],\">=\"& 9,TbPessoas[Meta:Atividade],LEFT(B38,FIND(\" \",B38,1)-1))","v":0},{"$f":"SUMIFS(TbPessoas[Custo Total Mensal],TbPessoas[A partir do mês],\"<=\" & 10,TbPessoas[Até],\">=\"& 10,TbPessoas[Meta:Atividade],LEFT(B38,FIND(\" \",B38,1)-1))","v":0},{"$f":"SUMIFS(TbPessoas[Custo Total Mensal],TbPessoas[A partir do mês],\"<=\" & 11,TbPessoas[Até],\">=\"& 11,TbPessoas[Meta:Atividade],LEFT(B38,FIND(\" \",B38,1)-1))","v":0},{"$f":"SUMIFS(TbPessoas[Custo Total Mensal],TbPessoas[A partir do mês],\"<=\" & 12,TbPessoas[Até],\">=\"& 12,TbPessoas[Meta:Atividade],LEFT(B38,FIND(\" \",B38,1)-1))","v":0},{"$f":"SUMIFS(TbPessoas[Custo Total Mensal],TbPessoas[A partir do mês],\"<=\" & 13,TbPessoas[Até],\">=\"& 13,TbPessoas[Meta:Atividade],LEFT(B38,FIND(\" \",B38,1)-1))","v":0},{"$f":"SUMIFS(TbPessoas[Custo Total Mensal],TbPessoas[A partir do mês],\"<=\" & 14,TbPessoas[Até],\">=\"& 14,TbPessoas[Meta:Atividade],LEFT(B38,FIND(\" \",B38,1)-1))","v":0},{"$f":"SUMIFS(TbPessoas[Custo Total Mensal],TbPessoas[A partir do mês],\"<=\" & 15,TbPessoas[Até],\">=\"& 15,TbPessoas[Meta:Atividade],LEFT(B38,FIND(\" \",B38,1)-1))","v":0},{"$f":"SUMIFS(TbPessoas[Custo Total Mensal],TbPessoas[A partir do mês],\"<=\" & 16,TbPessoas[Até],\">=\"& 16,TbPessoas[Meta:Atividade],LEFT(B38,FIND(\" \",B38,1)-1))","v":0},{"$f":"SUMIFS(TbPessoas[Custo Total Mensal],TbPessoas[A partir do mês],\"<=\" & 17,TbPessoas[Até],\">=\"& 17,TbPessoas[Meta:Atividade],LEFT(B38,FIND(\" \",B38,1)-1))","v":0},{"$f":"SUMIFS(TbPessoas[Custo Total Mensal],TbPessoas[A partir do mês],\"<=\" & 18,TbPessoas[Até],\">=\"& 18,TbPessoas[Meta:Atividade],LEFT(B38,FIND(\" \",B38,1)-1))","v":0},{"$f":"SUMIFS(TbPessoas[Custo Total Mensal],TbPessoas[A partir do mês],\"<=\" & 19,TbPessoas[Até],\">=\"& 19,TbPessoas[Meta:Atividade],LEFT(B38,FIND(\" \",B38,1)-1))","v":0},{"$f":"SUMIFS(TbPessoas[Custo Total Mensal],TbPessoas[A partir do mês],\"<=\" & 20,TbPessoas[Até],\">=\"& 20,TbPessoas[Meta:Atividade],LEFT(B38,FIND(\" \",B38,1)-1))","v":0},{"$f":"SUMIFS(TbPessoas[Custo Total Mensal],TbPessoas[A partir do mês],\"<=\" & 21,TbPessoas[Até],\">=\"& 21,TbPessoas[Meta:Atividade],LEFT(B38,FIND(\" \",B38,1)-1))","v":0},{"$f":"SUMIFS(TbPessoas[Custo Total Mensal],TbPessoas[A partir do mês],\"<=\" & 22,TbPessoas[Até],\">=\"& 22,TbPessoas[Meta:Atividade],LEFT(B38,FIND(\" \",B38,1)-1))","v":0},{"$f":"SUMIFS(TbPessoas[Custo Total Mensal],TbPessoas[A partir do mês],\"<=\" & 23,TbPessoas[Até],\">=\"& 23,TbPessoas[Meta:Atividade],LEFT(B38,FIND(\" \",B38,1)-1))","v":0},{"$f":"SUMIFS(TbPessoas[Custo Total Mensal],TbPessoas[A partir do mês],\"<=\" & 24,TbPessoas[Até],\">=\"& 24,TbPessoas[Meta:Atividade],LEFT(B38,FIND(\" \",B38,1)-1))","v":0},{"$f":"SUMIFS(TbPessoas[Custo Total Mensal],TbPessoas[A partir do mês],\"<=\" & 25,TbPessoas[Até],\">=\"& 25,TbPessoas[Meta:Atividade],LEFT(B38,FIND(\" \",B38,1)-1))","v":0},{"$f":"SUMIFS(TbPessoas[Custo Total Mensal],TbPessoas[A partir do mês],\"<=\" & 26,TbPessoas[Até],\">=\"& 26,TbPessoas[Meta:Atividade],LEFT(B38,FIND(\" \",B38,1)-1))","v":0},{"$f":"SUMIFS(TbPessoas[Custo Total Mensal],TbPessoas[A partir do mês],\"<=\" & 27,TbPessoas[Até],\">=\"& 27,TbPessoas[Meta:Atividade],LEFT(B38,FIND(\" \",B38,1)-1))","v":0},{"$f":"SUMIFS(TbPessoas[Custo Total Mensal],TbPessoas[A partir do mês],\"<=\" & 28,TbPessoas[Até],\">=\"& 28,TbPessoas[Meta:Atividade],LEFT(B38,FIND(\" \",B38,1)-1))","v":0},{"$f":"SUMIFS(TbPessoas[Custo Total Mensal],TbPessoas[A partir do mês],\"<=\" & 29,TbPessoas[Até],\">=\"& 29,TbPessoas[Meta:Atividade],LEFT(B38,FIND(\" \",B38,1)-1))","v":0},{"$f":"SUMIFS(TbPessoas[Custo Total Mensal],TbPessoas[A partir do mês],\"<=\" & 30,TbPessoas[Até],\">=\"& 30,TbPessoas[Meta:Atividade],LEFT(B38,FIND(\" \",B38,1)-1))","v":0},{"$f":"SUMIFS(TbPessoas[Custo Total Mensal],TbPessoas[A partir do mês],\"<=\" & 31,TbPessoas[Até],\">=\"& 31,TbPessoas[Meta:Atividade],LEFT(B38,FIND(\" \",B38,1)-1))","v":0},{"$f":"SUMIFS(TbPessoas[Custo Total Mensal],TbPessoas[A partir do mês],\"<=\" & 32,TbPessoas[Até],\">=\"& 32,TbPessoas[Meta:Atividade],LEFT(B38,FIND(\" \",B38,1)-1))","v":0},{"$f":"SUMIFS(TbPessoas[Custo Total Mensal],TbPessoas[A partir do mês],\"<=\" & 33,TbPessoas[Até],\">=\"& 33,TbPessoas[Meta:Atividade],LEFT(B38,FIND(\" \",B38,1)-1))","v":0},{"$f":"SUMIFS(TbPessoas[Custo Total Mensal],TbPessoas[A partir do mês],\"<=\" & 34,TbPessoas[Até],\">=\"& 34,TbPessoas[Meta:Atividade],LEFT(B38,FIND(\" \",B38,1)-1))","v":0},{"$f":"SUMIFS(TbPessoas[Custo Total Mensal],TbPessoas[A partir do mês],\"<=\" & 35,TbPessoas[Até],\">=\"& 35,TbPessoas[Meta:Atividade],LEFT(B38,FIND(\" \",B38,1)-1))","v":0},{"$f":"SUMIFS(TbPessoas[Custo Total Mensal],TbPessoas[A partir do mês],\"<=\" & 36,TbPessoas[Até],\">=\"& 36,TbPessoas[Meta:Atividade],LEFT(B38,FIND(\" \",B38,1)-1))","v":0},{"$f":"SUM(D38:AM38)","v":0}]
[null,null,"Pessoa Jurídica",{"$f":"SUMIFS(TBCompras[Valor Total Item (R$)],TBCompras[Mês do Projeto],\"<=\" & 1,TBCompras[Até],\">=\"& 1,TBCompras[Meta:Atividade],LEFT(B38,FIND(\" \",B38,1)-1),TBCompras[Tipo de Material],\"SERVIÇO\")","v":0},{"$f":"SUMIFS(TBCompras[Valor Total Item (R$)],TBCompras[Mês do Projeto],\"<=\" & 2,TBCompras[Até],\">=\"& 2,TBCompras[Meta:Atividade],LEFT(B38,FIND(\" \",B38,1)-1),TBCompras[Tipo de Material],\"SERVIÇO\")","v":0},{"$f":"SUMIFS(TBCompras[Valor Total Item (R$)],TBCompras[Mês do Projeto],\"<=\" & 3,TBCompras[Até],\">=\"& 3,TBCompras[Meta:Atividade],LEFT(B38,FIND(\" \",B38,1)-1),TBCompras[Tipo de Material],\"SERVIÇO\")","v":0},{"$f":"SUMIFS(TBCompras[Valor Total Item (R$)],TBCompras[Mês do Projeto],\"<=\" & 4,TBCompras[Até],\">=\"& 4,TBCompras[Meta:Atividade],LEFT(B38,FIND(\" \",B38,1)-1),TBCompras[Tipo de Material],\"SERVIÇO\")","v":0},{"$f":"SUMIFS(TBCompras[Valor Total Item (R$)],TBCompras[Mês do Projeto],\"<=\" & 5,TBCompras[Até],\">=\"& 5,TBCompras[Meta:Atividade],LEFT(B38,FIND(\" \",B38,1)-1),TBCompras[Tipo de Material],\"SERVIÇO\")","v":0},{"$f":"SUMIFS(TBCompras[Valor Total Item (R$)],TBCompras[Mês do Projeto],\"<=\" & 6,TBCompras[Até],\">=\"& 6,TBCompras[Meta:Atividade],LEFT(B38,FIND(\" \",B38,1)-1),TBCompras[Tipo de Material],\"SERVIÇO\")","v":0},{"$f":"SUMIFS(TBCompras[Valor Total Item (R$)],TBCompras[Mês do Projeto],\"<=\" & 7,TBCompras[Até],\">=\"& 7,TBCompras[Meta:Atividade],LEFT(B38,FIND(\" \",B38,1)-1),TBCompras[Tipo de Material],\"SERVIÇO\")","v":0},{"$f":"SUMIFS(TBCompras[Valor Total Item (R$)],TBCompras[Mês do Projeto],\"<=\" & 8,TBCompras[Até],\">=\"& 8,TBCompras[Meta:Atividade],LEFT(B38,FIND(\" \",B38,1)-1),TBCompras[Tipo de Material],\"SERVIÇO\")","v":0},{"$f":"SUMIFS(TBCompras[Valor Total Item (R$)],TBCompras[Mês do Projeto],\"<=\" & 9,TBCompras[Até],\">=\"& 9,TBCompras[Meta:Atividade],LEFT(B38,FIND(\" \",B38,1)-1),TBCompras[Tipo de Material],\"SERVIÇO\")","v":0},{"$f":"SUMIFS(TBCompras[Valor Total Item (R$)],TBCompras[Mês do Projeto],\"<=\" & 10,TBCompras[Até],\">=\"& 10,TBCompras[Meta:Atividade],LEFT(B38,FIND(\" \",B38,1)-1),TBCompras[Tipo de Material],\"SERVIÇO\")","v":0},{"$f":"SUMIFS(TBCompras[Valor Total Item (R$)],TBCompras[Mês do Projeto],\"<=\" & 11,TBCompras[Até],\">=\"& 11,TBCompras[Meta:Atividade],LEFT(B38,FIND(\" \",B38,1)-1),TBCompras[Tipo de Material],\"SERVIÇO\")","v":0},{"$f":"SUMIFS(TBCompras[Valor Total Item (R$)],TBCompras[Mês do Projeto],\"<=\" & 12,TBCompras[Até],\">=\"& 12,TBCompras[Meta:Atividade],LEFT(B38,FIND(\" \",B38,1)-1),TBCompras[Tipo de Material],\"SERVIÇO\")","v":0},{"$f":"SUMIFS(TBCompras[Valor Total Item (R$)],TBCompras[Mês do Projeto],\"<=\" & 13,TBCompras[Até],\">=\"& 13,TBCompras[Meta:Atividade],LEFT(B38,FIND(\" \",B38,1)-1),TBCompras[Tipo de Material],\"SERVIÇO\")","v":0},{"$f":"SUMIFS(TBCompras[Valor Total Item (R$)],TBCompras[Mês do Projeto],\"<=\" & 14,TBCompras[Até],\">=\"& 14,TBCompras[Meta:Atividade],LEFT(B38,FIND(\" \",B38,1)-1),TBCompras[Tipo de Material],\"SERVIÇO\")","v":0},{"$f":"SUMIFS(TBCompras[Valor Total Item (R$)],TBCompras[Mês do Projeto],\"<=\" & 15,TBCompras[Até],\">=\"& 15,TBCompras[Meta:Atividade],LEFT(B38,FIND(\" \",B38,1)-1),TBCompras[Tipo de Material],\"SERVIÇO\")","v":0},{"$f":"SUMIFS(TBCompras[Valor Total Item (R$)],TBCompras[Mês do Projeto],\"<=\" & 16,TBCompras[Até],\">=\"& 16,TBCompras[Meta:Atividade],LEFT(B38,FIND(\" \",B38,1)-1),TBCompras[Tipo de Material],\"SERVIÇO\")","v":0},{"$f":"SUMIFS(TBCompras[Valor Total Item (R$)],TBCompras[Mês do Projeto],\"<=\" & 17,TBCompras[Até],\">=\"& 17,TBCompras[Meta:Atividade],LEFT(B38,FIND(\" \",B38,1)-1),TBCompras[Tipo de Material],\"SERVIÇO\")","v":0},{"$f":"SUMIFS(TBCompras[Valor Total Item (R$)],TBCompras[Mês do Projeto],\"<=\" & 18,TBCompras[Até],\">=\"& 18,TBCompras[Meta:Atividade],LEFT(B38,FIND(\" \",B38,1)-1),TBCompras[Tipo de Material],\"SERVIÇO\")","v":0},{"$f":"SUMIFS(TBCompras[Valor Total Item (R$)],TBCompras[Mês do Projeto],\"<=\" & 19,TBCompras[Até],\">=\"& 19,TBCompras[Meta:Atividade],LEFT(B38,FIND(\" \",B38,1)-1),TBCompras[Tipo de Material],\"SERVIÇO\")","v":0},{"$f":"SUMIFS(TBCompras[Valor Total Item (R$)],TBCompras[Mês do Projeto],\"<=\" & 20,TBCompras[Até],\">=\"& 20,TBCompras[Meta:Atividade],LEFT(B38,FIND(\" \",B38,1)-1),TBCompras[Tipo de Material],\"SERVIÇO\")","v":0},{"$f":"SUMIFS(TBCompras[Valor Total Item (R$)],TBCompras[Mês do Projeto],\"<=\" & 21,TBCompras[Até],\">=\"& 21,TBCompras[Meta:Atividade],LEFT(B38,FIND(\" \",B38,1)-1),TBCompras[Tipo de Material],\"SERVIÇO\")","v":0},{"$f":"SUMIFS(TBCompras[Valor Total Item (R$)],TBCompras[Mês do Projeto],\"<=\" & 22,TBCompras[Até],\">=\"& 22,TBCompras[Meta:Atividade],LEFT(B38,FIND(\" \",B38,1)-1),TBCompras[Tipo de Material],\"SERVIÇO\")","v":0},{"$f":"SUMIFS(TBCompras[Valor Total Item (R$)],TBCompras[Mês do Projeto],\"<=\" & 23,TBCompras[Até],\">=\"& 23,TBCompras[Meta:Atividade],LEFT(B38,FIND(\" \",B38,1)-1),TBCompras[Tipo de Material],\"SERVIÇO\")","v":0},{"$f":"SUMIFS(TBCompras[Valor Total Item (R$)],TBCompras[Mês do Projeto],\"<=\" & 24,TBCompras[Até],\">=\"& 24,TBCompras[Meta:Atividade],LEFT(B38,FIND(\" \",B38,1)-1),TBCompras[Tipo de Material],\"SERVIÇO\")","v":0},{"$f":"SUMIFS(TBCompras[Valor Total Item (R$)],TBCompras[Mês do Projeto],\"<=\" & 25,TBCompras[Até],\">=\"& 25,TBCompras[Meta:Atividade],LEFT(B38,FIND(\" \",B38,1)-1),TBCompras[Tipo de Material],\"SERVIÇO\")","v":0},{"$f":"SUMIFS(TBCompras[Valor Total Item (R$)],TBCompras[Mês do Projeto],\"<=\" & 26,TBCompras[Até],\">=\"& 26,TBCompras[Meta:Atividade],LEFT(B38,FIND(\" \",B38,1)-1),TBCompras[Tipo de Material],\"SERVIÇO\")","v":0},{"$f":"SUMIFS(TBCompras[Valor Total Item (R$)],TBCompras[Mês do Projeto],\"<=\" & 27,TBCompras[Até],\">=\"& 27,TBCompras[Meta:Atividade],LEFT(B38,FIND(\" \",B38,1)-1),TBCompras[Tipo de Material],\"SERVIÇO\")","v":0},{"$f":"SUMIFS(TBCompras[Valor Total Item (R$)],TBCompras[Mês do Projeto],\"<=\" & 28,TBCompras[Até],\">=\"& 28,TBCompras[Meta:Atividade],LEFT(B38,FIND(\" \",B38,1)-1),TBCompras[Tipo de Material],\"SERVIÇO\")","v":0},{"$f":"SUMIFS(TBCompras[Valor Total Item (R$)],TBCompras[Mês do Projeto],\"<=\" & 29,TBCompras[Até],\">=\"& 29,TBCompras[Meta:Atividade],LEFT(B38,FIND(\" \",B38,1)-1),TBCompras[Tipo de Material],\"SERVIÇO\")","v":0},{"$f":"SUMIFS(TBCompras[Valor Total Item (R$)],TBCompras[Mês do Projeto],\"<=\" & 30,TBCompras[Até],\">=\"& 30,TBCompras[Meta:Atividade],LEFT(B38,FIND(\" \",B38,1)-1),TBCompras[Tipo de Material],\"SERVIÇO\")","v":0},{"$f":"SUMIFS(TBCompras[Valor Total Item (R$)],TBCompras[Mês do Projeto],\"<=\" & 31,TBCompras[Até],\">=\"& 31,TBCompras[Meta:Atividade],LEFT(B38,FIND(\" \",B38,1)-1),TBCompras[Tipo de Material],\"SERVIÇO\")","v":0},{"$f":"SUMIFS(TBCompras[Valor Total Item (R$)],TBCompras[Mês do Projeto],\"<=\" & 32,TBCompras[Até],\">=\"& 32,TBCompras[Meta:Atividade],LEFT(B38,FIND(\" \",B38,1)-1),TBCompras[Tipo de Material],\"SERVIÇO\")","v":0},{"$f":"SUMIFS(TBCompras[Valor Total Item (R$)],TBCompras[Mês do Projeto],\"<=\" & 33,TBCompras[Até],\">=\"& 33,TBCompras[Meta:Atividade],LEFT(B38,FIND(\" \",B38,1)-1),TBCompras[Tipo de Material],\"SERVIÇO\")","v":0},{"$f":"SUMIFS(TBCompras[Valor Total Item (R$)],TBCompras[Mês do Projeto],\"<=\" & 34,TBCompras[Até],\">=\"& 34,TBCompras[Meta:Atividade],LEFT(B38,FIND(\" \",B38,1)-1),TBCompras[Tipo de Material],\"SERVIÇO\")","v":0},{"$f":"SUMIFS(TBCompras[Valor Total Item (R$)],TBCompras[Mês do Projeto],\"<=\" & 35,TBCompras[Até],\">=\"& 35,TBCompras[Meta:Atividade],LEFT(B38,FIND(\" \",B38,1)-1),TBCompras[Tipo de Material],\"SERVIÇO\")","v":0},{"$f":"SUMIFS(TBCompras[Valor Total Item (R$)],TBCompras[Mês do Projeto],\"<=\" & 36,TBCompras[Até],\">=\"& 36,TBCompras[Meta:Atividade],LEFT(B38,FIND(\" \",B38,1)-1),TBCompras[Tipo de Material],\"SERVIÇO\")","v":0},0]
[null,null,"Passagens",{"$f":"SUMIFS(TbPassagens[Valor Total Passagem],TbPassagens[A partir do mês],\"<=\" & 1,TbPassagens[Até],\">=\"& 1,TbPassagens[Meta:Atividade],LEFT(B38,FIND(\" \",B38,1)-1))","v":0},{"$f":"SUMIFS(TbPassagens[Valor Total Passagem],TbPassagens[A partir do mês],\"<=\" & 2,TbPassagens[Até],\">=\"& 2,TbPassagens[Meta:Atividade],LEFT(B38,FIND(\" \",B38,1)-1))","v":0},{"$f":"SUMIFS(TbPassagens[Valor Total Passagem],TbPassagens[A partir do mês],\"<=\" & 3,TbPassagens[Até],\">=\"& 3,TbPassagens[Meta:Atividade],LEFT(B38,FIND(\" \",B38,1)-1))","v":0},{"$f":"SUMIFS(TbPassagens[Valor Total Passagem],TbPassagens[A partir do mês],\"<=\" & 4,TbPassagens[Até],\">=\"& 4,TbPassagens[Meta:Atividade],LEFT(B38,FIND(\" \",B38,1)-1))","v":0},{"$f":"SUMIFS(TbPassagens[Valor Total Passagem],TbPassagens[A partir do mês],\"<=\" & 5,TbPassagens[Até],\">=\"& 5,TbPassagens[Meta:Atividade],LEFT(B38,FIND(\" \",B38,1)-1))","v":0},{"$f":"SUMIFS(TbPassagens[Valor Total Passagem],TbPassagens[A partir do mês],\"<=\" & 6,TbPassagens[Até],\">=\"& 6,TbPassagens[Meta:Atividade],LEFT(B38,FIND(\" \",B38,1)-1))","v":0},{"$f":"SUMIFS(TbPassagens[Valor Total Passagem],TbPassagens[A partir do mês],\"<=\" & 7,TbPassagens[Até],\">=\"& 7,TbPassagens[Meta:Atividade],LEFT(B38,FIND(\" \",B38,1)-1))","v":0},{"$f":"SUMIFS(TbPassagens[Valor Total Passagem],TbPassagens[A partir do mês],\"<=\" & 8,TbPassagens[Até],\">=\"& 8,TbPassagens[Meta:Atividade],LEFT(B38,FIND(\" \",B38,1)-1))","v":0},{"$f":"SUMIFS(TbPassagens[Valor Total Passagem],TbPassagens[A partir do mês],\"<=\" & 9,TbPassagens[Até],\">=\"& 9,TbPassagens[Meta:Atividade],LEFT(B38,FIND(\" \",B38,1)-1))","v":0},{"$f":"SUMIFS(TbPassagens[Valor Total Passagem],TbPassagens[A partir do mês],\"<=\" & 10,TbPassagens[Até],\">=\"& 10,TbPassagens[Meta:Atividade],LEFT(B38,FIND(\" \",B38,1)-1))","v":0},{"$f":"SUMIFS(TbPassagens[Valor Total Passagem],TbPassagens[A partir do mês],\"<=\" & 11,TbPassagens[Até],\">=\"& 11,TbPassagens[Meta:Atividade],LEFT(B38,FIND(\" \",B38,1)-1))","v":0},{"$f":"SUMIFS(TbPassagens[Valor Total Passagem],TbPassagens[A partir do mês],\"<=\" & 12,TbPassagens[Até],\">=\"& 12,TbPassagens[Meta:Atividade],LEFT(B38,FIND(\" \",B38,1)-1))","v":0},{"$f":"SUMIFS(TbPassagens[Valor Total Passagem],TbPassagens[A partir do mês],\"<=\" & 13,TbPassagens[Até],\">=\"& 13,TbPassagens[Meta:Atividade],LEFT(B38,FIND(\" \",B38,1)-1))","v":0},{"$f":"SUMIFS(TbPassagens[Valor Total Passagem],TbPassagens[A partir do mês],\"<=\" & 14,TbPassagens[Até],\">=\"& 14,TbPassagens[Meta:Atividade],LEFT(B38,FIND(\" \",B38,1)-1))","v":0},{"$f":"SUMIFS(TbPassagens[Valor Total Passagem],TbPassagens[A partir do mês],\"<=\" & 15,TbPassagens[Até],\">=\"& 15,TbPassagens[Meta:Atividade],LEFT(B38,FIND(\" \",B38,1)-1))","v":0},{"$f":"SUMIFS(TbPassagens[Valor Total Passagem],TbPassagens[A partir do mês],\"<=\" & 16,TbPassagens[Até],\">=\"& 16,TbPassagens[Meta:Atividade],LEFT(B38,FIND(\" \",B38,1)-1))","v":0},{"$f":"SUMIFS(TbPassagens[Valor Total Passagem],TbPassagens[A partir do mês],\"<=\" & 17,TbPassagens[Até],\">=\"& 17,TbPassagens[Meta:Atividade],LEFT(B38,FIND(\" \",B38,1)-1))","v":0},{"$f":"SUMIFS(TbPassagens[Valor Total Passagem],TbPassagens[A partir do mês],\"<=\" & 18,TbPassagens[Até],\">=\"& 18,TbPassagens[Meta:Atividade],LEFT(B38,FIND(\" \",B38,1)-1))","v":0},{"$f":"SUMIFS(TbPassagens[Valor Total Passagem],TbPassagens[A partir do mês],\"<=\" & 19,TbPassagens[Até],\">=\"& 19,TbPassagens[Meta:Atividade],LEFT(B38,FIND(\" \",B38,1)-1))","v":0},{"$f":"SUMIFS(TbPassagens[Valor Total Passagem],TbPassagens[A partir do mês],\"<=\" & 20,TbPassagens[Até],\">=\"& 20,TbPassagens[Meta:Atividade],LEFT(B38,FIND(\" \",B38,1)-1))","v":0},{"$f":"SUMIFS(TbPassagens[Valor Total Passagem],TbPassagens[A partir do mês],\"<=\" & 21,TbPassagens[Até],\">=\"& 21,TbPassagens[Meta:Atividade],LEFT(B38,FIND(\" \",B38,1)-1))","v":0},{"$f":"SUMIFS(TbPassagens[Valor Total Passagem],TbPassagens[A partir do mês],\"<=\" & 22,TbPassagens[Até],\">=\"& 22,TbPassagens[Meta:Atividade],LEFT(B38,FIND(\" \",B38,1)-1))","v":0},{"$f":"SUMIFS(TbPassagens[Valor Total Passagem],TbPassagens[A partir do mês],\"<=\" & 23,TbPassagens[Até],\">=\"& 23,TbPassagens[Meta:Atividade],LEFT(B38,FIND(\" \",B38,1)-1))","v":0},{"$f":"SUMIFS(TbPassagens[Valor Total Passagem],TbPassagens[A partir do mês],\"<=\" & 24,TbPassagens[Até],\">=\"& 24,TbPassagens[Meta:Atividade],LEFT(B38,FIND(\" \",B38,1)-1))","v":0},{"$f":"SUMIFS(TbPassagens[Valor Total Passagem],TbPassagens[A partir do mês],\"<=\" & 25,TbPassagens[Até],\">=\"& 25,TbPassagens[Meta:Atividade],LEFT(B38,FIND(\" \",B38,1)-1))","v":0},{"$f":"SUMIFS(TbPassagens[Valor Total Passagem],TbPassagens[A partir do mês],\"<=\" & 26,TbPassagens[Até],\">=\"& 26,TbPassagens[Meta:Atividade],LEFT(B38,FIND(\" \",B38,1)-1))","v":0},{"$f":"SUMIFS(TbPassagens[Valor Total Passagem],TbPassagens[A partir do mês],\"<=\" & 27,TbPassagens[Até],\">=\"& 27,TbPassagens[Meta:Atividade],LEFT(B38,FIND(\" \",B38,1)-1))","v":0},{"$f":"SUMIFS(TbPassagens[Valor Total Passagem],TbPassagens[A partir do mês],\"<=\" & 28,TbPassagens[Até],\">=\"& 28,TbPassagens[Meta:Atividade],LEFT(B38,FIND(\" \",B38,1)-1))","v":0},{"$f":"SUMIFS(TbPassagens[Valor Total Passagem],TbPassagens[A partir do mês],\"<=\" & 29,TbPassagens[Até],\">=\"& 29,TbPassagens[Meta:Atividade],LEFT(B38,FIND(\" \",B38,1)-1))","v":0},{"$f":"SUMIFS(TbPassagens[Valor Total Passagem],TbPassagens[A partir do mês],\"<=\" & 30,TbPassagens[Até],\">=\"& 30,TbPassagens[Meta:Atividade],LEFT(B38,FIND(\" \",B38,1)-1))","v":0},{"$f":"SUMIFS(TbPassagens[Valor Total Passagem],TbPassagens[A partir do mês],\"<=\" & 31,TbPassagens[Até],\">=\"& 31,TbPassagens[Meta:Atividade],LEFT(B38,FIND(\" \",B38,1)-1))","v":0},{"$f":"SUMIFS(TbPassagens[Valor Total Passagem],TbPassagens[A partir do mês],\"<=\" & 32,TbPassagens[Até],\">=\"& 32,TbPassagens[Meta:Atividade],LEFT(B38,FIND(\" \",B38,1)-1))","v":0},{"$f":"SUMIFS(TbPassagens[Valor Total Passagem],TbPassagens[A partir do mês],\"<=\" & 33,TbPassagens[Até],\">=\"& 33,TbPassagens[Meta:Atividade],LEFT(B38,FIND(\" \",B38,1)-1))","v":0},{"$f":"SUMIFS(TbPassagens[Valor Total Passagem],TbPassagens[A partir do mês],\"<=\" & 34,TbPassagens[Até],\">=\"& 34,TbPassagens[Meta:Atividade],LEFT(B38,FIND(\" \",B38,1)-1))","v":0},{"$f":"SUMIFS(TbPassagens[Valor Total Passagem],TbPassagens[A partir do mês],\"<=\" & 35,TbPassagens[Até],\">=\"& 35,TbPassagens[Meta:Atividade],LEFT(B38,FIND(\" \",B38,1)-1))","v":0},{"$f":"SUMIFS(TbPassagens[Valor Total Passagem],TbPassagens[A partir do mês],\"<=\" & 36,TbPassagens[Até],\">=\"& 36,TbPassagens[Meta:Atividade],LEFT(B38,FIND(\" \",B38,1)-1))","v":0},0]
[null,null,"Diárias",{"$f":"SUMIFS(TbPassagens[Valor Total Diária],TbPassagens[A partir do mês],\"<=\" & 1,TbPassagens[Até],\">=\"& 1,TbPassagens[Meta:Atividade],LEFT(B38,FIND(\" \",B38,1)-1))","v":0},{"$f":"SUMIFS(TbPassagens[Valor Total Diária],TbPassagens[A partir do mês],\"<=\" & 2,TbPassagens[Até],\">=\"& 2,TbPassagens[Meta:Atividade],LEFT(B38,FIND(\" \",B38,1)-1))","v":0},{"$f":"SUMIFS(TbPassagens[Valor Total Diária],TbPassagens[A partir do mês],\"<=\" & 3,TbPassagens[Até],\">=\"& 3,TbPassagens[Meta:Atividade],LEFT(B38,FIND(\" \",B38,1)-1))","v":0},{"$f":"SUMIFS(TbPassagens[Valor Total Diária],TbPassagens[A partir do mês],\"<=\" & 4,TbPassagens[Até],\">=\"& 4,TbPassagens[Meta:Atividade],LEFT(B38,FIND(\" \",B38,1)-1))","v":0},{"$f":"SUMIFS(TbPassagens[Valor Total Diária],TbPassagens[A partir do mês],\"<=\" & 5,TbPassagens[Até],\">=\"& 5,TbPassagens[Meta:Atividade],LEFT(B38,FIND(\" \",B38,1)-1))","v":0},{"$f":"SUMIFS(TbPassagens[Valor Total Diária],TbPassagens[A partir do mês],\"<=\" & 6,TbPassagens[Até],\">=\"& 6,TbPassagens[Meta:Atividade],LEFT(B38,FIND(\" \",B38,1)-1))","v":0},{"$f":"SUMIFS(TbPassagens[Valor Total Diária],TbPassagens[A partir do mês],\"<=\" & 7,TbPassagens[Até],\">=\"& 7,TbPassagens[Meta:Atividade],LEFT(B38,FIND(\" \",B38,1)-1))","v":0},{"$f":"SUMIFS(TbPassagens[Valor Total Diária],TbPassagens[A partir do mês],\"<=\" & 8,TbPassagens[Até],\">=\"& 8,TbPassagens[Meta:Atividade],LEFT(B38,FIND(\" \",B38,1)-1))","v":0},{"$f":"SUMIFS(TbPassagens[Valor Total Diária],TbPassagens[A partir do mês],\"<=\" & 9,TbPassagens[Até],\">=\"& 9,TbPassagens[Meta:Atividade],LEFT(B38,FIND(\" \",B38,1)-1))","v":0},{"$f":"SUMIFS(TbPassagens[Valor Total Diária],TbPassagens[A partir do mês],\"<=\" & 10,TbPassagens[Até],\">=\"& 10,TbPassagens[Meta:Atividade],LEFT(B38,FIND(\" \",B38,1)-1))","v":0},{"$f":"SUMIFS(TbPassagens[Valor Total Diária],TbPassagens[A partir do mês],\"<=\" & 11,TbPassagens[Até],\">=\"& 11,TbPassagens[Meta:Atividade],LEFT(B38,FIND(\" \",B38,1)-1))","v":0},{"$f":"SUMIFS(TbPassagens[Valor Total Diária],TbPassagens[A partir do mês],\"<=\" & 12,TbPassagens[Até],\">=\"& 12,TbPassagens[Meta:Atividade],LEFT(B38,FIND(\" \",B38,1)-1))","v":0},{"$f":"SUMIFS(TbPassagens[Valor Total Diária],TbPassagens[A partir do mês],\"<=\" & 13,TbPassagens[Até],\">=\"& 13,TbPassagens[Meta:Atividade],LEFT(B38,FIND(\" \",B38,1)-1))","v":0},{"$f":"SUMIFS(TbPassagens[Valor Total Diária],TbPassagens[A partir do mês],\"<=\" & 14,TbPassagens[Até],\">=\"& 14,TbPassagens[Meta:Atividade],LEFT(B38,FIND(\" \",B38,1)-1))","v":0},{"$f":"SUMIFS(TbPassagens[Valor Total Diária],TbPassagens[A partir do mês],\"<=\" & 15,TbPassagens[Até],\">=\"& 15,TbPassagens[Meta:Atividade],LEFT(B38,FIND(\" \",B38,1)-1))","v":0},{"$f":"SUMIFS(TbPassagens[Valor Total Diária],TbPassagens[A partir do mês],\"<=\" & 16,TbPassagens[Até],\">=\"& 16,TbPassagens[Meta:Atividade],LEFT(B38,FIND(\" \",B38,1)-1))","v":0},{"$f":"SUMIFS(TbPassagens[Valor Total Diária],TbPassagens[A partir do mês],\"<=\" & 17,TbPassagens[Até],\">=\"& 17,TbPassagens[Meta:Atividade],LEFT(B38,FIND(\" \",B38,1)-1))","v":0},{"$f":"SUMIFS(TbPassagens[Valor Total Diária],TbPassagens[A partir do mês],\"<=\" & 18,TbPassagens[Até],\">=\"& 18,TbPassagens[Meta:Atividade],LEFT(B38,FIND(\" \",B38,1)-1))","v":0},{"$f":"SUMIFS(TbPassagens[Valor Total Diária],TbPassagens[A partir do mês],\"<=\" & 19,TbPassagens[Até],\">=\"& 19,TbPassagens[Meta:Atividade],LEFT(B38,FIND(\" \",B38,1)-1))","v":0},{"$f":"SUMIFS(TbPassagens[Valor Total Diária],TbPassagens[A partir do mês],\"<=\" & 20,TbPassagens[Até],\">=\"& 20,TbPassagens[Meta:Atividade],LEFT(B38,FIND(\" \",B38,1)-1))","v":0},{"$f":"SUMIFS(TbPassagens[Valor Total Diária],TbPassagens[A partir do mês],\"<=\" & 21,TbPassagens[Até],\">=\"& 21,TbPassagens[Meta:Atividade],LEFT(B38,FIND(\" \",B38,1)-1))","v":0},{"$f":"SUMIFS(TbPassagens[Valor Total Diária],TbPassagens[A partir do mês],\"<=\" & 22,TbPassagens[Até],\">=\"& 22,TbPassagens[Meta:Atividade],LEFT(B38,FIND(\" \",B38,1)-1))","v":0},{"$f":"SUMIFS(TbPassagens[Valor Total Diária],TbPassagens[A partir do mês],\"<=\" & 23,TbPassagens[Até],\">=\"& 23,TbPassagens[Meta:Atividade],LEFT(B38,FIND(\" \",B38,1)-1))","v":0},{"$f":"SUMIFS(TbPassagens[Valor Total Diária],TbPassagens[A partir do mês],\"<=\" & 24,TbPassagens[Até],\">=\"& 24,TbPassagens[Meta:Atividade],LEFT(B38,FIND(\" \",B38,1)-1))","v":0},{"$f":"SUMIFS(TbPassagens[Valor Total Diária],TbPassagens[A partir do mês],\"<=\" & 25,TbPassagens[Até],\">=\"& 25,TbPassagens[Meta:Atividade],LEFT(B38,FIND(\" \",B38,1)-1))","v":0},{"$f":"SUMIFS(TbPassagens[Valor Total Diária],TbPassagens[A partir do mês],\"<=\" & 26,TbPassagens[Até],\">=\"& 26,TbPassagens[Meta:Atividade],LEFT(B38,FIND(\" \",B38,1)-1))","v":0},{"$f":"SUMIFS(TbPassagens[Valor Total Diária],TbPassagens[A partir do mês],\"<=\" & 27,TbPassagens[Até],\">=\"& 27,TbPassagens[Meta:Atividade],LEFT(B38,FIND(\" \",B38,1)-1))","v":0},{"$f":"SUMIFS(TbPassagens[Valor Total Diária],TbPassagens[A partir do mês],\"<=\" & 28,TbPassagens[Até],\">=\"& 28,TbPassagens[Meta:Atividade],LEFT(B38,FIND(\" \",B38,1)-1))","v":0},{"$f":"SUMIFS(TbPassagens[Valor Total Diária],TbPassagens[A partir do mês],\"<=\" & 29,TbPassagens[Até],\">=\"& 29,TbPassagens[Meta:Atividade],LEFT(B38,FIND(\" \",B38,1)-1))","v":0},{"$f":"SUMIFS(TbPassagens[Valor Total Diária],TbPassagens[A partir do mês],\"<=\" & 30,TbPassagens[Até],\">=\"& 30,TbPassagens[Meta:Atividade],LEFT(B38,FIND(\" \",B38,1)-1))","v":0},{"$f":"SUMIFS(TbPassagens[Valor Total Diária],TbPassagens[A partir do mês],\"<=\" & 31,TbPassagens[Até],\">=\"& 31,TbPassagens[Meta:Atividade],LEFT(B38,FIND(\" \",B38,1)-1))","v":0},{"$f":"SUMIFS(TbPassagens[Valor Total Diária],TbPassagens[A partir do mês],\"<=\" & 32,TbPassagens[Até],\">=\"& 32,TbPassagens[Meta:Atividade],LEFT(B38,FIND(\" \",B38,1)-1))","v":0},{"$f":"SUMIFS(TbPassagens[Valor Total Diária],TbPassagens[A partir do mês],\"<=\" & 33,TbPassagens[Até],\">=\"& 33,TbPassagens[Meta:Atividade],LEFT(B38,FIND(\" \",B38,1)-1))","v":0},{"$f":"SUMIFS(TbPassagens[Valor Total Diária],TbPassagens[A partir do mês],\"<=\" & 34,TbPassagens[Até],\">=\"& 34,TbPassagens[Meta:Atividade],LEFT(B38,FIND(\" \",B38,1)-1))","v":0},{"$f":"SUMIFS(TbPassagens[Valor Total Diária],TbPassagens[A partir do mês],\"<=\" & 35,TbPassagens[Até],\">=\"& 35,TbPassagens[Meta:Atividade],LEFT(B38,FIND(\" \",B38,1)-1))","v":0},{"$f":"SUMIFS(TbPassagens[Valor Total Diária],TbPassagens[A partir do mês],\"<=\" & 36,TbPassagens[Até],\">=\"& 36,TbPassagens[Meta:Atividade],LEFT(B38,FIND(\" \",B38,1)-1))","v":0},0]
[null,null,"Material de Consumo",{"$f":"SUMIFS(TBCompras[Valor Total Item (R$)],TBCompras[Mês do Projeto],\"<=\" & 1,TBCompras[Até],\">=\"& 1,TBCompras[Meta:Atividade],LEFT(B38,FIND(\" \",B38,1)-1),TBCompras[Tipo de Material],\"CONSUMO\")","v":0},{"$f":"SUMIFS(TBCompras[Valor Total Item (R$)],TBCompras[Mês do Projeto],\"<=\" & 2,TBCompras[Até],\">=\"& 2,TBCompras[Meta:Atividade],LEFT(B38,FIND(\" \",B38,1)-1),TBCompras[Tipo de Material],\"CONSUMO\")","v":0},{"$f":"SUMIFS(TBCompras[Valor Total Item (R$)],TBCompras[Mês do Projeto],\"<=\" & 3,TBCompras[Até],\">=\"& 3,TBCompras[Meta:Atividade],LEFT(B38,FIND(\" \",B38,1)-1),TBCompras[Tipo de Material],\"CONSUMO\")","v":0},{"$f":"SUMIFS(TBCompras[Valor Total Item (R$)],TBCompras[Mês do Projeto],\"<=\" & 4,TBCompras[Até],\">=\"& 4,TBCompras[Meta:Atividade],LEFT(B38,FIND(\" \",B38,1)-1),TBCompras[Tipo de Material],\"CONSUMO\")","v":0},{"$f":"SUMIFS(TBCompras[Valor Total Item (R$)],TBCompras[Mês do Projeto],\"<=\" & 5,TBCompras[Até],\">=\"& 5,TBCompras[Meta:Atividade],LEFT(B38,FIND(\" \",B38,1)-1),TBCompras[Tipo de Material],\"CONSUMO\")","v":0},{"$f":"SUMIFS(TBCompras[Valor Total Item (R$)],TBCompras[Mês do Projeto],\"<=\" & 6,TBCompras[Até],\">=\"& 6,TBCompras[Meta:Atividade],LEFT(B38,FIND(\" \",B38,1)-1),TBCompras[Tipo de Material],\"CONSUMO\")","v":0},{"$f":"SUMIFS(TBCompras[Valor Total Item (R$)],TBCompras[Mês do Projeto],\"<=\" & 7,TBCompras[Até],\">=\"& 7,TBCompras[Meta:Atividade],LEFT(B38,FIND(\" \",B38,1)-1),TBCompras[Tipo de Material],\"CONSUMO\")","v":0},{"$f":"SUMIFS(TBCompras[Valor Total Item (R$)],TBCompras[Mês do Projeto],\"<=\" & 8,TBCompras[Até],\">=\"& 8,TBCompras[Meta:Atividade],LEFT(B38,FIND(\" \",B38,1)-1),TBCompras[Tipo de Material],\"CONSUMO\")","v":0},{"$f":"SUMIFS(TBCompras[Valor Total Item (R$)],TBCompras[Mês do Projeto],\"<=\" & 9,TBCompras[Até],\">=\"& 9,TBCompras[Meta:Atividade],LEFT(B38,FIND(\" \",B38,1)-1),TBCompras[Tipo de Material],\"CONSUMO\")","v":0},{"$f":"SUMIFS(TBCompras[Valor Total Item (R$)],TBCompras[Mês do Projeto],\"<=\" & 10,TBCompras[Até],\">=\"& 10,TBCompras[Meta:Atividade],LEFT(B38,FIND(\" \",B38,1)-1),TBCompras[Tipo de Material],\"CONSUMO\")","v":0},{"$f":"SUMIFS(TBCompras[Valor Total Item (R$)],TBCompras[Mês do Projeto],\"<=\" & 11,TBCompras[Até],\">=\"& 11,TBCompras[Meta:Atividade],LEFT(B38,FIND(\" \",B38,1)-1),TBCompras[Tipo de Material],\"CONSUMO\")","v":0},{"$f":"SUMIFS(TBCompras[Valor Total Item (R$)],TBCompras[Mês do Projeto],\"<=\" & 12,TBCompras[Até],\">=\"& 12,TBCompras[Meta:Atividade],LEFT(B38,FIND(\" \",B38,1)-1),TBCompras[Tipo de Material],\"CONSUMO\")","v":0},{"$f":"SUMIFS(TBCompras[Valor Total Item (R$)],TBCompras[Mês do Projeto],\"<=\" & 13,TBCompras[Até],\">=\"& 13,TBCompras[Meta:Atividade],LEFT(B38,FIND(\" \",B38,1)-1),TBCompras[Tipo de Material],\"CONSUMO\")","v":0},{"$f":"SUMIFS(TBCompras[Valor Total Item (R$)],TBCompras[Mês do Projeto],\"<=\" & 14,TBCompras[Até],\">=\"& 14,TBCompras[Meta:Atividade],LEFT(B38,FIND(\" \",B38,1)-1),TBCompras[Tipo de Material],\"CONSUMO\")","v":0},{"$f":"SUMIFS(TBCompras[Valor Total Item (R$)],TBCompras[Mês do Projeto],\"<=\" & 15,TBCompras[Até],\">=\"& 15,TBCompras[Meta:Atividade],LEFT(B38,FIND(\" \",B38,1)-1),TBCompras[Tipo de Material],\"CONSUMO\")","v":0},{"$f":"SUMIFS(TBCompras[Valor Total Item (R$)],TBCompras[Mês do Projeto],\"<=\" & 16,TBCompras[Até],\">=\"& 16,TBCompras[Meta:Atividade],LEFT(B38,FIND(\" \",B38,1)-1),TBCompras[Tipo de Material],\"CONSUMO\")","v":0},{"$f":"SUMIFS(TBCompras[Valor Total Item (R$)],TBCompras[Mês do Projeto],\"<=\" & 17,TBCompras[Até],\">=\"& 17,TBCompras[Meta:Atividade],LEFT(B38,FIND(\" \",B38,1)-1),TBCompras[Tipo de Material],\"CONSUMO\")","v":0},{"$f":"SUMIFS(TBCompras[Valor Total Item (R$)],TBCompras[Mês do Projeto],\"<=\" & 18,TBCompras[Até],\">=\"& 18,TBCompras[Meta:Atividade],LEFT(B38,FIND(\" \",B38,1)-1),TBCompras[Tipo de Material],\"CONSUMO\")","v":0},{"$f":"SUMIFS(TBCompras[Valor Total Item (R$)],TBCompras[Mês do Projeto],\"<=\" & 19,TBCompras[Até],\">=\"& 19,TBCompras[Meta:Atividade],LEFT(B38,FIND(\" \",B38,1)-1),TBCompras[Tipo de Material],\"CONSUMO\")","v":0},{"$f":"SUMIFS(TBCompras[Valor Total Item (R$)],TBCompras[Mês do Projeto],\"<=\" & 20,TBCompras[Até],\">=\"& 20,TBCompras[Meta:Atividade],LEFT(B38,FIND(\" \",B38,1)-1),TBCompras[Tipo de Material],\"CONSUMO\")","v":0},{"$f":"SUMIFS(TBCompras[Valor Total Item (R$)],TBCompras[Mês do Projeto],\"<=\" & 21,TBCompras[Até],\">=\"& 21,TBCompras[Meta:Atividade],LEFT(B38,FIND(\" \",B38,1)-1),TBCompras[Tipo de Material],\"CONSUMO\")","v":0},{"$f":"SUMIFS(TBCompras[Valor Total Item (R$)],TBCompras[Mês do Projeto],\"<=\" & 22,TBCompras[Até],\">=\"& 22,TBCompras[Meta:Atividade],LEFT(B38,FIND(\" \",B38,1)-1),TBCompras[Tipo de Material],\"CONSUMO\")","v":0},{"$f":"SUMIFS(TBCompras[Valor Total Item (R$)],TBCompras[Mês do Projeto],\"<=\" & 23,TBCompras[Até],\">=\"& 23,TBCompras[Meta:Atividade],LEFT(B38,FIND(\" \",B38,1)-1),TBCompras[Tipo de Material],\"CONSUMO\")","v":0},{"$f":"SUMIFS(TBCompras[Valor Total Item (R$)],TBCompras[Mês do Projeto],\"<=\" & 24,TBCompras[Até],\">=\"& 24,TBCompras[Meta:Atividade],LEFT(B38,FIND(\" \",B38,1)-1),TBCompras[Tipo de Material],\"CONSUMO\")","v":0},{"$f":"SUMIFS(TBCompras[Valor Total Item (R$)],TBCompras[Mês do Projeto],\"<=\" & 25,TBCompras[Até],\">=\"& 25,TBCompras[Meta:Atividade],LEFT(B38,FIND(\" \",B38,1)-1),TBCompras[Tipo de Material],\"CONSUMO\")","v":0},{"$f":"SUMIFS(TBCompras[Valor Total Item (R$)],TBCompras[Mês do Projeto],\"<=\" & 26,TBCompras[Até],\">=\"& 26,TBCompras[Meta:Atividade],LEFT(B38,FIND(\" \",B38,1)-1),TBCompras[Tipo de Material],\"CONSUMO\")","v":0},{"$f":"SUMIFS(TBCompras[Valor Total Item (R$)],TBCompras[Mês do Projeto],\"<=\" & 27,TBCompras[Até],\">=\"& 27,TBCompras[Meta:Atividade],LEFT(B38,FIND(\" \",B38,1)-1),TBCompras[Tipo de Material],\"CONSUMO\")","v":0},{"$f":"SUMIFS(TBCompras[Valor Total Item (R$)],TBCompras[Mês do Projeto],\"<=\" & 28,TBCompras[Até],\">=\"& 28,TBCompras[Meta:Atividade],LEFT(B38,FIND(\" \",B38,1)-1),TBCompras[Tipo de Material],\"CONSUMO\")","v":0},{"$f":"SUMIFS(TBCompras[Valor Total Item (R$)],TBCompras[Mês do Projeto],\"<=\" & 29,TBCompras[Até],\">=\"& 29,TBCompras[Meta:Atividade],LEFT(B38,FIND(\" \",B38,1)-1),TBCompras[Tipo de Material],\"CONSUMO\")","v":0},{"$f":"SUMIFS(TBCompras[Valor Total Item (R$)],TBCompras[Mês do Projeto],\"<=\" & 30,TBCompras[Até],\">=\"& 30,TBCompras[Meta:Atividade],LEFT(B38,FIND(\" \",B38,1)-1),TBCompras[Tipo de Material],\"CONSUMO\")","v":0},{"$f":"SUMIFS(TBCompras[Valor Total Item (R$)],TBCompras[Mês do Projeto],\"<=\" & 31,TBCompras[Até],\">=\"& 31,TBCompras[Meta:Atividade],LEFT(B38,FIND(\" \",B38,1)-1),TBCompras[Tipo de Material],\"CONSUMO\")","v":0},{"$f":"SUMIFS(TBCompras[Valor Total Item (R$)],TBCompras[Mês do Projeto],\"<=\" & 32,TBCompras[Até],\">=\"& 32,TBCompras[Meta:Atividade],LEFT(B38,FIND(\" \",B38,1)-1),TBCompras[Tipo de Material],\"CONSUMO\")","v":0},{"$f":"SUMIFS(TBCompras[Valor Total Item (R$)],TBCompras[Mês do Projeto],\"<=\" & 33,TBCompras[Até],\">=\"& 33,TBCompras[Meta:Atividade],LEFT(B38,FIND(\" \",B38,1)-1),TBCompras[Tipo de Material],\"CONSUMO\")","v":0},{"$f":"SUMIFS(TBCompras[Valor Total Item (R$)],TBCompras[Mês do Projeto],\"<=\" & 34,TBCompras[Até],\">=\"& 34,TBCompras[Meta:Atividade],LEFT(B38,FIND(\" \",B38,1)-1),TBCompras[Tipo de Material],\"CONSUMO\")","v":0},{"$f":"SUMIFS(TBCompras[Valor Total Item (R$)],TBCompras[Mês do Projeto],\"<=\" & 35,TBCompras[Até],\">=\"& 35,TBCompras[Meta:Atividade],LEFT(B38,FIND(\" \",B38,1)-1),TBCompras[Tipo de Material],\"CONSUMO\")","v":0},{"$f":"SUMIFS(TBCompras[Valor Total Item (R$)],TBCompras[Mês do Projeto],\"<=\" & 36,TBCompras[Até],\">=\"& 36,TBCompras[Meta:Atividade],LEFT(B38,FIND(\" \",B38,1)-1),TBCompras[Tipo de Material],\"CONSUMO\")","v":0},0]
[null,null,"Equipamentos",{"$f":"SUMIFS(TBCompras[Valor Total Item (R$)],TBCompras[Mês do Projeto],\"<=\" & 1,TBCompras[Até],\">=\"& 1,TBCompras[Meta:Atividade],LEFT(B38,FIND(\" \",B38,1)-1),TBCompras[Tipo de Material],\"EQUIPAMENTO\")","v":0},{"$f":"SUMIFS(TBCompras[Valor Total Item (R$)],TBCompras[Mês do Projeto],\"<=\" & 2,TBCompras[Até],\">=\"& 2,TBCompras[Meta:Atividade],LEFT(B38,FIND(\" \",B38,1)-1),TBCompras[Tipo de Material],\"EQUIPAMENTO\")","v":0},{"$f":"SUMIFS(TBCompras[Valor Total Item (R$)],TBCompras[Mês do Projeto],\"<=\" & 3,TBCompras[Até],\">=\"& 3,TBCompras[Meta:Atividade],LEFT(B38,FIND(\" \",B38,1)-1),TBCompras[Tipo de Material],\"EQUIPAMENTO\")","v":0},{"$f":"SUMIFS(TBCompras[Valor Total Item (R$)],TBCompras[Mês do Projeto],\"<=\" & 4,TBCompras[Até],\">=\"& 4,TBCompras[Meta:Atividade],LEFT(B38,FIND(\" \",B38,1)-1),TBCompras[Tipo de Material],\"EQUIPAMENTO\")","v":0},{"$f":"SUMIFS(TBCompras[Valor Total Item (R$)],TBCompras[Mês do Projeto],\"<=\" & 5,TBCompras[Até],\">=\"& 5,TBCompras[Meta:Atividade],LEFT(B38,FIND(\" \",B38,1)-1),TBCompras[Tipo de Material],\"EQUIPAMENTO\")","v":0},{"$f":"SUMIFS(TBCompras[Valor Total Item (R$)],TBCompras[Mês do Projeto],\"<=\" & 6,TBCompras[Até],\">=\"& 6,TBCompras[Meta:Atividade],LEFT(B38,FIND(\" \",B38,1)-1),TBCompras[Tipo de Material],\"EQUIPAMENTO\")","v":0},{"$f":"SUMIFS(TBCompras[Valor Total Item (R$)],TBCompras[Mês do Projeto],\"<=\" & 7,TBCompras[Até],\">=\"& 7,TBCompras[Meta:Atividade],LEFT(B38,FIND(\" \",B38,1)-1),TBCompras[Tipo de Material],\"EQUIPAMENTO\")","v":0},{"$f":"SUMIFS(TBCompras[Valor Total Item (R$)],TBCompras[Mês do Projeto],\"<=\" & 8,TBCompras[Até],\">=\"& 8,TBCompras[Meta:Atividade],LEFT(B38,FIND(\" \",B38,1)-1),TBCompras[Tipo de Material],\"EQUIPAMENTO\")","v":0},{"$f":"SUMIFS(TBCompras[Valor Total Item (R$)],TBCompras[Mês do Projeto],\"<=\" & 9,TBCompras[Até],\">=\"& 9,TBCompras[Meta:Atividade],LEFT(B38,FIND(\" \",B38,1)-1),TBCompras[Tipo de Material],\"EQUIPAMENTO\")","v":0},{"$f":"SUMIFS(TBCompras[Valor Total Item (R$)],TBCompras[Mês do Projeto],\"<=\" & 10,TBCompras[Até],\">=\"& 10,TBCompras[Meta:Atividade],LEFT(B38,FIND(\" \",B38,1)-1),TBCompras[Tipo de Material],\"EQUIPAMENTO\")","v":0},{"$f":"SUMIFS(TBCompras[Valor Total Item (R$)],TBCompras[Mês do Projeto],\"<=\" & 11,TBCompras[Até],\">=\"& 11,TBCompras[Meta:Atividade],LEFT(B38,FIND(\" \",B38,1)-1),TBCompras[Tipo de Material],\"EQUIPAMENTO\")","v":0},{"$f":"SUMIFS(TBCompras[Valor Total Item (R$)],TBCompras[Mês do Projeto],\"<=\" & 12,TBCompras[Até],\">=\"& 12,TBCompras[Meta:Atividade],LEFT(B38,FIND(\" \",B38,1)-1),TBCompras[Tipo de Material],\"EQUIPAMENTO\")","v":0},{"$f":"SUMIFS(TBCompras[Valor Total Item (R$)],TBCompras[Mês do Projeto],\"<=\" & 13,TBCompras[Até],\">=\"& 13,TBCompras[Meta:Atividade],LEFT(B38,FIND(\" \",B38,1)-1),TBCompras[Tipo de Material],\"EQUIPAMENTO\")","v":0},{"$f":"SUMIFS(TBCompras[Valor Total Item (R$)],TBCompras[Mês do Projeto],\"<=\" & 14,TBCompras[Até],\">=\"& 14,TBCompras[Meta:Atividade],LEFT(B38,FIND(\" \",B38,1)-1),TBCompras[Tipo de Material],\"EQUIPAMENTO\")","v":0},{"$f":"SUMIFS(TBCompras[Valor Total Item (R$)],TBCompras[Mês do Projeto],\"<=\" & 15,TBCompras[Até],\">=\"& 15,TBCompras[Meta:Atividade],LEFT(B38,FIND(\" \",B38,1)-1),TBCompras[Tipo de Material],\"EQUIPAMENTO\")","v":0},{"$f":"SUMIFS(TBCompras[Valor Total Item (R$)],TBCompras[Mês do Projeto],\"<=\" & 16,TBCompras[Até],\">=\"& 16,TBCompras[Meta:Atividade],LEFT(B38,FIND(\" \",B38,1)-1),TBCompras[Tipo de Material],\"EQUIPAMENTO\")","v":0},{"$f":"SUMIFS(TBCompras[Valor Total Item (R$)],TBCompras[Mês do Projeto],\"<=\" & 17,TBCompras[Até],\">=\"& 17,TBCompras[Meta:Atividade],LEFT(B38,FIND(\" \",B38,1)-1),TBCompras[Tipo de Material],\"EQUIPAMENTO\")","v":0},{"$f":"SUMIFS(TBCompras[Valor Total Item (R$)],TBCompras[Mês do Projeto],\"<=\" & 18,TBCompras[Até],\">=\"& 18,TBCompras[Meta:Atividade],LEFT(B38,FIND(\" \",B38,1)-1),TBCompras[Tipo de Material],\"EQUIPAMENTO\")","v":0},{"$f":"SUMIFS(TBCompras[Valor Total Item (R$)],TBCompras[Mês do Projeto],\"<=\" & 19,TBCompras[Até],\">=\"& 19,TBCompras[Meta:Atividade],LEFT(B38,FIND(\" \",B38,1)-1),TBCompras[Tipo de Material],\"EQUIPAMENTO\")","v":0},{"$f":"SUMIFS(TBCompras[Valor Total Item (R$)],TBCompras[Mês do Projeto],\"<=\" & 20,TBCompras[Até],\">=\"& 20,TBCompras[Meta:Atividade],LEFT(B38,FIND(\" \",B38,1)-1),TBCompras[Tipo de Material],\"EQUIPAMENTO\")","v":0},{"$f":"SUMIFS(TBCompras[Valor Total Item (R$)],TBCompras[Mês do Projeto],\"<=\" & 21,TBCompras[Até],\">=\"& 21,TBCompras[Meta:Atividade],LEFT(B38,FIND(\" \",B38,1)-1),TBCompras[Tipo de Material],\"EQUIPAMENTO\")","v":0},{"$f":"SUMIFS(TBCompras[Valor Total Item (R$)],TBCompras[Mês do Projeto],\"<=\" & 22,TBCompras[Até],\">=\"& 22,TBCompras[Meta:Atividade],LEFT(B38,FIND(\" \",B38,1)-1),TBCompras[Tipo de Material],\"EQUIPAMENTO\")","v":0},{"$f":"SUMIFS(TBCompras[Valor Total Item (R$)],TBCompras[Mês do Projeto],\"<=\" & 23,TBCompras[Até],\">=\"& 23,TBCompras[Meta:Atividade],LEFT(B38,FIND(\" \",B38,1)-1),TBCompras[Tipo de Material],\"EQUIPAMENTO\")","v":0},{"$f":"SUMIFS(TBCompras[Valor Total Item (R$)],TBCompras[Mês do Projeto],\"<=\" & 24,TBCompras[Até],\">=\"& 24,TBCompras[Meta:Atividade],LEFT(B38,FIND(\" \",B38,1)-1),TBCompras[Tipo de Material],\"EQUIPAMENTO\")","v":0},{"$f":"SUMIFS(TBCompras[Valor Total Item (R$)],TBCompras[Mês do Projeto],\"<=\" & 25,TBCompras[Até],\">=\"& 25,TBCompras[Meta:Atividade],LEFT(B38,FIND(\" \",B38,1)-1),TBCompras[Tipo de Material],\"EQUIPAMENTO\")","v":0},{"$f":"SUMIFS(TBCompras[Valor Total Item (R$)],TBCompras[Mês do Projeto],\"<=\" & 26,TBCompras[Até],\">=\"& 26,TBCompras[Meta:Atividade],LEFT(B38,FIND(\" \",B38,1)-1),TBCompras[Tipo de Material],\"EQUIPAMENTO\")","v":0},{"$f":"SUMIFS(TBCompras[Valor Total Item (R$)],TBCompras[Mês do Projeto],\"<=\" & 27,TBCompras[Até],\">=\"& 27,TBCompras[Meta:Atividade],LEFT(B38,FIND(\" \",B38,1)-1),TBCompras[Tipo de Material],\"EQUIPAMENTO\")","v":0},{"$f":"SUMIFS(TBCompras[Valor Total Item (R$)],TBCompras[Mês do Projeto],\"<=\" & 28,TBCompras[Até],\">=\"& 28,TBCompras[Meta:Atividade],LEFT(B38,FIND(\" \",B38,1)-1),TBCompras[Tipo de Material],\"EQUIPAMENTO\")","v":0},{"$f":"SUMIFS(TBCompras[Valor Total Item (R$)],TBCompras[Mês do Projeto],\"<=\" & 29,TBCompras[Até],\">=\"& 29,TBCompras[Meta:Atividade],LEFT(B38,FIND(\" \",B38,1)-1),TBCompras[Tipo de Material],\"EQUIPAMENTO\")","v":0},{"$f":"SUMIFS(TBCompras[Valor Total Item (R$)],TBCompras[Mês do Projeto],\"<=\" & 30,TBCompras[Até],\">=\"& 30,TBCompras[Meta:Atividade],LEFT(B38,FIND(\" \",B38,1)-1),TBCompras[Tipo de Material],\"EQUIPAMENTO\")","v":0},{"$f":"SUMIFS(TBCompras[Valor Total Item (R$)],TBCompras[Mês do Projeto],\"<=\" & 31,TBCompras[Até],\">=\"& 31,TBCompras[Meta:Atividade],LEFT(B38,FIND(\" \",B38,1)-1),TBCompras[Tipo de Material],\"EQUIPAMENTO\")","v":0},{"$f":"SUMIFS(TBCompras[Valor Total Item (R$)],TBCompras[Mês do Projeto],\"<=\" & 32,TBCompras[Até],\">=\"& 32,TBCompras[Meta:Atividade],LEFT(B38,FIND(\" \",B38,1)-1),TBCompras[Tipo de Material],\"EQUIPAMENTO\")","v":0},{"$f":"SUMIFS(TBCompras[Valor Total Item (R$)],TBCompras[Mês do Projeto],\"<=\" & 33,TBCompras[Até],\">=\"& 33,TBCompras[Meta:Atividade],LEFT(B38,FIND(\" \",B38,1)-1),TBCompras[Tipo de Material],\"EQUIPAMENTO\")","v":0},{"$f":"SUMIFS(TBCompras[Valor Total Item (R$)],TBCompras[Mês do Projeto],\"<=\" & 34,TBCompras[Até],\">=\"& 34,TBCompras[Meta:Atividade],LEFT(B38,FIND(\" \",B38,1)-1),TBCompras[Tipo de Material],\"EQUIPAMENTO\")","v":0},{"$f":"SUMIFS(TBCompras[Valor Total Item (R$)],TBCompras[Mês do Projeto],\"<=\" & 35,TBCompras[Até],\">=\"& 35,TBCompras[Meta:Atividade],LEFT(B38,FIND(\" \",B38,1)-1),TBCompras[Tipo de Material],\"EQUIPAMENTO\")","v":0},{"$f":"SUMIFS(TBCompras[Valor Total Item (R$)],TBCompras[Mês do Projeto],\"<=\" & 36,TBCompras[Até],\">=\"& 36,TBCompras[Meta:Atividade],LEFT(B38,FIND(\" \",B38,1)-1),TBCompras[Tipo de Material],\"EQUIPAMENTO\")","v":0},0]
[null,null,"Total Atividade 3.1",{"$f":"SUBTOTAL(9,D38:D43)","v":0},0,0,0,0,0,0,0,0,0,0,0,0,0,0,0,0,0,0,0,0,0,0,0,0,0,0,0,0,0,0,0,0,0,0,0,0]
[null,"3.2 - Produção do Lote de trabalho vacinal (BPF)","Pessoa Física",{"$f":"SUMIFS(TbPessoas[Custo Total Mensal],TbPessoas[A partir do mês],\"<=\" & 1,TbPessoas[Até],\">=\"& 1,TbPessoas[Meta:Atividade],LEFT(B45,FIND(\" \",B45,1)-1))","v":0},{"$f":"SUMIFS(TbPessoas[Custo Total Mensal],TbPessoas[A partir do mês],\"<=\" & 2,TbPessoas[Até],\">=\"& 2,TbPessoas[Meta:Atividade],LEFT(B45,FIND(\" \",B45,1)-1))","v":0},{"$f":"SUMIFS(TbPessoas[Custo Total Mensal],TbPessoas[A partir do mês],\"<=\" & 3,TbPessoas[Até],\">=\"& 3,TbPessoas[Meta:Atividade],LEFT(B45,FIND(\" \",B45,1)-1))","v":0},{"$f":"SUMIFS(TbPessoas[Custo Total Mensal],TbPessoas[A partir do mês],\"<=\" & 4,TbPessoas[Até],\">=\"& 4,TbPessoas[Meta:Atividade],LEFT(B45,FIND(\" \",B45,1)-1))","v":0},{"$f":"SUMIFS(TbPessoas[Custo Total Mensal],TbPessoas[A partir do mês],\"<=\" & 5,TbPessoas[Até],\">=\"& 5,TbPessoas[Meta:Atividade],LEFT(B45,FIND(\" \",B45,1)-1))","v":0},{"$f":"SUMIFS(TbPessoas[Custo Total Mensal],TbPessoas[A partir do mês],\"<=\" & 6,TbPessoas[Até],\">=\"& 6,TbPessoas[Meta:Atividade],LEFT(B45,FIND(\" \",B45,1)-1))","v":0},{"$f":"SUMIFS(TbPessoas[Custo Total Mensal],TbPessoas[A partir do mês],\"<=\" & 7,TbPessoas[Até],\">=\"& 7,TbPessoas[Meta:Atividade],LEFT(B45,FIND(\" \",B45,1)-1))","v":0},{"$f":"SUMIFS(TbPessoas[Custo Total Mensal],TbPessoas[A partir do mês],\"<=\" & 8,TbPessoas[Até],\">=\"& 8,TbPessoas[Meta:Atividade],LEFT(B45,FIND(\" \",B45,1)-1))","v":0},{"$f":"SUMIFS(TbPessoas[Custo Total Mensal],TbPessoas[A partir do mês],\"<=\" & 9,TbPessoas[Até],\">=\"& 9,TbPessoas[Meta:Atividade],LEFT(B45,FIND(\" \",B45,1)-1))","v":0},{"$f":"SUMIFS(TbPessoas[Custo Total Mensal],TbPessoas[A partir do mês],\"<=\" & 10,TbPessoas[Até],\">=\"& 10,TbPessoas[Meta:Atividade],LEFT(B45,FIND(\" \",B45,1)-1))","v":0},{"$f":"SUMIFS(TbPessoas[Custo Total Mensal],TbPessoas[A partir do mês],\"<=\" & 11,TbPessoas[Até],\">=\"& 11,TbPessoas[Meta:Atividade],LEFT(B45,FIND(\" \",B45,1)-1))","v":0},{"$f":"SUMIFS(TbPessoas[Custo Total Mensal],TbPessoas[A partir do mês],\"<=\" & 12,TbPessoas[Até],\">=\"& 12,TbPessoas[Meta:Atividade],LEFT(B45,FIND(\" \",B45,1)-1))","v":0},{"$f":"SUMIFS(TbPessoas[Custo Total Mensal],TbPessoas[A partir do mês],\"<=\" & 13,TbPessoas[Até],\">=\"& 13,TbPessoas[Meta:Atividade],LEFT(B45,FIND(\" \",B45,1)-1))","v":0},{"$f":"SUMIFS(TbPessoas[Custo Total Mensal],TbPessoas[A partir do mês],\"<=\" & 14,TbPessoas[Até],\">=\"& 14,TbPessoas[Meta:Atividade],LEFT(B45,FIND(\" \",B45,1)-1))","v":0},{"$f":"SUMIFS(TbPessoas[Custo Total Mensal],TbPessoas[A partir do mês],\"<=\" & 15,TbPessoas[Até],\">=\"& 15,TbPessoas[Meta:Atividade],LEFT(B45,FIND(\" \",B45,1)-1))","v":0},{"$f":"SUMIFS(TbPessoas[Custo Total Mensal],TbPessoas[A partir do mês],\"<=\" & 16,TbPessoas[Até],\">=\"& 16,TbPessoas[Meta:Atividade],LEFT(B45,FIND(\" \",B45,1)-1))","v":0},{"$f":"SUMIFS(TbPessoas[Custo Total Mensal],TbPessoas[A partir do mês],\"<=\" & 17,TbPessoas[Até],\">=\"& 17,TbPessoas[Meta:Atividade],LEFT(B45,FIND(\" \",B45,1)-1))","v":0},{"$f":"SUMIFS(TbPessoas[Custo Total Mensal],TbPessoas[A partir do mês],\"<=\" & 18,TbPessoas[Até],\">=\"& 18,TbPessoas[Meta:Atividade],LEFT(B45,FIND(\" \",B45,1)-1))","v":0},{"$f":"SUMIFS(TbPessoas[Custo Total Mensal],TbPessoas[A partir do mês],\"<=\" & 19,TbPessoas[Até],\">=\"& 19,TbPessoas[Meta:Atividade],LEFT(B45,FIND(\" \",B45,1)-1))","v":0},{"$f":"SUMIFS(TbPessoas[Custo Total Mensal],TbPessoas[A partir do mês],\"<=\" & 20,TbPessoas[Até],\">=\"& 20,TbPessoas[Meta:Atividade],LEFT(B45,FIND(\" \",B45,1)-1))","v":0},{"$f":"SUMIFS(TbPessoas[Custo Total Mensal],TbPessoas[A partir do mês],\"<=\" & 21,TbPessoas[Até],\">=\"& 21,TbPessoas[Meta:Atividade],LEFT(B45,FIND(\" \",B45,1)-1))","v":0},{"$f":"SUMIFS(TbPessoas[Custo Total Mensal],TbPessoas[A partir do mês],\"<=\" & 22,TbPessoas[Até],\">=\"& 22,TbPessoas[Meta:Atividade],LEFT(B45,FIND(\" \",B45,1)-1))","v":0},{"$f":"SUMIFS(TbPessoas[Custo Total Mensal],TbPessoas[A partir do mês],\"<=\" & 23,TbPessoas[Até],\">=\"& 23,TbPessoas[Meta:Atividade],LEFT(B45,FIND(\" \",B45,1)-1))","v":0},{"$f":"SUMIFS(TbPessoas[Custo Total Mensal],TbPessoas[A partir do mês],\"<=\" & 24,TbPessoas[Até],\">=\"& 24,TbPessoas[Meta:Atividade],LEFT(B45,FIND(\" \",B45,1)-1))","v":0},{"$f":"SUMIFS(TbPessoas[Custo Total Mensal],TbPessoas[A partir do mês],\"<=\" & 25,TbPessoas[Até],\">=\"& 25,TbPessoas[Meta:Atividade],LEFT(B45,FIND(\" \",B45,1)-1))","v":0},{"$f":"SUMIFS(TbPessoas[Custo Total Mensal],TbPessoas[A partir do mês],\"<=\" & 26,TbPessoas[Até],\">=\"& 26,TbPessoas[Meta:Atividade],LEFT(B45,FIND(\" \",B45,1)-1))","v":0},{"$f":"SUMIFS(TbPessoas[Custo Total Mensal],TbPessoas[A partir do mês],\"<=\" & 27,TbPessoas[Até],\">=\"& 27,TbPessoas[Meta:Atividade],LEFT(B45,FIND(\" \",B45,1)-1))","v":0},{"$f":"SUMIFS(TbPessoas[Custo Total Mensal],TbPessoas[A partir do mês],\"<=\" & 28,TbPessoas[Até],\">=\"& 28,TbPessoas[Meta:Atividade],LEFT(B45,FIND(\" \",B45,1)-1))","v":0},{"$f":"SUMIFS(TbPessoas[Custo Total Mensal],TbPessoas[A partir do mês],\"<=\" & 29,TbPessoas[Até],\">=\"& 29,TbPessoas[Meta:Atividade],LEFT(B45,FIND(\" \",B45,1)-1))","v":0},{"$f":"SUMIFS(TbPessoas[Custo Total Mensal],TbPessoas[A partir do mês],\"<=\" & 30,TbPessoas[Até],\">=\"& 30,TbPessoas[Meta:Atividade],LEFT(B45,FIND(\" \",B45,1)-1))","v":0},{"$f":"SUMIFS(TbPessoas[Custo Total Mensal],TbPessoas[A partir do mês],\"<=\" & 31,TbPessoas[Até],\">=\"& 31,TbPessoas[Meta:Atividade],LEFT(B45,FIND(\" \",B45,1)-1))","v":0},{"$f":"SUMIFS(TbPessoas[Custo Total Mensal],TbPessoas[A partir do mês],\"<=\" & 32,TbPessoas[Até],\">=\"& 32,TbPessoas[Meta:Atividade],LEFT(B45,FIND(\" \",B45,1)-1))","v":0},{"$f":"SUMIFS(TbPessoas[Custo Total Mensal],TbPessoas[A partir do mês],\"<=\" & 33,TbPessoas[Até],\">=\"& 33,TbPessoas[Meta:Atividade],LEFT(B45,FIND(\" \",B45,1)-1))","v":0},{"$f":"SUMIFS(TbPessoas[Custo Total Mensal],TbPessoas[A partir do mês],\"<=\" & 34,TbPessoas[Até],\">=\"& 34,TbPessoas[Meta:Atividade],LEFT(B45,FIND(\" \",B45,1)-1))","v":0},{"$f":"SUMIFS(TbPessoas[Custo Total Mensal],TbPessoas[A partir do mês],\"<=\" & 35,TbPessoas[Até],\">=\"& 35,TbPessoas[Meta:Atividade],LEFT(B45,FIND(\" \",B45,1)-1))","v":0},{"$f":"SUMIFS(TbPessoas[Custo Total Mensal],TbPessoas[A partir do mês],\"<=\" & 36,TbPessoas[Até],\">=\"& 36,TbPessoas[Meta:Atividade],LEFT(B45,FIND(\" \",B45,1)-1))","v":0},{"$f":"SUM(D45:AM45)","v":0}]
[null,null,"Pessoa Jurídica",{"$f":"SUMIFS(TBCompras[Valor Total Item (R$)],TBCompras[Mês do Projeto],\"<=\" & 1,TBCompras[Até],\">=\"& 1,TBCompras[Meta:Atividade],LEFT(B45,FIND(\" \",B45,1)-1),TBCompras[Tipo de Material],\"SERVIÇO\")","v":0},{"$f":"SUMIFS(TBCompras[Valor Total Item (R$)],TBCompras[Mês do Projeto],\"<=\" & 2,TBCompras[Até],\">=\"& 2,TBCompras[Meta:Atividade],LEFT(B45,FIND(\" \",B45,1)-1),TBCompras[Tipo de Material],\"SERVIÇO\")","v":0},{"$f":"SUMIFS(TBCompras[Valor Total Item (R$)],TBCompras[Mês do Projeto],\"<=\" & 3,TBCompras[Até],\">=\"& 3,TBCompras[Meta:Atividade],LEFT(B45,FIND(\" \",B45,1)-1),TBCompras[Tipo de Material],\"SERVIÇO\")","v":0},{"$f":"SUMIFS(TBCompras[Valor Total Item (R$)],TBCompras[Mês do Projeto],\"<=\" & 4,TBCompras[Até],\">=\"& 4,TBCompras[Meta:Atividade],LEFT(B45,FIND(\" \",B45,1)-1),TBCompras[Tipo de Material],\"SERVIÇO\")","v":0},{"$f":"SUMIFS(TBCompras[Valor Total Item (R$)],TBCompras[Mês do Projeto],\"<=\" & 5,TBCompras[Até],\">=\"& 5,TBCompras[Meta:Atividade],LEFT(B45,FIND(\" \",B45,1)-1),TBCompras[Tipo de Material],\"SERVIÇO\")","v":0},{"$f":"SUMIFS(TBCompras[Valor Total Item (R$)],TBCompras[Mês do Projeto],\"<=\" & 6,TBCompras[Até],\">=\"& 6,TBCompras[Meta:Atividade],LEFT(B45,FIND(\" \",B45,1)-1),TBCompras[Tipo de Material],\"SERVIÇO\")","v":0},{"$f":"SUMIFS(TBCompras[Valor Total Item (R$)],TBCompras[Mês do Projeto],\"<=\" & 7,TBCompras[Até],\">=\"& 7,TBCompras[Meta:Atividade],LEFT(B45,FIND(\" \",B45,1)-1),TBCompras[Tipo de Material],\"SERVIÇO\")","v":0},{"$f":"SUMIFS(TBCompras[Valor Total Item (R$)],TBCompras[Mês do Projeto],\"<=\" & 8,TBCompras[Até],\">=\"& 8,TBCompras[Meta:Atividade],LEFT(B45,FIND(\" \",B45,1)-1),TBCompras[Tipo de Material],\"SERVIÇO\")","v":0},{"$f":"SUMIFS(TBCompras[Valor Total Item (R$)],TBCompras[Mês do Projeto],\"<=\" & 9,TBCompras[Até],\">=\"& 9,TBCompras[Meta:Atividade],LEFT(B45,FIND(\" \",B45,1)-1),TBCompras[Tipo de Material],\"SERVIÇO\")","v":0},{"$f":"SUMIFS(TBCompras[Valor Total Item (R$)],TBCompras[Mês do Projeto],\"<=\" & 10,TBCompras[Até],\">=\"& 10,TBCompras[Meta:Atividade],LEFT(B45,FIND(\" \",B45,1)-1),TBCompras[Tipo de Material],\"SERVIÇO\")","v":0},{"$f":"SUMIFS(TBCompras[Valor Total Item (R$)],TBCompras[Mês do Projeto],\"<=\" & 11,TBCompras[Até],\">=\"& 11,TBCompras[Meta:Atividade],LEFT(B45,FIND(\" \",B45,1)-1),TBCompras[Tipo de Material],\"SERVIÇO\")","v":0},{"$f":"SUMIFS(TBCompras[Valor Total Item (R$)],TBCompras[Mês do Projeto],\"<=\" & 12,TBCompras[Até],\">=\"& 12,TBCompras[Meta:Atividade],LEFT(B45,FIND(\" \",B45,1)-1),TBCompras[Tipo de Material],\"SERVIÇO\")","v":0},{"$f":"SUMIFS(TBCompras[Valor Total Item (R$)],TBCompras[Mês do Projeto],\"<=\" & 13,TBCompras[Até],\">=\"& 13,TBCompras[Meta:Atividade],LEFT(B45,FIND(\" \",B45,1)-1),TBCompras[Tipo de Material],\"SERVIÇO\")","v":0},{"$f":"SUMIFS(TBCompras[Valor Total Item (R$)],TBCompras[Mês do Projeto],\"<=\" & 14,TBCompras[Até],\">=\"& 14,TBCompras[Meta:Atividade],LEFT(B45,FIND(\" \",B45,1)-1),TBCompras[Tipo de Material],\"SERVIÇO\")","v":0},{"$f":"SUMIFS(TBCompras[Valor Total Item (R$)],TBCompras[Mês do Projeto],\"<=\" & 15,TBCompras[Até],\">=\"& 15,TBCompras[Meta:Atividade],LEFT(B45,FIND(\" \",B45,1)-1),TBCompras[Tipo de Material],\"SERVIÇO\")","v":0},{"$f":"SUMIFS(TBCompras[Valor Total Item (R$)],TBCompras[Mês do Projeto],\"<=\" & 16,TBCompras[Até],\">=\"& 16,TBCompras[Meta:Atividade],LEFT(B45,FIND(\" \",B45,1)-1),TBCompras[Tipo de Material],\"SERVIÇO\")","v":0},{"$f":"SUMIFS(TBCompras[Valor Total Item (R$)],TBCompras[Mês do Projeto],\"<=\" & 17,TBCompras[Até],\">=\"& 17,TBCompras[Meta:Atividade],LEFT(B45,FIND(\" \",B45,1)-1),TBCompras[Tipo de Material],\"SERVIÇO\")","v":0},{"$f":"SUMIFS(TBCompras[Valor Total Item (R$)],TBCompras[Mês do Projeto],\"<=\" & 18,TBCompras[Até],\">=\"& 18,TBCompras[Meta:Atividade],LEFT(B45,FIND(\" \",B45,1)-1),TBCompras[Tipo de Material],\"SERVIÇO\")","v":0},{"$f":"SUMIFS(TBCompras[Valor Total Item (R$)],TBCompras[Mês do Projeto],\"<=\" & 19,TBCompras[Até],\">=\"& 19,TBCompras[Meta:Atividade],LEFT(B45,FIND(\" \",B45,1)-1),TBCompras[Tipo de Material],\"SERVIÇO\")","v":0},{"$f":"SUMIFS(TBCompras[Valor Total Item (R$)],TBCompras[Mês do Projeto],\"<=\" & 20,TBCompras[Até],\">=\"& 20,TBCompras[Meta:Atividade],LEFT(B45,FIND(\" \",B45,1)-1),TBCompras[Tipo de Material],\"SERVIÇO\")","v":0},{"$f":"SUMIFS(TBCompras[Valor Total Item (R$)],TBCompras[Mês do Projeto],\"<=\" & 21,TBCompras[Até],\">=\"& 21,TBCompras[Meta:Atividade],LEFT(B45,FIND(\" \",B45,1)-1),TBCompras[Tipo de Material],\"SERVIÇO\")","v":0},{"$f":"SUMIFS(TBCompras[Valor Total Item (R$)],TBCompras[Mês do Projeto],\"<=\" & 22,TBCompras[Até],\">=\"& 22,TBCompras[Meta:Atividade],LEFT(B45,FIND(\" \",B45,1)-1),TBCompras[Tipo de Material],\"SERVIÇO\")","v":0},{"$f":"SUMIFS(TBCompras[Valor Total Item (R$)],TBCompras[Mês do Projeto],\"<=\" & 23,TBCompras[Até],\">=\"& 23,TBCompras[Meta:Atividade],LEFT(B45,FIND(\" \",B45,1)-1),TBCompras[Tipo de Material],\"SERVIÇO\")","v":0},{"$f":"SUMIFS(TBCompras[Valor Total Item (R$)],TBCompras[Mês do Projeto],\"<=\" & 24,TBCompras[Até],\">=\"& 24,TBCompras[Meta:Atividade],LEFT(B45,FIND(\" \",B45,1)-1),TBCompras[Tipo de Material],\"SERVIÇO\")","v":0},{"$f":"SUMIFS(TBCompras[Valor Total Item (R$)],TBCompras[Mês do Projeto],\"<=\" & 25,TBCompras[Até],\">=\"& 25,TBCompras[Meta:Atividade],LEFT(B45,FIND(\" \",B45,1)-1),TBCompras[Tipo de Material],\"SERVIÇO\")","v":0},{"$f":"SUMIFS(TBCompras[Valor Total Item (R$)],TBCompras[Mês do Projeto],\"<=\" & 26,TBCompras[Até],\">=\"& 26,TBCompras[Meta:Atividade],LEFT(B45,FIND(\" \",B45,1)-1),TBCompras[Tipo de Material],\"SERVIÇO\")","v":0},{"$f":"SUMIFS(TBCompras[Valor Total Item (R$)],TBCompras[Mês do Projeto],\"<=\" & 27,TBCompras[Até],\">=\"& 27,TBCompras[Meta:Atividade],LEFT(B45,FIND(\" \",B45,1)-1),TBCompras[Tipo de Material],\"SERVIÇO\")","v":0},{"$f":"SUMIFS(TBCompras[Valor Total Item (R$)],TBCompras[Mês do Projeto],\"<=\" & 28,TBCompras[Até],\">=\"& 28,TBCompras[Meta:Atividade],LEFT(B45,FIND(\" \",B45,1)-1),TBCompras[Tipo de Material],\"SERVIÇO\")","v":0},{"$f":"SUMIFS(TBCompras[Valor Total Item (R$)],TBCompras[Mês do Projeto],\"<=\" & 29,TBCompras[Até],\">=\"& 29,TBCompras[Meta:Atividade],LEFT(B45,FIND(\" \",B45,1)-1),TBCompras[Tipo de Material],\"SERVIÇO\")","v":0},{"$f":"SUMIFS(TBCompras[Valor Total Item (R$)],TBCompras[Mês do Projeto],\"<=\" & 30,TBCompras[Até],\">=\"& 30,TBCompras[Meta:Atividade],LEFT(B45,FIND(\" \",B45,1)-1),TBCompras[Tipo de Material],\"SERVIÇO\")","v":0},{"$f":"SUMIFS(TBCompras[Valor Total Item (R$)],TBCompras[Mês do Projeto],\"<=\" & 31,TBCompras[Até],\">=\"& 31,TBCompras[Meta:Atividade],LEFT(B45,FIND(\" \",B45,1)-1),TBCompras[Tipo de Material],\"SERVIÇO\")","v":0},{"$f":"SUMIFS(TBCompras[Valor Total Item (R$)],TBCompras[Mês do Projeto],\"<=\" & 32,TBCompras[Até],\">=\"& 32,TBCompras[Meta:Atividade],LEFT(B45,FIND(\" \",B45,1)-1),TBCompras[Tipo de Material],\"SERVIÇO\")","v":0},{"$f":"SUMIFS(TBCompras[Valor Total Item (R$)],TBCompras[Mês do Projeto],\"<=\" & 33,TBCompras[Até],\">=\"& 33,TBCompras[Meta:Atividade],LEFT(B45,FIND(\" \",B45,1)-1),TBCompras[Tipo de Material],\"SERVIÇO\")","v":0},{"$f":"SUMIFS(TBCompras[Valor Total Item (R$)],TBCompras[Mês do Projeto],\"<=\" & 34,TBCompras[Até],\">=\"& 34,TBCompras[Meta:Atividade],LEFT(B45,FIND(\" \",B45,1)-1),TBCompras[Tipo de Material],\"SERVIÇO\")","v":0},{"$f":"SUMIFS(TBCompras[Valor Total Item (R$)],TBCompras[Mês do Projeto],\"<=\" & 35,TBCompras[Até],\">=\"& 35,TBCompras[Meta:Atividade],LEFT(B45,FIND(\" \",B45,1)-1),TBCompras[Tipo de Material],\"SERVIÇO\")","v":0},{"$f":"SUMIFS(TBCompras[Valor Total Item (R$)],TBCompras[Mês do Projeto],\"<=\" & 36,TBCompras[Até],\">=\"& 36,TBCompras[Meta:Atividade],LEFT(B45,FIND(\" \",B45,1)-1),TBCompras[Tipo de Material],\"SERVIÇO\")","v":0},0]
[null,null,"Passagens",{"$f":"SUMIFS(TbPassagens[Valor Total Passagem],TbPassagens[A partir do mês],\"<=\" & 1,TbPassagens[Até],\">=\"& 1,TbPassagens[Meta:Atividade],LEFT(B45,FIND(\" \",B45,1)-1))","v":0},{"$f":"SUMIFS(TbPassagens[Valor Total Passagem],TbPassagens[A partir do mês],\"<=\" & 2,TbPassagens[Até],\">=\"& 2,TbPassagens[Meta:Atividade],LEFT(B45,FIND(\" \",B45,1)-1))","v":0},{"$f":"SUMIFS(TbPassagens[Valor Total Passagem],TbPassagens[A partir do mês],\"<=\" & 3,TbPassagens[Até],\">=\"& 3,TbPassagens[Meta:Atividade],LEFT(B45,FIND(\" \",B45,1)-1))","v":0},{"$f":"SUMIFS(TbPassagens[Valor Total Passagem],TbPassagens[A partir do mês],\"<=\" & 4,TbPassagens[Até],\">=\"& 4,TbPassagens[Meta:Atividade],LEFT(B45,FIND(\" \",B45,1)-1))","v":0},{"$f":"SUMIFS(TbPassagens[Valor Total Passagem],TbPassagens[A partir do mês],\"<=\" & 5,TbPassagens[Até],\">=\"& 5,TbPassagens[Meta:Atividade],LEFT(B45,FIND(\" \",B45,1)-1))","v":0},{"$f":"SUMIFS(TbPassagens[Valor Total Passagem],TbPassagens[A partir do mês],\"<=\" & 6,TbPassagens[Até],\">=\"& 6,TbPassagens[Meta:Atividade],LEFT(B45,FIND(\" \",B45,1)-1))","v":0},{"$f":"SUMIFS(TbPassagens[Valor Total Passagem],TbPassagens[A partir do mês],\"<=\" & 7,TbPassagens[Até],\">=\"& 7,TbPassagens[Meta:Atividade],LEFT(B45,FIND(\" \",B45,1)-1))","v":0},{"$f":"SUMIFS(TbPassagens[Valor Total Passagem],TbPassagens[A partir do mês],\"<=\" & 8,TbPassagens[Até],\">=\"& 8,TbPassagens[Meta:Atividade],LEFT(B45,FIND(\" \",B45,1)-1))","v":0},{"$f":"SUMIFS(TbPassagens[Valor Total Passagem],TbPassagens[A partir do mês],\"<=\" & 9,TbPassagens[Até],\">=\"& 9,TbPassagens[Meta:Atividade],LEFT(B45,FIND(\" \",B45,1)-1))","v":0},{"$f":"SUMIFS(TbPassagens[Valor Total Passagem],TbPassagens[A partir do mês],\"<=\" & 10,TbPassagens[Até],\">=\"& 10,TbPassagens[Meta:Atividade],LEFT(B45,FIND(\" \",B45,1)-1))","v":0},{"$f":"SUMIFS(TbPassagens[Valor Total Passagem],TbPassagens[A partir do mês],\"<=\" & 11,TbPassagens[Até],\">=\"& 11,TbPassagens[Meta:Atividade],LEFT(B45,FIND(\" \",B45,1)-1))","v":0},{"$f":"SUMIFS(TbPassagens[Valor Total Passagem],TbPassagens[A partir do mês],\"<=\" & 12,TbPassagens[Até],\">=\"& 12,TbPassagens[Meta:Atividade],LEFT(B45,FIND(\" \",B45,1)-1))","v":0},{"$f":"SUMIFS(TbPassagens[Valor Total Passagem],TbPassagens[A partir do mês],\"<=\" & 13,TbPassagens[Até],\">=\"& 13,TbPassagens[Meta:Atividade],LEFT(B45,FIND(\" \",B45,1)-1))","v":0},{"$f":"SUMIFS(TbPassagens[Valor Total Passagem],TbPassagens[A partir do mês],\"<=\" & 14,TbPassagens[Até],\">=\"& 14,TbPassagens[Meta:Atividade],LEFT(B45,FIND(\" \",B45,1)-1))","v":0},{"$f":"SUMIFS(TbPassagens[Valor Total Passagem],TbPassagens[A partir do mês],\"<=\" & 15,TbPassagens[Até],\">=\"& 15,TbPassagens[Meta:Atividade],LEFT(B45,FIND(\" \",B45,1)-1))","v":0},{"$f":"SUMIFS(TbPassagens[Valor Total Passagem],TbPassagens[A partir do mês],\"<=\" & 16,TbPassagens[Até],\">=\"& 16,TbPassagens[Meta:Atividade],LEFT(B45,FIND(\" \",B45,1)-1))","v":0},{"$f":"SUMIFS(TbPassagens[Valor Total Passagem],TbPassagens[A partir do mês],\"<=\" & 17,TbPassagens[Até],\">=\"& 17,TbPassagens[Meta:Atividade],LEFT(B45,FIND(\" \",B45,1)-1))","v":0},{"$f":"SUMIFS(TbPassagens[Valor Total Passagem],TbPassagens[A partir do mês],\"<=\" & 18,TbPassagens[Até],\">=\"& 18,TbPassagens[Meta:Atividade],LEFT(B45,FIND(\" \",B45,1)-1))","v":0},{"$f":"SUMIFS(TbPassagens[Valor Total Passagem],TbPassagens[A partir do mês],\"<=\" & 19,TbPassagens[Até],\">=\"& 19,TbPassagens[Meta:Atividade],LEFT(B45,FIND(\" \",B45,1)-1))","v":0},{"$f":"SUMIFS(TbPassagens[Valor Total Passagem],TbPassagens[A partir do mês],\"<=\" & 20,TbPassagens[Até],\">=\"& 20,TbPassagens[Meta:Atividade],LEFT(B45,FIND(\" \",B45,1)-1))","v":0},{"$f":"SUMIFS(TbPassagens[Valor Total Passagem],TbPassagens[A partir do mês],\"<=\" & 21,TbPassagens[Até],\">=\"& 21,TbPassagens[Meta:Atividade],LEFT(B45,FIND(\" \",B45,1)-1))","v":0},{"$f":"SUMIFS(TbPassagens[Valor Total Passagem],TbPassagens[A partir do mês],\"<=\" & 22,TbPassagens[Até],\">=\"& 22,TbPassagens[Meta:Atividade],LEFT(B45,FIND(\" \",B45,1)-1))","v":0},{"$f":"SUMIFS(TbPassagens[Valor Total Passagem],TbPassagens[A partir do mês],\"<=\" & 23,TbPassagens[Até],\">=\"& 23,TbPassagens[Meta:Atividade],LEFT(B45,FIND(\" \",B45,1)-1))","v":0},{"$f":"SUMIFS(TbPassagens[Valor Total Passagem],TbPassagens[A partir do mês],\"<=\" & 24,TbPassagens[Até],\">=\"& 24,TbPassagens[Meta:Atividade],LEFT(B45,FIND(\" \",B45,1)-1))","v":0},{"$f":"SUMIFS(TbPassagens[Valor Total Passagem],TbPassagens[A partir do mês],\"<=\" & 25,TbPassagens[Até],\">=\"& 25,TbPassagens[Meta:Atividade],LEFT(B45,FIND(\" \",B45,1)-1))","v":0},{"$f":"SUMIFS(TbPassagens[Valor Total Passagem],TbPassagens[A partir do mês],\"<=\" & 26,TbPassagens[Até],\">=\"& 26,TbPassagens[Meta:Atividade],LEFT(B45,FIND(\" \",B45,1)-1))","v":0},{"$f":"SUMIFS(TbPassagens[Valor Total Passagem],TbPassagens[A partir do mês],\"<=\" & 27,TbPassagens[Até],\">=\"& 27,TbPassagens[Meta:Atividade],LEFT(B45,FIND(\" \",B45,1)-1))","v":0},{"$f":"SUMIFS(TbPassagens[Valor Total Passagem],TbPassagens[A partir do mês],\"<=\" & 28,TbPassagens[Até],\">=\"& 28,TbPassagens[Meta:Atividade],LEFT(B45,FIND(\" \",B45,1)-1))","v":0},{"$f":"SUMIFS(TbPassagens[Valor Total Passagem],TbPassagens[A partir do mês],\"<=\" & 29,TbPassagens[Até],\">=\"& 29,TbPassagens[Meta:Atividade],LEFT(B45,FIND(\" \",B45,1)-1))","v":0},{"$f":"SUMIFS(TbPassagens[Valor Total Passagem],TbPassagens[A partir do mês],\"<=\" & 30,TbPassagens[Até],\">=\"& 30,TbPassagens[Meta:Atividade],LEFT(B45,FIND(\" \",B45,1)-1))","v":0},{"$f":"SUMIFS(TbPassagens[Valor Total Passagem],TbPassagens[A partir do mês],\"<=\" & 31,TbPassagens[Até],\">=\"& 31,TbPassagens[Meta:Atividade],LEFT(B45,FIND(\" \",B45,1)-1))","v":0},{"$f":"SUMIFS(TbPassagens[Valor Total Passagem],TbPassagens[A partir do mês],\"<=\" & 32,TbPassagens[Até],\">=\"& 32,TbPassagens[Meta:Atividade],LEFT(B45,FIND(\" \",B45,1)-1))","v":0},{"$f":"SUMIFS(TbPassagens[Valor Total Passagem],TbPassagens[A partir do mês],\"<=\" & 33,TbPassagens[Até],\">=\"& 33,TbPassagens[Meta:Atividade],LEFT(B45,FIND(\" \",B45,1)-1))","v":0},{"$f":"SUMIFS(TbPassagens[Valor Total Passagem],TbPassagens[A partir do mês],\"<=\" & 34,TbPassagens[Até],\">=\"& 34,TbPassagens[Meta:Atividade],LEFT(B45,FIND(\" \",B45,1)-1))","v":0},{"$f":"SUMIFS(TbPassagens[Valor Total Passagem],TbPassagens[A partir do mês],\"<=\" & 35,TbPassagens[Até],\">=\"& 35,TbPassagens[Meta:Atividade],LEFT(B45,FIND(\" \",B45,1)-1))","v":0},{"$f":"SUMIFS(TbPassagens[Valor Total Passagem],TbPassagens[A partir do mês],\"<=\" & 36,TbPassagens[Até],\">=\"& 36,TbPassagens[Meta:Atividade],LEFT(B45,FIND(\" \",B45,1)-1))","v":0},0]
[null,null,"Diárias",{"$f":"SUMIFS(TbPassagens[Valor Total Diária],TbPassagens[A partir do mês],\"<=\" & 1,TbPassagens[Até],\">=\"& 1,TbPassagens[Meta:Atividade],LEFT(B45,FIND(\" \",B45,1)-1))","v":0},{"$f":"SUMIFS(TbPassagens[Valor Total Diária],TbPassagens[A partir do mês],\"<=\" & 2,TbPassagens[Até],\">=\"& 2,TbPassagens[Meta:Atividade],LEFT(B45,FIND(\" \",B45,1)-1))","v":0},{"$f":"SUMIFS(TbPassagens[Valor Total Diária],TbPassagens[A partir do mês],\"<=\" & 3,TbPassagens[Até],\">=\"& 3,TbPassagens[Meta:Atividade],LEFT(B45,FIND(\" \",B45,1)-1))","v":0},{"$f":"SUMIFS(TbPassagens[Valor Total Diária],TbPassagens[A partir do mês],\"<=\" & 4,TbPassagens[Até],\">=\"& 4,TbPassagens[Meta:Atividade],LEFT(B45,FIND(\" \",B45,1)-1))","v":0},{"$f":"SUMIFS(TbPassagens[Valor Total Diária],TbPassagens[A partir do mês],\"<=\" & 5,TbPassagens[Até],\">=\"& 5,TbPassagens[Meta:Atividade],LEFT(B45,FIND(\" \",B45,1)-1))","v":0},{"$f":"SUMIFS(TbPassagens[Valor Total Diária],TbPassagens[A partir do mês],\"<=\" & 6,TbPassagens[Até],\">=\"& 6,TbPassagens[Meta:Atividade],LEFT(B45,FIND(\" \",B45,1)-1))","v":0},{"$f":"SUMIFS(TbPassagens[Valor Total Diária],TbPassagens[A partir do mês],\"<=\" & 7,TbPassagens[Até],\">=\"& 7,TbPassagens[Meta:Atividade],LEFT(B45,FIND(\" \",B45,1)-1))","v":0},{"$f":"SUMIFS(TbPassagens[Valor Total Diária],TbPassagens[A partir do mês],\"<=\" & 8,TbPassagens[Até],\">=\"& 8,TbPassagens[Meta:Atividade],LEFT(B45,FIND(\" \",B45,1)-1))","v":0},{"$f":"SUMIFS(TbPassagens[Valor Total Diária],TbPassagens[A partir do mês],\"<=\" & 9,TbPassagens[Até],\">=\"& 9,TbPassagens[Meta:Atividade],LEFT(B45,FIND(\" \",B45,1)-1))","v":0},{"$f":"SUMIFS(TbPassagens[Valor Total Diária],TbPassagens[A partir do mês],\"<=\" & 10,TbPassagens[Até],\">=\"& 10,TbPassagens[Meta:Atividade],LEFT(B45,FIND(\" \",B45,1)-1))","v":0},{"$f":"SUMIFS(TbPassagens[Valor Total Diária],TbPassagens[A partir do mês],\"<=\" & 11,TbPassagens[Até],\">=\"& 11,TbPassagens[Meta:Atividade],LEFT(B45,FIND(\" \",B45,1)-1))","v":0},{"$f":"SUMIFS(TbPassagens[Valor Total Diária],TbPassagens[A partir do mês],\"<=\" & 12,TbPassagens[Até],\">=\"& 12,TbPassagens[Meta:Atividade],LEFT(B45,FIND(\" \",B45,1)-1))","v":0},{"$f":"SUMIFS(TbPassagens[Valor Total Diária],TbPassagens[A partir do mês],\"<=\" & 13,TbPassagens[Até],\">=\"& 13,TbPassagens[Meta:Atividade],LEFT(B45,FIND(\" \",B45,1)-1))","v":0},{"$f":"SUMIFS(TbPassagens[Valor Total Diária],TbPassagens[A partir do mês],\"<=\" & 14,TbPassagens[Até],\">=\"& 14,TbPassagens[Meta:Atividade],LEFT(B45,FIND(\" \",B45,1)-1))","v":0},{"$f":"SUMIFS(TbPassagens[Valor Total Diária],TbPassagens[A partir do mês],\"<=\" & 15,TbPassagens[Até],\">=\"& 15,TbPassagens[Meta:Atividade],LEFT(B45,FIND(\" \",B45,1)-1))","v":0},{"$f":"SUMIFS(TbPassagens[Valor Total Diária],TbPassagens[A partir do mês],\"<=\" & 16,TbPassagens[Até],\">=\"& 16,TbPassagens[Meta:Atividade],LEFT(B45,FIND(\" \",B45,1)-1))","v":0},{"$f":"SUMIFS(TbPassagens[Valor Total Diária],TbPassagens[A partir do mês],\"<=\" & 17,TbPassagens[Até],\">=\"& 17,TbPassagens[Meta:Atividade],LEFT(B45,FIND(\" \",B45,1)-1))","v":0},{"$f":"SUMIFS(TbPassagens[Valor Total Diária],TbPassagens[A partir do mês],\"<=\" & 18,TbPassagens[Até],\">=\"& 18,TbPassagens[Meta:Atividade],LEFT(B45,FIND(\" \",B45,1)-1))","v":0},{"$f":"SUMIFS(TbPassagens[Valor Total Diária],TbPassagens[A partir do mês],\"<=\" & 19,TbPassagens[Até],\">=\"& 19,TbPassagens[Meta:Atividade],LEFT(B45,FIND(\" \",B45,1)-1))","v":0},{"$f":"SUMIFS(TbPassagens[Valor Total Diária],TbPassagens[A partir do mês],\"<=\" & 20,TbPassagens[Até],\">=\"& 20,TbPassagens[Meta:Atividade],LEFT(B45,FIND(\" \",B45,1)-1))","v":0},{"$f":"SUMIFS(TbPassagens[Valor Total Diária],TbPassagens[A partir do mês],\"<=\" & 21,TbPassagens[Até],\">=\"& 21,TbPassagens[Meta:Atividade],LEFT(B45,FIND(\" \",B45,1)-1))","v":0},{"$f":"SUMIFS(TbPassagens[Valor Total Diária],TbPassagens[A partir do mês],\"<=\" & 22,TbPassagens[Até],\">=\"& 22,TbPassagens[Meta:Atividade],LEFT(B45,FIND(\" \",B45,1)-1))","v":0},{"$f":"SUMIFS(TbPassagens[Valor Total Diária],TbPassagens[A partir do mês],\"<=\" & 23,TbPassagens[Até],\">=\"& 23,TbPassagens[Meta:Atividade],LEFT(B45,FIND(\" \",B45,1)-1))","v":0},{"$f":"SUMIFS(TbPassagens[Valor Total Diária],TbPassagens[A partir do mês],\"<=\" & 24,TbPassagens[Até],\">=\"& 24,TbPassagens[Meta:Atividade],LEFT(B45,FIND(\" \",B45,1)-1))","v":0},{"$f":"SUMIFS(TbPassagens[Valor Total Diária],TbPassagens[A partir do mês],\"<=\" & 25,TbPassagens[Até],\">=\"& 25,TbPassagens[Meta:Atividade],LEFT(B45,FIND(\" \",B45,1)-1))","v":0},{"$f":"SUMIFS(TbPassagens[Valor Total Diária],TbPassagens[A partir do mês],\"<=\" & 26,TbPassagens[Até],\">=\"& 26,TbPassagens[Meta:Atividade],LEFT(B45,FIND(\" \",B45,1)-1))","v":0},{"$f":"SUMIFS(TbPassagens[Valor Total Diária],TbPassagens[A partir do mês],\"<=\" & 27,TbPassagens[Até],\">=\"& 27,TbPassagens[Meta:Atividade],LEFT(B45,FIND(\" \",B45,1)-1))","v":0},{"$f":"SUMIFS(TbPassagens[Valor Total Diária],TbPassagens[A partir do mês],\"<=\" & 28,TbPassagens[Até],\">=\"& 28,TbPassagens[Meta:Atividade],LEFT(B45,FIND(\" \",B45,1)-1))","v":0},{"$f":"SUMIFS(TbPassagens[Valor Total Diária],TbPassagens[A partir do mês],\"<=\" & 29,TbPassagens[Até],\">=\"& 29,TbPassagens[Meta:Atividade],LEFT(B45,FIND(\" \",B45,1)-1))","v":0},{"$f":"SUMIFS(TbPassagens[Valor Total Diária],TbPassagens[A partir do mês],\"<=\" & 30,TbPassagens[Até],\">=\"& 30,TbPassagens[Meta:Atividade],LEFT(B45,FIND(\" \",B45,1)-1))","v":0},{"$f":"SUMIFS(TbPassagens[Valor Total Diária],TbPassagens[A partir do mês],\"<=\" & 31,TbPassagens[Até],\">=\"& 31,TbPassagens[Meta:Atividade],LEFT(B45,FIND(\" \",B45,1)-1))","v":0},{"$f":"SUMIFS(TbPassagens[Valor Total Diária],TbPassagens[A partir do mês],\"<=\" & 32,TbPassagens[Até],\">=\"& 32,TbPassagens[Meta:Atividade],LEFT(B45,FIND(\" \",B45,1)-1))","v":0},{"$f":"SUMIFS(TbPassagens[Valor Total Diária],TbPassagens[A partir do mês],\"<=\" & 33,TbPassagens[Até],\">=\"& 33,TbPassagens[Meta:Atividade],LEFT(B45,FIND(\" \",B45,1)-1))","v":0},{"$f":"SUMIFS(TbPassagens[Valor Total Diária],TbPassagens[A partir do mês],\"<=\" & 34,TbPassagens[Até],\">=\"& 34,TbPassagens[Meta:Atividade],LEFT(B45,FIND(\" \",B45,1)-1))","v":0},{"$f":"SUMIFS(TbPassagens[Valor Total Diária],TbPassagens[A partir do mês],\"<=\" & 35,TbPassagens[Até],\">=\"& 35,TbPassagens[Meta:Atividade],LEFT(B45,FIND(\" \",B45,1)-1))","v":0},{"$f":"SUMIFS(TbPassagens[Valor Total Diária],TbPassagens[A partir do mês],\"<=\" & 36,TbPassagens[Até],\">=\"& 36,TbPassagens[Meta:Atividade],LEFT(B45,FIND(\" \",B45,1)-1))","v":0},0]
[null,null,"Material de Consumo",{"$f":"SUMIFS(TBCompras[Valor Total Item (R$)],TBCompras[Mês do Projeto],\"<=\" & 1,TBCompras[Até],\">=\"& 1,TBCompras[Meta:Atividade],LEFT(B45,FIND(\" \",B45,1)-1),TBCompras[Tipo de Material],\"CONSUMO\")","v":0},{"$f":"SUMIFS(TBCompras[Valor Total Item (R$)],TBCompras[Mês do Projeto],\"<=\" & 2,TBCompras[Até],\">=\"& 2,TBCompras[Meta:Atividade],LEFT(B45,FIND(\" \",B45,1)-1),TBCompras[Tipo de Material],\"CONSUMO\")","v":0},{"$f":"SUMIFS(TBCompras[Valor Total Item (R$)],TBCompras[Mês do Projeto],\"<=\" & 3,TBCompras[Até],\">=\"& 3,TBCompras[Meta:Atividade],LEFT(B45,FIND(\" \",B45,1)-1),TBCompras[Tipo de Material],\"CONSUMO\")","v":0},{"$f":"SUMIFS(TBCompras[Valor Total Item (R$)],TBCompras[Mês do Projeto],\"<=\" & 4,TBCompras[Até],\">=\"& 4,TBCompras[Meta:Atividade],LEFT(B45,FIND(\" \",B45,1)-1),TBCompras[Tipo de Material],\"CONSUMO\")","v":0},{"$f":"SUMIFS(TBCompras[Valor Total Item (R$)],TBCompras[Mês do Projeto],\"<=\" & 5,TBCompras[Até],\">=\"& 5,TBCompras[Meta:Atividade],LEFT(B45,FIND(\" \",B45,1)-1),TBCompras[Tipo de Material],\"CONSUMO\")","v":0},{"$f":"SUMIFS(TBCompras[Valor Total Item (R$)],TBCompras[Mês do Projeto],\"<=\" & 6,TBCompras[Até],\">=\"& 6,TBCompras[Meta:Atividade],LEFT(B45,FIND(\" \",B45,1)-1),TBCompras[Tipo de Material],\"CONSUMO\")","v":0},{"$f":"SUMIFS(TBCompras[Valor Total Item (R$)],TBCompras[Mês do Projeto],\"<=\" & 7,TBCompras[Até],\">=\"& 7,TBCompras[Meta:Atividade],LEFT(B45,FIND(\" \",B45,1)-1),TBCompras[Tipo de Material],\"CONSUMO\")","v":0},{"$f":"SUMIFS(TBCompras[Valor Total Item (R$)],TBCompras[Mês do Projeto],\"<=\" & 8,TBCompras[Até],\">=\"& 8,TBCompras[Meta:Atividade],LEFT(B45,FIND(\" \",B45,1)-1),TBCompras[Tipo de Material],\"CONSUMO\")","v":0},{"$f":"SUMIFS(TBCompras[Valor Total Item (R$)],TBCompras[Mês do Projeto],\"<=\" & 9,TBCompras[Até],\">=\"& 9,TBCompras[Meta:Atividade],LEFT(B45,FIND(\" \",B45,1)-1),TBCompras[Tipo de Material],\"CONSUMO\")","v":0},{"$f":"SUMIFS(TBCompras[Valor Total Item (R$)],TBCompras[Mês do Projeto],\"<=\" & 10,TBCompras[Até],\">=\"& 10,TBCompras[Meta:Atividade],LEFT(B45,FIND(\" \",B45,1)-1),TBCompras[Tipo de Material],\"CONSUMO\")","v":0},{"$f":"SUMIFS(TBCompras[Valor Total Item (R$)],TBCompras[Mês do Projeto],\"<=\" & 11,TBCompras[Até],\">=\"& 11,TBCompras[Meta:Atividade],LEFT(B45,FIND(\" \",B45,1)-1),TBCompras[Tipo de Material],\"CONSUMO\")","v":0},{"$f":"SUMIFS(TBCompras[Valor Total Item (R$)],TBCompras[Mês do Projeto],\"<=\" & 12,TBCompras[Até],\">=\"& 12,TBCompras[Meta:Atividade],LEFT(B45,FIND(\" \",B45,1)-1),TBCompras[Tipo de Material],\"CONSUMO\")","v":0},{"$f":"SUMIFS(TBCompras[Valor Total Item (R$)],TBCompras[Mês do Projeto],\"<=\" & 13,TBCompras[Até],\">=\"& 13,TBCompras[Meta:Atividade],LEFT(B45,FIND(\" \",B45,1)-1),TBCompras[Tipo de Material],\"CONSUMO\")","v":0},{"$f":"SUMIFS(TBCompras[Valor Total Item (R$)],TBCompras[Mês do Projeto],\"<=\" & 14,TBCompras[Até],\">=\"& 14,TBCompras[Meta:Atividade],LEFT(B45,FIND(\" \",B45,1)-1),TBCompras[Tipo de Material],\"CONSUMO\")","v":0},{"$f":"SUMIFS(TBCompras[Valor Total Item (R$)],TBCompras[Mês do Projeto],\"<=\" & 15,TBCompras[Até],\">=\"& 15,TBCompras[Meta:Atividade],LEFT(B45,FIND(\" \",B45,1)-1),TBCompras[Tipo de Material],\"CONSUMO\")","v":0},{"$f":"SUMIFS(TBCompras[Valor Total Item (R$)],TBCompras[Mês do Projeto],\"<=\" & 16,TBCompras[Até],\">=\"& 16,TBCompras[Meta:Atividade],LEFT(B45,FIND(\" \",B45,1)-1),TBCompras[Tipo de Material],\"CONSUMO\")","v":0},{"$f":"SUMIFS(TBCompras[Valor Total Item (R$)],TBCompras[Mês do Projeto],\"<=\" & 17,TBCompras[Até],\">=\"& 17,TBCompras[Meta:Atividade],LEFT(B45,FIND(\" \",B45,1)-1),TBCompras[Tipo de Material],\"CONSUMO\")","v":0},{"$f":"SUMIFS(TBCompras[Valor Total Item (R$)],TBCompras[Mês do Projeto],\"<=\" & 18,TBCompras[Até],\">=\"& 18,TBCompras[Meta:Atividade],LEFT(B45,FIND(\" \",B45,1)-1),TBCompras[Tipo de Material],\"CONSUMO\")","v":0},{"$f":"SUMIFS(TBCompras[Valor Total Item (R$)],TBCompras[Mês do Projeto],\"<=\" & 19,TBCompras[Até],\">=\"& 19,TBCompras[Meta:Atividade],LEFT(B45,FIND(\" \",B45,1)-1),TBCompras[Tipo de Material],\"CONSUMO\")","v":0},{"$f":"SUMIFS(TBCompras[Valor Total Item (R$)],TBCompras[Mês do Projeto],\"<=\" & 20,TBCompras[Até],\">=\"& 20,TBCompras[Meta:Atividade],LEFT(B45,FIND(\" \",B45,1)-1),TBCompras[Tipo de Material],\"CONSUMO\")","v":0},{"$f":"SUMIFS(TBCompras[Valor Total Item (R$)],TBCompras[Mês do Projeto],\"<=\" & 21,TBCompras[Até],\">=\"& 21,TBCompras[Meta:Atividade],LEFT(B45,FIND(\" \",B45,1)-1),TBCompras[Tipo de Material],\"CONSUMO\")","v":0},{"$f":"SUMIFS(TBCompras[Valor Total Item (R$)],TBCompras[Mês do Projeto],\"<=\" & 22,TBCompras[Até],\">=\"& 22,TBCompras[Meta:Atividade],LEFT(B45,FIND(\" \",B45,1)-1),TBCompras[Tipo de Material],\"CONSUMO\")","v":0},{"$f":"SUMIFS(TBCompras[Valor Total Item (R$)],TBCompras[Mês do Projeto],\"<=\" & 23,TBCompras[Até],\">=\"& 23,TBCompras[Meta:Atividade],LEFT(B45,FIND(\" \",B45,1)-1),TBCompras[Tipo de Material],\"CONSUMO\")","v":0},{"$f":"SUMIFS(TBCompras[Valor Total Item (R$)],TBCompras[Mês do Projeto],\"<=\" & 24,TBCompras[Até],\">=\"& 24,TBCompras[Meta:Atividade],LEFT(B45,FIND(\" \",B45,1)-1),TBCompras[Tipo de Material],\"CONSUMO\")","v":0},{"$f":"SUMIFS(TBCompras[Valor Total Item (R$)],TBCompras[Mês do Projeto],\"<=\" & 25,TBCompras[Até],\">=\"& 25,TBCompras[Meta:Atividade],LEFT(B45,FIND(\" \",B45,1)-1),TBCompras[Tipo de Material],\"CONSUMO\")","v":0},{"$f":"SUMIFS(TBCompras[Valor Total Item (R$)],TBCompras[Mês do Projeto],\"<=\" & 26,TBCompras[Até],\">=\"& 26,TBCompras[Meta:Atividade],LEFT(B45,FIND(\" \",B45,1)-1),TBCompras[Tipo de Material],\"CONSUMO\")","v":0},{"$f":"SUMIFS(TBCompras[Valor Total Item (R$)],TBCompras[Mês do Projeto],\"<=\" & 27,TBCompras[Até],\">=\"& 27,TBCompras[Meta:Atividade],LEFT(B45,FIND(\" \",B45,1)-1),TBCompras[Tipo de Material],\"CONSUMO\")","v":0},{"$f":"SUMIFS(TBCompras[Valor Total Item (R$)],TBCompras[Mês do Projeto],\"<=\" & 28,TBCompras[Até],\">=\"& 28,TBCompras[Meta:Atividade],LEFT(B45,FIND(\" \",B45,1)-1),TBCompras[Tipo de Material],\"CONSUMO\")","v":0},{"$f":"SUMIFS(TBCompras[Valor Total Item (R$)],TBCompras[Mês do Projeto],\"<=\" & 29,TBCompras[Até],\">=\"& 29,TBCompras[Meta:Atividade],LEFT(B45,FIND(\" \",B45,1)-1),TBCompras[Tipo de Material],\"CONSUMO\")","v":0},{"$f":"SUMIFS(TBCompras[Valor Total Item (R$)],TBCompras[Mês do Projeto],\"<=\" & 30,TBCompras[Até],\">=\"& 30,TBCompras[Meta:Atividade],LEFT(B45,FIND(\" \",B45,1)-1),TBCompras[Tipo de Material],\"CONSUMO\")","v":0},{"$f":"SUMIFS(TBCompras[Valor Total Item (R$)],TBCompras[Mês do Projeto],\"<=\" & 31,TBCompras[Até],\">=\"& 31,TBCompras[Meta:Atividade],LEFT(B45,FIND(\" \",B45,1)-1),TBCompras[Tipo de Material],\"CONSUMO\")","v":0},{"$f":"SUMIFS(TBCompras[Valor Total Item (R$)],TBCompras[Mês do Projeto],\"<=\" & 32,TBCompras[Até],\">=\"& 32,TBCompras[Meta:Atividade],LEFT(B45,FIND(\" \",B45,1)-1),TBCompras[Tipo de Material],\"CONSUMO\")","v":0},{"$f":"SUMIFS(TBCompras[Valor Total Item (R$)],TBCompras[Mês do Projeto],\"<=\" & 33,TBCompras[Até],\">=\"& 33,TBCompras[Meta:Atividade],LEFT(B45,FIND(\" \",B45,1)-1),TBCompras[Tipo de Material],\"CONSUMO\")","v":0},{"$f":"SUMIFS(TBCompras[Valor Total Item (R$)],TBCompras[Mês do Projeto],\"<=\" & 34,TBCompras[Até],\">=\"& 34,TBCompras[Meta:Atividade],LEFT(B45,FIND(\" \",B45,1)-1),TBCompras[Tipo de Material],\"CONSUMO\")","v":0},{"$f":"SUMIFS(TBCompras[Valor Total Item (R$)],TBCompras[Mês do Projeto],\"<=\" & 35,TBCompras[Até],\">=\"& 35,TBCompras[Meta:Atividade],LEFT(B45,FIND(\" \",B45,1)-1),TBCompras[Tipo de Material],\"CONSUMO\")","v":0},{"$f":"SUMIFS(TBCompras[Valor Total Item (R$)],TBCompras[Mês do Projeto],\"<=\" & 36,TBCompras[Até],\">=\"& 36,TBCompras[Meta:Atividade],LEFT(B45,FIND(\" \",B45,1)-1),TBCompras[Tipo de Material],\"CONSUMO\")","v":0},0]
[null,null,"Equipamentos",{"$f":"SUMIFS(TBCompras[Valor Total Item (R$)],TBCompras[Mês do Projeto],\"<=\" & 1,TBCompras[Até],\">=\"& 1,TBCompras[Meta:Atividade],LEFT(B45,FIND(\" \",B45,1)-1),TBCompras[Tipo de Material],\"EQUIPAMENTO\")","v":0},{"$f":"SUMIFS(TBCompras[Valor Total Item (R$)],TBCompras[Mês do Projeto],\"<=\" & 2,TBCompras[Até],\">=\"& 2,TBCompras[Meta:Atividade],LEFT(B45,FIND(\" \",B45,1)-1),TBCompras[Tipo de Material],\"EQUIPAMENTO\")","v":0},{"$f":"SUMIFS(TBCompras[Valor Total Item (R$)],TBCompras[Mês do Projeto],\"<=\" & 3,TBCompras[Até],\">=\"& 3,TBCompras[Meta:Atividade],LEFT(B45,FIND(\" \",B45,1)-1),TBCompras[Tipo de Material],\"EQUIPAMENTO\")","v":0},{"$f":"SUMIFS(TBCompras[Valor Total Item (R$)],TBCompras[Mês do Projeto],\"<=\" & 4,TBCompras[Até],\">=\"& 4,TBCompras[Meta:Atividade],LEFT(B45,FIND(\" \",B45,1)-1),TBCompras[Tipo de Material],\"EQUIPAMENTO\")","v":0},{"$f":"SUMIFS(TBCompras[Valor Total Item (R$)],TBCompras[Mês do Projeto],\"<=\" & 5,TBCompras[Até],\">=\"& 5,TBCompras[Meta:Atividade],LEFT(B45,FIND(\" \",B45,1)-1),TBCompras[Tipo de Material],\"EQUIPAMENTO\")","v":0},{"$f":"SUMIFS(TBCompras[Valor Total Item (R$)],TBCompras[Mês do Projeto],\"<=\" & 6,TBCompras[Até],\">=\"& 6,TBCompras[Meta:Atividade],LEFT(B45,FIND(\" \",B45,1)-1),TBCompras[Tipo de Material],\"EQUIPAMENTO\")","v":0},{"$f":"SUMIFS(TBCompras[Valor Total Item (R$)],TBCompras[Mês do Projeto],\"<=\" & 7,TBCompras[Até],\">=\"& 7,TBCompras[Meta:Atividade],LEFT(B45,FIND(\" \",B45,1)-1),TBCompras[Tipo de Material],\"EQUIPAMENTO\")","v":0},{"$f":"SUMIFS(TBCompras[Valor Total Item (R$)],TBCompras[Mês do Projeto],\"<=\" & 8,TBCompras[Até],\">=\"& 8,TBCompras[Meta:Atividade],LEFT(B45,FIND(\" \",B45,1)-1),TBCompras[Tipo de Material],\"EQUIPAMENTO\")","v":0},{"$f":"SUMIFS(TBCompras[Valor Total Item (R$)],TBCompras[Mês do Projeto],\"<=\" & 9,TBCompras[Até],\">=\"& 9,TBCompras[Meta:Atividade],LEFT(B45,FIND(\" \",B45,1)-1),TBCompras[Tipo de Material],\"EQUIPAMENTO\")","v":0},{"$f":"SUMIFS(TBCompras[Valor Total Item (R$)],TBCompras[Mês do Projeto],\"<=\" & 10,TBCompras[Até],\">=\"& 10,TBCompras[Meta:Atividade],LEFT(B45,FIND(\" \",B45,1)-1),TBCompras[Tipo de Material],\"EQUIPAMENTO\")","v":0},{"$f":"SUMIFS(TBCompras[Valor Total Item (R$)],TBCompras[Mês do Projeto],\"<=\" & 11,TBCompras[Até],\">=\"& 11,TBCompras[Meta:Atividade],LEFT(B45,FIND(\" \",B45,1)-1),TBCompras[Tipo de Material],\"EQUIPAMENTO\")","v":0},{"$f":"SUMIFS(TBCompras[Valor Total Item (R$)],TBCompras[Mês do Projeto],\"<=\" & 12,TBCompras[Até],\">=\"& 12,TBCompras[Meta:Atividade],LEFT(B45,FIND(\" \",B45,1)-1),TBCompras[Tipo de Material],\"EQUIPAMENTO\")","v":0},{"$f":"SUMIFS(TBCompras[Valor Total Item (R$)],TBCompras[Mês do Projeto],\"<=\" & 13,TBCompras[Até],\">=\"& 13,TBCompras[Meta:Atividade],LEFT(B45,FIND(\" \",B45,1)-1),TBCompras[Tipo de Material],\"EQUIPAMENTO\")","v":0},{"$f":"SUMIFS(TBCompras[Valor Total Item (R$)],TBCompras[Mês do Projeto],\"<=\" & 14,TBCompras[Até],\">=\"& 14,TBCompras[Meta:Atividade],LEFT(B45,FIND(\" \",B45,1)-1),TBCompras[Tipo de Material],\"EQUIPAMENTO\")","v":0},{"$f":"SUMIFS(TBCompras[Valor Total Item (R$)],TBCompras[Mês do Projeto],\"<=\" & 15,TBCompras[Até],\">=\"& 15,TBCompras[Meta:Atividade],LEFT(B45,FIND(\" \",B45,1)-1),TBCompras[Tipo de Material],\"EQUIPAMENTO\")","v":0},{"$f":"SUMIFS(TBCompras[Valor Total Item (R$)],TBCompras[Mês do Projeto],\"<=\" & 16,TBCompras[Até],\">=\"& 16,TBCompras[Meta:Atividade],LEFT(B45,FIND(\" \",B45,1)-1),TBCompras[Tipo de Material],\"EQUIPAMENTO\")","v":0},{"$f":"SUMIFS(TBCompras[Valor Total Item (R$)],TBCompras[Mês do Projeto],\"<=\" & 17,TBCompras[Até],\">=\"& 17,TBCompras[Meta:Atividade],LEFT(B45,FIND(\" \",B45,1)-1),TBCompras[Tipo de Material],\"EQUIPAMENTO\")","v":0},{"$f":"SUMIFS(TBCompras[Valor Total Item (R$)],TBCompras[Mês do Projeto],\"<=\" & 18,TBCompras[Até],\">=\"& 18,TBCompras[Meta:Atividade],LEFT(B45,FIND(\" \",B45,1)-1),TBCompras[Tipo de Material],\"EQUIPAMENTO\")","v":0},{"$f":"SUMIFS(TBCompras[Valor Total Item (R$)],TBCompras[Mês do Projeto],\"<=\" & 19,TBCompras[Até],\">=\"& 19,TBCompras[Meta:Atividade],LEFT(B45,FIND(\" \",B45,1)-1),TBCompras[Tipo de Material],\"EQUIPAMENTO\")","v":0},{"$f":"SUMIFS(TBCompras[Valor Total Item (R$)],TBCompras[Mês do Projeto],\"<=\" & 20,TBCompras[Até],\">=\"& 20,TBCompras[Meta:Atividade],LEFT(B45,FIND(\" \",B45,1)-1),TBCompras[Tipo de Material],\"EQUIPAMENTO\")","v":0},{"$f":"SUMIFS(TBCompras[Valor Total Item (R$)],TBCompras[Mês do Projeto],\"<=\" & 21,TBCompras[Até],\">=\"& 21,TBCompras[Meta:Atividade],LEFT(B45,FIND(\" \",B45,1)-1),TBCompras[Tipo de Material],\"EQUIPAMENTO\")","v":0},{"$f":"SUMIFS(TBCompras[Valor Total Item (R$)],TBCompras[Mês do Projeto],\"<=\" & 22,TBCompras[Até],\">=\"& 22,TBCompras[Meta:Atividade],LEFT(B45,FIND(\" \",B45,1)-1),TBCompras[Tipo de Material],\"EQUIPAMENTO\")","v":0},{"$f":"SUMIFS(TBCompras[Valor Total Item (R$)],TBCompras[Mês do Projeto],\"<=\" & 23,TBCompras[Até],\">=\"& 23,TBCompras[Meta:Atividade],LEFT(B45,FIND(\" \",B45,1)-1),TBCompras[Tipo de Material],\"EQUIPAMENTO\")","v":0},{"$f":"SUMIFS(TBCompras[Valor Total Item (R$)],TBCompras[Mês do Projeto],\"<=\" & 24,TBCompras[Até],\">=\"& 24,TBCompras[Meta:Atividade],LEFT(B45,FIND(\" \",B45,1)-1),TBCompras[Tipo de Material],\"EQUIPAMENTO\")","v":0},{"$f":"SUMIFS(TBCompras[Valor Total Item (R$)],TBCompras[Mês do Projeto],\"<=\" & 25,TBCompras[Até],\">=\"& 25,TBCompras[Meta:Atividade],LEFT(B45,FIND(\" \",B45,1)-1),TBCompras[Tipo de Material],\"EQUIPAMENTO\")","v":0},{"$f":"SUMIFS(TBCompras[Valor Total Item (R$)],TBCompras[Mês do Projeto],\"<=\" & 26,TBCompras[Até],\">=\"& 26,TBCompras[Meta:Atividade],LEFT(B45,FIND(\" \",B45,1)-1),TBCompras[Tipo de Material],\"EQUIPAMENTO\")","v":0},{"$f":"SUMIFS(TBCompras[Valor Total Item (R$)],TBCompras[Mês do Projeto],\"<=\" & 27,TBCompras[Até],\">=\"& 27,TBCompras[Meta:Atividade],LEFT(B45,FIND(\" \",B45,1)-1),TBCompras[Tipo de Material],\"EQUIPAMENTO\")","v":0},{"$f":"SUMIFS(TBCompras[Valor Total Item (R$)],TBCompras[Mês do Projeto],\"<=\" & 28,TBCompras[Até],\">=\"& 28,TBCompras[Meta:Atividade],LEFT(B45,FIND(\" \",B45,1)-1),TBCompras[Tipo de Material],\"EQUIPAMENTO\")","v":0},{"$f":"SUMIFS(TBCompras[Valor Total Item (R$)],TBCompras[Mês do Projeto],\"<=\" & 29,TBCompras[Até],\">=\"& 29,TBCompras[Meta:Atividade],LEFT(B45,FIND(\" \",B45,1)-1),TBCompras[Tipo de Material],\"EQUIPAMENTO\")","v":0},{"$f":"SUMIFS(TBCompras[Valor Total Item (R$)],TBCompras[Mês do Projeto],\"<=\" & 30,TBCompras[Até],\">=\"& 30,TBCompras[Meta:Atividade],LEFT(B45,FIND(\" \",B45,1)-1),TBCompras[Tipo de Material],\"EQUIPAMENTO\")","v":0},{"$f":"SUMIFS(TBCompras[Valor Total Item (R$)],TBCompras[Mês do Projeto],\"<=\" & 31,TBCompras[Até],\">=\"& 31,TBCompras[Meta:Atividade],LEFT(B45,FIND(\" \",B45,1)-1),TBCompras[Tipo de Material],\"EQUIPAMENTO\")","v":0},{"$f":"SUMIFS(TBCompras[Valor Total Item (R$)],TBCompras[Mês do Projeto],\"<=\" & 32,TBCompras[Até],\">=\"& 32,TBCompras[Meta:Atividade],LEFT(B45,FIND(\" \",B45,1)-1),TBCompras[Tipo de Material],\"EQUIPAMENTO\")","v":0},{"$f":"SUMIFS(TBCompras[Valor Total Item (R$)],TBCompras[Mês do Projeto],\"<=\" & 33,TBCompras[Até],\">=\"& 33,TBCompras[Meta:Atividade],LEFT(B45,FIND(\" \",B45,1)-1),TBCompras[Tipo de Material],\"EQUIPAMENTO\")","v":0},{"$f":"SUMIFS(TBCompras[Valor Total Item (R$)],TBCompras[Mês do Projeto],\"<=\" & 34,TBCompras[Até],\">=\"& 34,TBCompras[Meta:Atividade],LEFT(B45,FIND(\" \",B45,1)-1),TBCompras[Tipo de Material],\"EQUIPAMENTO\")","v":0},{"$f":"SUMIFS(TBCompras[Valor Total Item (R$)],TBCompras[Mês do Projeto],\"<=\" & 35,TBCompras[Até],\">=\"& 35,TBCompras[Meta:Atividade],LEFT(B45,FIND(\" \",B45,1)-1),TBCompras[Tipo de Material],\"EQUIPAMENTO\")","v":0},{"$f":"SUMIFS(TBCompras[Valor Total Item (R$)],TBCompras[Mês do Projeto],\"<=\" & 36,TBCompras[Até],\">=\"& 36,TBCompras[Meta:Atividade],LEFT(B45,FIND(\" \",B45,1)-1),TBCompras[Tipo de Material],\"EQUIPAMENTO\")","v":0},0]
[null,null,"Total Atividade 3.2",{"$f":"SUBTOTAL(9,D45:D50)","v":0},0,0,0,0,0,0,0,0,0,0,0,0,0,0,0,0,0,0,0,0,0,0,0,0,0,0,0,0,0,0,0,0,0,0,0,0]
[null,"Total da Meta 3",null,{"$f":"SUBTOTAL(9,D38:D51)","v":0},0,0,0,0,0,0,0,0,0,0,0,0,0,0,0,0,0,0,0,0,0,0,0,0,0,0,0,0,0,0,0,0,0,0,0,0]
["Meta 4 - Teste de neurovirulência em modelo Primatas não humanos","4.1 - Triagem de primatas para o ensaio","Pessoa Física",{"$f":"SUMIFS(TbPessoas[Custo Total Mensal],TbPessoas[A partir do mês],\"<=\" & 1,TbPessoas[Até],\">=\"& 1,TbPessoas[Meta:Atividade],LEFT(B53,FIND(\" \",B53,1)-1))","v":0},{"$f":"SUMIFS(TbPessoas[Custo Total Mensal],TbPessoas[A partir do mês],\"<=\" & 2,TbPessoas[Até],\">=\"& 2,TbPessoas[Meta:Atividade],LEFT(B53,FIND(\" \",B53,1)-1))","v":0},{"$f":"SUMIFS(TbPessoas[Custo Total Mensal],TbPessoas[A partir do mês],\"<=\" & 3,TbPessoas[Até],\">=\"& 3,TbPessoas[Meta:Atividade],LEFT(B53,FIND(\" \",B53,1)-1))","v":0},{"$f":"SUMIFS(TbPessoas[Custo Total Mensal],TbPessoas[A partir do mês],\"<=\" & 4,TbPessoas[Até],\">=\"& 4,TbPessoas[Meta:Atividade],LEFT(B53,FIND(\" \",B53,1)-1))","v":0},{"$f":"SUMIFS(TbPessoas[Custo Total Mensal],TbPessoas[A partir do mês],\"<=\" & 5,TbPessoas[Até],\">=\"& 5,TbPessoas[Meta:Atividade],LEFT(B53,FIND(\" \",B53,1)-1))","v":0},{"$f":"SUMIFS(TbPessoas[Custo Total Mensal],TbPessoas[A partir do mês],\"<=\" & 6,TbPessoas[Até],\">=\"& 6,TbPessoas[Meta:Atividade],LEFT(B53,FIND(\" \",B53,1)-1))","v":0},{"$f":"SUMIFS(TbPessoas[Custo Total Mensal],TbPessoas[A partir do mês],\"<=\" & 7,TbPessoas[Até],\">=\"& 7,TbPessoas[Meta:Atividade],LEFT(B53,FIND(\" \",B53,1)-1))","v":0},{"$f":"SUMIFS(TbPessoas[Custo Total Mensal],TbPessoas[A partir do mês],\"<=\" & 8,TbPessoas[Até],\">=\"& 8,TbPessoas[Meta:Atividade],LEFT(B53,FIND(\" \",B53,1)-1))","v":0},{"$f":"SUMIFS(TbPessoas[Custo Total Mensal],TbPessoas[A partir do mês],\"<=\" & 9,TbPessoas[Até],\">=\"& 9,TbPessoas[Meta:Atividade],LEFT(B53,FIND(\" \",B53,1)-1))","v":0},{"$f":"SUMIFS(TbPessoas[Custo Total Mensal],TbPessoas[A partir do mês],\"<=\" & 10,TbPessoas[Até],\">=\"& 10,TbPessoas[Meta:Atividade],LEFT(B53,FIND(\" \",B53,1)-1))","v":0},{"$f":"SUMIFS(TbPessoas[Custo Total Mensal],TbPessoas[A partir do mês],\"<=\" & 11,TbPessoas[Até],\">=\"& 11,TbPessoas[Meta:Atividade],LEFT(B53,FIND(\" \",B53,1)-1))","v":0},{"$f":"SUMIFS(TbPessoas[Custo Total Mensal],TbPessoas[A partir do mês],\"<=\" & 12,TbPessoas[Até],\">=\"& 12,TbPessoas[Meta:Atividade],LEFT(B53,FIND(\" \",B53,1)-1))","v":0},{"$f":"SUMIFS(TbPessoas[Custo Total Mensal],TbPessoas[A partir do mês],\"<=\" & 13,TbPessoas[Até],\">=\"& 13,TbPessoas[Meta:Atividade],LEFT(B53,FIND(\" \",B53,1)-1))","v":0},{"$f":"SUMIFS(TbPessoas[Custo Total Mensal],TbPessoas[A partir do mês],\"<=\" & 14,TbPessoas[Até],\">=\"& 14,TbPessoas[Meta:Atividade],LEFT(B53,FIND(\" \",B53,1)-1))","v":0},{"$f":"SUMIFS(TbPessoas[Custo Total Mensal],TbPessoas[A partir do mês],\"<=\" & 15,TbPessoas[Até],\">=\"& 15,TbPessoas[Meta:Atividade],LEFT(B53,FIND(\" \",B53,1)-1))","v":0},{"$f":"SUMIFS(TbPessoas[Custo Total Mensal],TbPessoas[A partir do mês],\"<=\" & 16,TbPessoas[Até],\">=\"& 16,TbPessoas[Meta:Atividade],LEFT(B53,FIND(\" \",B53,1)-1))","v":0},{"$f":"SUMIFS(TbPessoas[Custo Total Mensal],TbPessoas[A partir do mês],\"<=\" & 17,TbPessoas[Até],\">=\"& 17,TbPessoas[Meta:Atividade],LEFT(B53,FIND(\" \",B53,1)-1))","v":0},{"$f":"SUMIFS(TbPessoas[Custo Total Mensal],TbPessoas[A partir do mês],\"<=\" & 18,TbPessoas[Até],\">=\"& 18,TbPessoas[Meta:Atividade],LEFT(B53,FIND(\" \",B53,1)-1))","v":0},{"$f":"SUMIFS(TbPessoas[Custo Total Mensal],TbPessoas[A partir do mês],\"<=\" & 19,TbPessoas[Até],\">=\"& 19,TbPessoas[Meta:Atividade],LEFT(B53,FIND(\" \",B53,1)-1))","v":0},{"$f":"SUMIFS(TbPessoas[Custo Total Mensal],TbPessoas[A partir do mês],\"<=\" & 20,TbPessoas[Até],\">=\"& 20,TbPessoas[Meta:Atividade],LEFT(B53,FIND(\" \",B53,1)-1))","v":0},{"$f":"SUMIFS(TbPessoas[Custo Total Mensal],TbPessoas[A partir do mês],\"<=\" & 21,TbPessoas[Até],\">=\"& 21,TbPessoas[Meta:Atividade],LEFT(B53,FIND(\" \",B53,1)-1))","v":0},{"$f":"SUMIFS(TbPessoas[Custo Total Mensal],TbPessoas[A partir do mês],\"<=\" & 22,TbPessoas[Até],\">=\"& 22,TbPessoas[Meta:Atividade],LEFT(B53,FIND(\" \",B53,1)-1))","v":0},{"$f":"SUMIFS(TbPessoas[Custo Total Mensal],TbPessoas[A partir do mês],\"<=\" & 23,TbPessoas[Até],\">=\"& 23,TbPessoas[Meta:Atividade],LEFT(B53,FIND(\" \",B53,1)-1))","v":0},{"$f":"SUMIFS(TbPessoas[Custo Total Mensal],TbPessoas[A partir do mês],\"<=\" & 24,TbPessoas[Até],\">=\"& 24,TbPessoas[Meta:Atividade],LEFT(B53,FIND(\" \",B53,1)-1))","v":0},{"$f":"SUMIFS(TbPessoas[Custo Total Mensal],TbPessoas[A partir do mês],\"<=\" & 25,TbPessoas[Até],\">=\"& 25,TbPessoas[Meta:Atividade],LEFT(B53,FIND(\" \",B53,1)-1))","v":0},{"$f":"SUMIFS(TbPessoas[Custo Total Mensal],TbPessoas[A partir do mês],\"<=\" & 26,TbPessoas[Até],\">=\"& 26,TbPessoas[Meta:Atividade],LEFT(B53,FIND(\" \",B53,1)-1))","v":0},{"$f":"SUMIFS(TbPessoas[Custo Total Mensal],TbPessoas[A partir do mês],\"<=\" & 27,TbPessoas[Até],\">=\"& 27,TbPessoas[Meta:Atividade],LEFT(B53,FIND(\" \",B53,1)-1))","v":0},{"$f":"SUMIFS(TbPessoas[Custo Total Mensal],TbPessoas[A partir do mês],\"<=\" & 28,TbPessoas[Até],\">=\"& 28,TbPessoas[Meta:Atividade],LEFT(B53,FIND(\" \",B53,1)-1))","v":0},{"$f":"SUMIFS(TbPessoas[Custo Total Mensal],TbPessoas[A partir do mês],\"<=\" & 29,TbPessoas[Até],\">=\"& 29,TbPessoas[Meta:Atividade],LEFT(B53,FIND(\" \",B53,1)-1))","v":0},{"$f":"SUMIFS(TbPessoas[Custo Total Mensal],TbPessoas[A partir do mês],\"<=\" & 30,TbPessoas[Até],\">=\"& 30,TbPessoas[Meta:Atividade],LEFT(B53,FIND(\" \",B53,1)-1))","v":0},{"$f":"SUMIFS(TbPessoas[Custo Total Mensal],TbPessoas[A partir do mês],\"<=\" & 31,TbPessoas[Até],\">=\"& 31,TbPessoas[Meta:Atividade],LEFT(B53,FIND(\" \",B53,1)-1))","v":0},{"$f":"SUMIFS(TbPessoas[Custo Total Mensal],TbPessoas[A partir do mês],\"<=\" & 32,TbPessoas[Até],\">=\"& 32,TbPessoas[Meta:Atividade],LEFT(B53,FIND(\" \",B53,1)-1))","v":0},{"$f":"SUMIFS(TbPessoas[Custo Total Mensal],TbPessoas[A partir do mês],\"<=\" & 33,TbPessoas[Até],\">=\"& 33,TbPessoas[Meta:Atividade],LEFT(B53,FIND(\" \",B53,1)-1))","v":0},{"$f":"SUMIFS(TbPessoas[Custo Total Mensal],TbPessoas[A partir do mês],\"<=\" & 34,TbPessoas[Até],\">=\"& 34,TbPessoas[Meta:Atividade],LEFT(B53,FIND(\" \",B53,1)-1))","v":0},{"$f":"SUMIFS(TbPessoas[Custo Total Mensal],TbPessoas[A partir do mês],\"<=\" & 35,TbPessoas[Até],\">=\"& 35,TbPessoas[Meta:Atividade],LEFT(B53,FIND(\" \",B53,1)-1))","v":0},{"$f":"SUMIFS(TbPessoas[Custo Total Mensal],TbPessoas[A partir do mês],\"<=\" & 36,TbPessoas[Até],\">=\"& 36,TbPessoas[Meta:Atividade],LEFT(B53,FIND(\" \",B53,1)-1))","v":0},{"$f":"SUM(D53:AM53)","v":0}]
[null,null,"Pessoa Jurídica",{"$f":"SUMIFS(TBCompras[Valor Total Item (R$)],TBCompras[Mês do Projeto],\"<=\" & 1,TBCompras[Até],\">=\"& 1,TBCompras[Meta:Atividade],LEFT(B53,FIND(\" \",B53,1)-1),TBCompras[Tipo de Material],\"SERVIÇO\")","v":0},{"$f":"SUMIFS(TBCompras[Valor Total Item (R$)],TBCompras[Mês do Projeto],\"<=\" & 2,TBCompras[Até],\">=\"& 2,TBCompras[Meta:Atividade],LEFT(B53,FIND(\" \",B53,1)-1),TBCompras[Tipo de Material],\"SERVIÇO\")","v":0},{"$f":"SUMIFS(TBCompras[Valor Total Item (R$)],TBCompras[Mês do Projeto],\"<=\" & 3,TBCompras[Até],\">=\"& 3,TBCompras[Meta:Atividade],LEFT(B53,FIND(\" \",B53,1)-1),TBCompras[Tipo de Material],\"SERVIÇO\")","v":0},{"$f":"SUMIFS(TBCompras[Valor Total Item (R$)],TBCompras[Mês do Projeto],\"<=\" & 4,TBCompras[Até],\">=\"& 4,TBCompras[Meta:Atividade],LEFT(B53,FIND(\" \",B53,1)-1),TBCompras[Tipo de Material],\"SERVIÇO\")","v":0},{"$f":"SUMIFS(TBCompras[Valor Total Item (R$)],TBCompras[Mês do Projeto],\"<=\" & 5,TBCompras[Até],\">=\"& 5,TBCompras[Meta:Atividade],LEFT(B53,FIND(\" \",B53,1)-1),TBCompras[Tipo de Material],\"SERVIÇO\")","v":0},{"$f":"SUMIFS(TBCompras[Valor Total Item (R$)],TBCompras[Mês do Projeto],\"<=\" & 6,TBCompras[Até],\">=\"& 6,TBCompras[Meta:Atividade],LEFT(B53,FIND(\" \",B53,1)-1),TBCompras[Tipo de Material],\"SERVIÇO\")","v":0},{"$f":"SUMIFS(TBCompras[Valor Total Item (R$)],TBCompras[Mês do Projeto],\"<=\" & 7,TBCompras[Até],\">=\"& 7,TBCompras[Meta:Atividade],LEFT(B53,FIND(\" \",B53,1)-1),TBCompras[Tipo de Material],\"SERVIÇO\")","v":0},{"$f":"SUMIFS(TBCompras[Valor Total Item (R$)],TBCompras[Mês do Projeto],\"<=\" & 8,TBCompras[Até],\">=\"& 8,TBCompras[Meta:Atividade],LEFT(B53,FIND(\" \",B53,1)-1),TBCompras[Tipo de Material],\"SERVIÇO\")","v":0},{"$f":"SUMIFS(TBCompras[Valor Total Item (R$)],TBCompras[Mês do Projeto],\"<=\" & 9,TBCompras[Até],\">=\"& 9,TBCompras[Meta:Atividade],LEFT(B53,FIND(\" \",B53,1)-1),TBCompras[Tipo de Material],\"SERVIÇO\")","v":0},{"$f":"SUMIFS(TBCompras[Valor Total Item (R$)],TBCompras[Mês do Projeto],\"<=\" & 10,TBCompras[Até],\">=\"& 10,TBCompras[Meta:Atividade],LEFT(B53,FIND(\" \",B53,1)-1),TBCompras[Tipo de Material],\"SERVIÇO\")","v":0},{"$f":"SUMIFS(TBCompras[Valor Total Item (R$)],TBCompras[Mês do Projeto],\"<=\" & 11,TBCompras[Até],\">=\"& 11,TBCompras[Meta:Atividade],LEFT(B53,FIND(\" \",B53,1)-1),TBCompras[Tipo de Material],\"SERVIÇO\")","v":0},{"$f":"SUMIFS(TBCompras[Valor Total Item (R$)],TBCompras[Mês do Projeto],\"<=\" & 12,TBCompras[Até],\">=\"& 12,TBCompras[Meta:Atividade],LEFT(B53,FIND(\" \",B53,1)-1),TBCompras[Tipo de Material],\"SERVIÇO\")","v":0},{"$f":"SUMIFS(TBCompras[Valor Total Item (R$)],TBCompras[Mês do Projeto],\"<=\" & 13,TBCompras[Até],\">=\"& 13,TBCompras[Meta:Atividade],LEFT(B53,FIND(\" \",B53,1)-1),TBCompras[Tipo de Material],\"SERVIÇO\")","v":0},{"$f":"SUMIFS(TBCompras[Valor Total Item (R$)],TBCompras[Mês do Projeto],\"<=\" & 14,TBCompras[Até],\">=\"& 14,TBCompras[Meta:Atividade],LEFT(B53,FIND(\" \",B53,1)-1),TBCompras[Tipo de Material],\"SERVIÇO\")","v":0},{"$f":"SUMIFS(TBCompras[Valor Total Item (R$)],TBCompras[Mês do Projeto],\"<=\" & 15,TBCompras[Até],\">=\"& 15,TBCompras[Meta:Atividade],LEFT(B53,FIND(\" \",B53,1)-1),TBCompras[Tipo de Material],\"SERVIÇO\")","v":0},{"$f":"SUMIFS(TBCompras[Valor Total Item (R$)],TBCompras[Mês do Projeto],\"<=\" & 16,TBCompras[Até],\">=\"& 16,TBCompras[Meta:Atividade],LEFT(B53,FIND(\" \",B53,1)-1),TBCompras[Tipo de Material],\"SERVIÇO\")","v":0},{"$f":"SUMIFS(TBCompras[Valor Total Item (R$)],TBCompras[Mês do Projeto],\"<=\" & 17,TBCompras[Até],\">=\"& 17,TBCompras[Meta:Atividade],LEFT(B53,FIND(\" \",B53,1)-1),TBCompras[Tipo de Material],\"SERVIÇO\")","v":0},{"$f":"SUMIFS(TBCompras[Valor Total Item (R$)],TBCompras[Mês do Projeto],\"<=\" & 18,TBCompras[Até],\">=\"& 18,TBCompras[Meta:Atividade],LEFT(B53,FIND(\" \",B53,1)-1),TBCompras[Tipo de Material],\"SERVIÇO\")","v":0},{"$f":"SUMIFS(TBCompras[Valor Total Item (R$)],TBCompras[Mês do Projeto],\"<=\" & 19,TBCompras[Até],\">=\"& 19,TBCompras[Meta:Atividade],LEFT(B53,FIND(\" \",B53,1)-1),TBCompras[Tipo de Material],\"SERVIÇO\")","v":0},{"$f":"SUMIFS(TBCompras[Valor Total Item (R$)],TBCompras[Mês do Projeto],\"<=\" & 20,TBCompras[Até],\">=\"& 20,TBCompras[Meta:Atividade],LEFT(B53,FIND(\" \",B53,1)-1),TBCompras[Tipo de Material],\"SERVIÇO\")","v":0},{"$f":"SUMIFS(TBCompras[Valor Total Item (R$)],TBCompras[Mês do Projeto],\"<=\" & 21,TBCompras[Até],\">=\"& 21,TBCompras[Meta:Atividade],LEFT(B53,FIND(\" \",B53,1)-1),TBCompras[Tipo de Material],\"SERVIÇO\")","v":0},{"$f":"SUMIFS(TBCompras[Valor Total Item (R$)],TBCompras[Mês do Projeto],\"<=\" & 22,TBCompras[Até],\">=\"& 22,TBCompras[Meta:Atividade],LEFT(B53,FIND(\" \",B53,1)-1),TBCompras[Tipo de Material],\"SERVIÇO\")","v":0},{"$f":"SUMIFS(TBCompras[Valor Total Item (R$)],TBCompras[Mês do Projeto],\"<=\" & 23,TBCompras[Até],\">=\"& 23,TBCompras[Meta:Atividade],LEFT(B53,FIND(\" \",B53,1)-1),TBCompras[Tipo de Material],\"SERVIÇO\")","v":0},{"$f":"SUMIFS(TBCompras[Valor Total Item (R$)],TBCompras[Mês do Projeto],\"<=\" & 24,TBCompras[Até],\">=\"& 24,TBCompras[Meta:Atividade],LEFT(B53,FIND(\" \",B53,1)-1),TBCompras[Tipo de Material],\"SERVIÇO\")","v":0},{"$f":"SUMIFS(TBCompras[Valor Total Item (R$)],TBCompras[Mês do Projeto],\"<=\" & 25,TBCompras[Até],\">=\"& 25,TBCompras[Meta:Atividade],LEFT(B53,FIND(\" \",B53,1)-1),TBCompras[Tipo de Material],\"SERVIÇO\")","v":0},{"$f":"SUMIFS(TBCompras[Valor Total Item (R$)],TBCompras[Mês do Projeto],\"<=\" & 26,TBCompras[Até],\">=\"& 26,TBCompras[Meta:Atividade],LEFT(B53,FIND(\" \",B53,1)-1),TBCompras[Tipo de Material],\"SERVIÇO\")","v":0},{"$f":"SUMIFS(TBCompras[Valor Total Item (R$)],TBCompras[Mês do Projeto],\"<=\" & 27,TBCompras[Até],\">=\"& 27,TBCompras[Meta:Atividade],LEFT(B53,FIND(\" \",B53,1)-1),TBCompras[Tipo de Material],\"SERVIÇO\")","v":0},{"$f":"SUMIFS(TBCompras[Valor Total Item (R$)],TBCompras[Mês do Projeto],\"<=\" & 28,TBCompras[Até],\">=\"& 28,TBCompras[Meta:Atividade],LEFT(B53,FIND(\" \",B53,1)-1),TBCompras[Tipo de Material],\"SERVIÇO\")","v":0},{"$f":"SUMIFS(TBCompras[Valor Total Item (R$)],TBCompras[Mês do Projeto],\"<=\" & 29,TBCompras[Até],\">=\"& 29,TBCompras[Meta:Atividade],LEFT(B53,FIND(\" \",B53,1)-1),TBCompras[Tipo de Material],\"SERVIÇO\")","v":0},{"$f":"SUMIFS(TBCompras[Valor Total Item (R$)],TBCompras[Mês do Projeto],\"<=\" & 30,TBCompras[Até],\">=\"& 30,TBCompras[Meta:Atividade],LEFT(B53,FIND(\" \",B53,1)-1),TBCompras[Tipo de Material],\"SERVIÇO\")","v":0},{"$f":"SUMIFS(TBCompras[Valor Total Item (R$)],TBCompras[Mês do Projeto],\"<=\" & 31,TBCompras[Até],\">=\"& 31,TBCompras[Meta:Atividade],LEFT(B53,FIND(\" \",B53,1)-1),TBCompras[Tipo de Material],\"SERVIÇO\")","v":0},{"$f":"SUMIFS(TBCompras[Valor Total Item (R$)],TBCompras[Mês do Projeto],\"<=\" & 32,TBCompras[Até],\">=\"& 32,TBCompras[Meta:Atividade],LEFT(B53,FIND(\" \",B53,1)-1),TBCompras[Tipo de Material],\"SERVIÇO\")","v":0},{"$f":"SUMIFS(TBCompras[Valor Total Item (R$)],TBCompras[Mês do Projeto],\"<=\" & 33,TBCompras[Até],\">=\"& 33,TBCompras[Meta:Atividade],LEFT(B53,FIND(\" \",B53,1)-1),TBCompras[Tipo de Material],\"SERVIÇO\")","v":0},{"$f":"SUMIFS(TBCompras[Valor Total Item (R$)],TBCompras[Mês do Projeto],\"<=\" & 34,TBCompras[Até],\">=\"& 34,TBCompras[Meta:Atividade],LEFT(B53,FIND(\" \",B53,1)-1),TBCompras[Tipo de Material],\"SERVIÇO\")","v":0},{"$f":"SUMIFS(TBCompras[Valor Total Item (R$)],TBCompras[Mês do Projeto],\"<=\" & 35,TBCompras[Até],\">=\"& 35,TBCompras[Meta:Atividade],LEFT(B53,FIND(\" \",B53,1)-1),TBCompras[Tipo de Material],\"SERVIÇO\")","v":0},{"$f":"SUMIFS(TBCompras[Valor Total Item (R$)],TBCompras[Mês do Projeto],\"<=\" & 36,TBCompras[Até],\">=\"& 36,TBCompras[Meta:Atividade],LEFT(B53,FIND(\" \",B53,1)-1),TBCompras[Tipo de Material],\"SERVIÇO\")","v":0},0]
[null,null,"Passagens",{"$f":"SUMIFS(TbPassagens[Valor Total Passagem],TbPassagens[A partir do mês],\"<=\" & 1,TbPassagens[Até],\">=\"& 1,TbPassagens[Meta:Atividade],LEFT(B53,FIND(\" \",B53,1)-1))","v":0},{"$f":"SUMIFS(TbPassagens[Valor Total Passagem],TbPassagens[A partir do mês],\"<=\" & 2,TbPassagens[Até],\">=\"& 2,TbPassagens[Meta:Atividade],LEFT(B53,FIND(\" \",B53,1)-1))","v":0},{"$f":"SUMIFS(TbPassagens[Valor Total Passagem],TbPassagens[A partir do mês],\"<=\" & 3,TbPassagens[Até],\">=\"& 3,TbPassagens[Meta:Atividade],LEFT(B53,FIND(\" \",B53,1)-1))","v":0},{"$f":"SUMIFS(TbPassagens[Valor Total Passagem],TbPassagens[A partir do mês],\"<=\" & 4,TbPassagens[Até],\">=\"& 4,TbPassagens[Meta:Atividade],LEFT(B53,FIND(\" \",B53,1)-1))","v":0},{"$f":"SUMIFS(TbPassagens[Valor Total Passagem],TbPassagens[A partir do mês],\"<=\" & 5,TbPassagens[Até],\">=\"& 5,TbPassagens[Meta:Atividade],LEFT(B53,FIND(\" \",B53,1)-1))","v":0},{"$f":"SUMIFS(TbPassagens[Valor Total Passagem],TbPassagens[A partir do mês],\"<=\" & 6,TbPassagens[Até],\">=\"& 6,TbPassagens[Meta:Atividade],LEFT(B53,FIND(\" \",B53,1)-1))","v":0},{"$f":"SUMIFS(TbPassagens[Valor Total Passagem],TbPassagens[A partir do mês],\"<=\" & 7,TbPassagens[Até],\">=\"& 7,TbPassagens[Meta:Atividade],LEFT(B53,FIND(\" \",B53,1)-1))","v":0},{"$f":"SUMIFS(TbPassagens[Valor Total Passagem],TbPassagens[A partir do mês],\"<=\" & 8,TbPassagens[Até],\">=\"& 8,TbPassagens[Meta:Atividade],LEFT(B53,FIND(\" \",B53,1)-1))","v":0},{"$f":"SUMIFS(TbPassagens[Valor Total Passagem],TbPassagens[A partir do mês],\"<=\" & 9,TbPassagens[Até],\">=\"& 9,TbPassagens[Meta:Atividade],LEFT(B53,FIND(\" \",B53,1)-1))","v":0},{"$f":"SUMIFS(TbPassagens[Valor Total Passagem],TbPassagens[A partir do mês],\"<=\" & 10,TbPassagens[Até],\">=\"& 10,TbPassagens[Meta:Atividade],LEFT(B53,FIND(\" \",B53,1)-1))","v":0},{"$f":"SUMIFS(TbPassagens[Valor Total Passagem],TbPassagens[A partir do mês],\"<=\" & 11,TbPassagens[Até],\">=\"& 11,TbPassagens[Meta:Atividade],LEFT(B53,FIND(\" \",B53,1)-1))","v":0},{"$f":"SUMIFS(TbPassagens[Valor Total Passagem],TbPassagens[A partir do mês],\"<=\" & 12,TbPassagens[Até],\">=\"& 12,TbPassagens[Meta:Atividade],LEFT(B53,FIND(\" \",B53,1)-1))","v":0},{"$f":"SUMIFS(TbPassagens[Valor Total Passagem],TbPassagens[A partir do mês],\"<=\" & 13,TbPassagens[Até],\">=\"& 13,TbPassagens[Meta:Atividade],LEFT(B53,FIND(\" \",B53,1)-1))","v":0},{"$f":"SUMIFS(TbPassagens[Valor Total Passagem],TbPassagens[A partir do mês],\"<=\" & 14,TbPassagens[Até],\">=\"& 14,TbPassagens[Meta:Atividade],LEFT(B53,FIND(\" \",B53,1)-1))","v":0},{"$f":"SUMIFS(TbPassagens[Valor Total Passagem],TbPassagens[A partir do mês],\"<=\" & 15,TbPassagens[Até],\">=\"& 15,TbPassagens[Meta:Atividade],LEFT(B53,FIND(\" \",B53,1)-1))","v":0},{"$f":"SUMIFS(TbPassagens[Valor Total Passagem],TbPassagens[A partir do mês],\"<=\" & 16,TbPassagens[Até],\">=\"& 16,TbPassagens[Meta:Atividade],LEFT(B53,FIND(\" \",B53,1)-1))","v":0},{"$f":"SUMIFS(TbPassagens[Valor Total Passagem],TbPassagens[A partir do mês],\"<=\" & 17,TbPassagens[Até],\">=\"& 17,TbPassagens[Meta:Atividade],LEFT(B53,FIND(\" \",B53,1)-1))","v":0},{"$f":"SUMIFS(TbPassagens[Valor Total Passagem],TbPassagens[A partir do mês],\"<=\" & 18,TbPassagens[Até],\">=\"& 18,TbPassagens[Meta:Atividade],LEFT(B53,FIND(\" \",B53,1)-1))","v":0},{"$f":"SUMIFS(TbPassagens[Valor Total Passagem],TbPassagens[A partir do mês],\"<=\" & 19,TbPassagens[Até],\">=\"& 19,TbPassagens[Meta:Atividade],LEFT(B53,FIND(\" \",B53,1)-1))","v":0},{"$f":"SUMIFS(TbPassagens[Valor Total Passagem],TbPassagens[A partir do mês],\"<=\" & 20,TbPassagens[Até],\">=\"& 20,TbPassagens[Meta:Atividade],LEFT(B53,FIND(\" \",B53,1)-1))","v":0},{"$f":"SUMIFS(TbPassagens[Valor Total Passagem],TbPassagens[A partir do mês],\"<=\" & 21,TbPassagens[Até],\">=\"& 21,TbPassagens[Meta:Atividade],LEFT(B53,FIND(\" \",B53,1)-1))","v":0},{"$f":"SUMIFS(TbPassagens[Valor Total Passagem],TbPassagens[A partir do mês],\"<=\" & 22,TbPassagens[Até],\">=\"& 22,TbPassagens[Meta:Atividade],LEFT(B53,FIND(\" \",B53,1)-1))","v":0},{"$f":"SUMIFS(TbPassagens[Valor Total Passagem],TbPassagens[A partir do mês],\"<=\" & 23,TbPassagens[Até],\">=\"& 23,TbPassagens[Meta:Atividade],LEFT(B53,FIND(\" \",B53,1)-1))","v":0},{"$f":"SUMIFS(TbPassagens[Valor Total Passagem],TbPassagens[A partir do mês],\"<=\" & 24,TbPassagens[Até],\">=\"& 24,TbPassagens[Meta:Atividade],LEFT(B53,FIND(\" \",B53,1)-1))","v":0},{"$f":"SUMIFS(TbPassagens[Valor Total Passagem],TbPassagens[A partir do mês],\"<=\" & 25,TbPassagens[Até],\">=\"& 25,TbPassagens[Meta:Atividade],LEFT(B53,FIND(\" \",B53,1)-1))","v":0},{"$f":"SUMIFS(TbPassagens[Valor Total Passagem],TbPassagens[A partir do mês],\"<=\" & 26,TbPassagens[Até],\">=\"& 26,TbPassagens[Meta:Atividade],LEFT(B53,FIND(\" \",B53,1)-1))","v":0},{"$f":"SUMIFS(TbPassagens[Valor Total Passagem],TbPassagens[A partir do mês],\"<=\" & 27,TbPassagens[Até],\">=\"& 27,TbPassagens[Meta:Atividade],LEFT(B53,FIND(\" \",B53,1)-1))","v":0},{"$f":"SUMIFS(TbPassagens[Valor Total Passagem],TbPassagens[A partir do mês],\"<=\" & 28,TbPassagens[Até],\">=\"& 28,TbPassagens[Meta:Atividade],LEFT(B53,FIND(\" \",B53,1)-1))","v":0},{"$f":"SUMIFS(TbPassagens[Valor Total Passagem],TbPassagens[A partir do mês],\"<=\" & 29,TbPassagens[Até],\">=\"& 29,TbPassagens[Meta:Atividade],LEFT(B53,FIND(\" \",B53,1)-1))","v":0},{"$f":"SUMIFS(TbPassagens[Valor Total Passagem],TbPassagens[A partir do mês],\"<=\" & 30,TbPassagens[Até],\">=\"& 30,TbPassagens[Meta:Atividade],LEFT(B53,FIND(\" \",B53,1)-1))","v":0},{"$f":"SUMIFS(TbPassagens[Valor Total Passagem],TbPassagens[A partir do mês],\"<=\" & 31,TbPassagens[Até],\">=\"& 31,TbPassagens[Meta:Atividade],LEFT(B53,FIND(\" \",B53,1)-1))","v":0},{"$f":"SUMIFS(TbPassagens[Valor Total Passagem],TbPassagens[A partir do mês],\"<=\" & 32,TbPassagens[Até],\">=\"& 32,TbPassagens[Meta:Atividade],LEFT(B53,FIND(\" \",B53,1)-1))","v":0},{"$f":"SUMIFS(TbPassagens[Valor Total Passagem],TbPassagens[A partir do mês],\"<=\" & 33,TbPassagens[Até],\">=\"& 33,TbPassagens[Meta:Atividade],LEFT(B53,FIND(\" \",B53,1)-1))","v":0},{"$f":"SUMIFS(TbPassagens[Valor Total Passagem],TbPassagens[A partir do mês],\"<=\" & 34,TbPassagens[Até],\">=\"& 34,TbPassagens[Meta:Atividade],LEFT(B53,FIND(\" \",B53,1)-1))","v":0},{"$f":"SUMIFS(TbPassagens[Valor Total Passagem],TbPassagens[A partir do mês],\"<=\" & 35,TbPassagens[Até],\">=\"& 35,TbPassagens[Meta:Atividade],LEFT(B53,FIND(\" \",B53,1)-1))","v":0},{"$f":"SUMIFS(TbPassagens[Valor Total Passagem],TbPassagens[A partir do mês],\"<=\" & 36,TbPassagens[Até],\">=\"& 36,TbPassagens[Meta:Atividade],LEFT(B53,FIND(\" \",B53,1)-1))","v":0},0]
[null,null,"Diárias",{"$f":"SUMIFS(TbPassagens[Valor Total Diária],TbPassagens[A partir do mês],\"<=\" & 1,TbPassagens[Até],\">=\"& 1,TbPassagens[Meta:Atividade],LEFT(B53,FIND(\" \",B53,1)-1))","v":0},{"$f":"SUMIFS(TbPassagens[Valor Total Diária],TbPassagens[A partir do mês],\"<=\" & 2,TbPassagens[Até],\">=\"& 2,TbPassagens[Meta:Atividade],LEFT(B53,FIND(\" \",B53,1)-1))","v":0},{"$f":"SUMIFS(TbPassagens[Valor Total Diária],TbPassagens[A partir do mês],\"<=\" & 3,TbPassagens[Até],\">=\"& 3,TbPassagens[Meta:Atividade],LEFT(B53,FIND(\" \",B53,1)-1))","v":0},{"$f":"SUMIFS(TbPassagens[Valor Total Diária],TbPassagens[A partir do mês],\"<=\" & 4,TbPassagens[Até],\">=\"& 4,TbPassagens[Meta:Atividade],LEFT(B53,FIND(\" \",B53,1)-1))","v":0},{"$f":"SUMIFS(TbPassagens[Valor Total Diária],TbPassagens[A partir do mês],\"<=\" & 5,TbPassagens[Até],\">=\"& 5,TbPassagens[Meta:Atividade],LEFT(B53,FIND(\" \",B53,1)-1))","v":0},{"$f":"SUMIFS(TbPassagens[Valor Total Diária],TbPassagens[A partir do mês],\"<=\" & 6,TbPassagens[Até],\">=\"& 6,TbPassagens[Meta:Atividade],LEFT(B53,FIND(\" \",B53,1)-1))","v":0},{"$f":"SUMIFS(TbPassagens[Valor Total Diária],TbPassagens[A partir do mês],\"<=\" & 7,TbPassagens[Até],\">=\"& 7,TbPassagens[Meta:Atividade],LEFT(B53,FIND(\" \",B53,1)-1))","v":0},{"$f":"SUMIFS(TbPassagens[Valor Total Diária],TbPassagens[A partir do mês],\"<=\" & 8,TbPassagens[Até],\">=\"& 8,TbPassagens[Meta:Atividade],LEFT(B53,FIND(\" \",B53,1)-1))","v":0},{"$f":"SUMIFS(TbPassagens[Valor Total Diária],TbPassagens[A partir do mês],\"<=\" & 9,TbPassagens[Até],\">=\"& 9,TbPassagens[Meta:Atividade],LEFT(B53,FIND(\" \",B53,1)-1))","v":0},{"$f":"SUMIFS(TbPassagens[Valor Total Diária],TbPassagens[A partir do mês],\"<=\" & 10,TbPassagens[Até],\">=\"& 10,TbPassagens[Meta:Atividade],LEFT(B53,FIND(\" \",B53,1)-1))","v":0},{"$f":"SUMIFS(TbPassagens[Valor Total Diária],TbPassagens[A partir do mês],\"<=\" & 11,TbPassagens[Até],\">=\"& 11,TbPassagens[Meta:Atividade],LEFT(B53,FIND(\" \",B53,1)-1))","v":0},{"$f":"SUMIFS(TbPassagens[Valor Total Diária],TbPassagens[A partir do mês],\"<=\" & 12,TbPassagens[Até],\">=\"& 12,TbPassagens[Meta:Atividade],LEFT(B53,FIND(\" \",B53,1)-1))","v":0},{"$f":"SUMIFS(TbPassagens[Valor Total Diária],TbPassagens[A partir do mês],\"<=\" & 13,TbPassagens[Até],\">=\"& 13,TbPassagens[Meta:Atividade],LEFT(B53,FIND(\" \",B53,1)-1))","v":0},{"$f":"SUMIFS(TbPassagens[Valor Total Diária],TbPassagens[A partir do mês],\"<=\" & 14,TbPassagens[Até],\">=\"& 14,TbPassagens[Meta:Atividade],LEFT(B53,FIND(\" \",B53,1)-1))","v":0},{"$f":"SUMIFS(TbPassagens[Valor Total Diária],TbPassagens[A partir do mês],\"<=\" & 15,TbPassagens[Até],\">=\"& 15,TbPassagens[Meta:Atividade],LEFT(B53,FIND(\" \",B53,1)-1))","v":0},{"$f":"SUMIFS(TbPassagens[Valor Total Diária],TbPassagens[A partir do mês],\"<=\" & 16,TbPassagens[Até],\">=\"& 16,TbPassagens[Meta:Atividade],LEFT(B53,FIND(\" \",B53,1)-1))","v":0},{"$f":"SUMIFS(TbPassagens[Valor Total Diária],TbPassagens[A partir do mês],\"<=\" & 17,TbPassagens[Até],\">=\"& 17,TbPassagens[Meta:Atividade],LEFT(B53,FIND(\" \",B53,1)-1))","v":0},{"$f":"SUMIFS(TbPassagens[Valor Total Diária],TbPassagens[A partir do mês],\"<=\" & 18,TbPassagens[Até],\">=\"& 18,TbPassagens[Meta:Atividade],LEFT(B53,FIND(\" \",B53,1)-1))","v":0},{"$f":"SUMIFS(TbPassagens[Valor Total Diária],TbPassagens[A partir do mês],\"<=\" & 19,TbPassagens[Até],\">=\"& 19,TbPassagens[Meta:Atividade],LEFT(B53,FIND(\" \",B53,1)-1))","v":0},{"$f":"SUMIFS(TbPassagens[Valor Total Diária],TbPassagens[A partir do mês],\"<=\" & 20,TbPassagens[Até],\">=\"& 20,TbPassagens[Meta:Atividade],LEFT(B53,FIND(\" \",B53,1)-1))","v":0},{"$f":"SUMIFS(TbPassagens[Valor Total Diária],TbPassagens[A partir do mês],\"<=\" & 21,TbPassagens[Até],\">=\"& 21,TbPassagens[Meta:Atividade],LEFT(B53,FIND(\" \",B53,1)-1))","v":0},{"$f":"SUMIFS(TbPassagens[Valor Total Diária],TbPassagens[A partir do mês],\"<=\" & 22,TbPassagens[Até],\">=\"& 22,TbPassagens[Meta:Atividade],LEFT(B53,FIND(\" \",B53,1)-1))","v":0},{"$f":"SUMIFS(TbPassagens[Valor Total Diária],TbPassagens[A partir do mês],\"<=\" & 23,TbPassagens[Até],\">=\"& 23,TbPassagens[Meta:Atividade],LEFT(B53,FIND(\" \",B53,1)-1))","v":0},{"$f":"SUMIFS(TbPassagens[Valor Total Diária],TbPassagens[A partir do mês],\"<=\" & 24,TbPassagens[Até],\">=\"& 24,TbPassagens[Meta:Atividade],LEFT(B53,FIND(\" \",B53,1)-1))","v":0},{"$f":"SUMIFS(TbPassagens[Valor Total Diária],TbPassagens[A partir do mês],\"<=\" & 25,TbPassagens[Até],\">=\"& 25,TbPassagens[Meta:Atividade],LEFT(B53,FIND(\" \",B53,1)-1))","v":0},{"$f":"SUMIFS(TbPassagens[Valor Total Diária],TbPassagens[A partir do mês],\"<=\" & 26,TbPassagens[Até],\">=\"& 26,TbPassagens[Meta:Atividade],LEFT(B53,FIND(\" \",B53,1)-1))","v":0},{"$f":"SUMIFS(TbPassagens[Valor Total Diária],TbPassagens[A partir do mês],\"<=\" & 27,TbPassagens[Até],\">=\"& 27,TbPassagens[Meta:Atividade],LEFT(B53,FIND(\" \",B53,1)-1))","v":0},{"$f":"SUMIFS(TbPassagens[Valor Total Diária],TbPassagens[A partir do mês],\"<=\" & 28,TbPassagens[Até],\">=\"& 28,TbPassagens[Meta:Atividade],LEFT(B53,FIND(\" \",B53,1)-1))","v":0},{"$f":"SUMIFS(TbPassagens[Valor Total Diária],TbPassagens[A partir do mês],\"<=\" & 29,TbPassagens[Até],\">=\"& 29,TbPassagens[Meta:Atividade],LEFT(B53,FIND(\" \",B53,1)-1))","v":0},{"$f":"SUMIFS(TbPassagens[Valor Total Diária],TbPassagens[A partir do mês],\"<=\" & 30,TbPassagens[Até],\">=\"& 30,TbPassagens[Meta:Atividade],LEFT(B53,FIND(\" \",B53,1)-1))","v":0},{"$f":"SUMIFS(TbPassagens[Valor Total Diária],TbPassagens[A partir do mês],\"<=\" & 31,TbPassagens[Até],\">=\"& 31,TbPassagens[Meta:Atividade],LEFT(B53,FIND(\" \",B53,1)-1))","v":0},{"$f":"SUMIFS(TbPassagens[Valor Total Diária],TbPassagens[A partir do mês],\"<=\" & 32,TbPassagens[Até],\">=\"& 32,TbPassagens[Meta:Atividade],LEFT(B53,FIND(\" \",B53,1)-1))","v":0},{"$f":"SUMIFS(TbPassagens[Valor Total Diária],TbPassagens[A partir do mês],\"<=\" & 33,TbPassagens[Até],\">=\"& 33,TbPassagens[Meta:Atividade],LEFT(B53,FIND(\" \",B53,1)-1))","v":0},{"$f":"SUMIFS(TbPassagens[Valor Total Diária],TbPassagens[A partir do mês],\"<=\" & 34,TbPassagens[Até],\">=\"& 34,TbPassagens[Meta:Atividade],LEFT(B53,FIND(\" \",B53,1)-1))","v":0},{"$f":"SUMIFS(TbPassagens[Valor Total Diária],TbPassagens[A partir do mês],\"<=\" & 35,TbPassagens[Até],\">=\"& 35,TbPassagens[Meta:Atividade],LEFT(B53,FIND(\" \",B53,1)-1))","v":0},{"$f":"SUMIFS(TbPassagens[Valor Total Diária],TbPassagens[A partir do mês],\"<=\" & 36,TbPassagens[Até],\">=\"& 36,TbPassagens[Meta:Atividade],LEFT(B53,FIND(\" \",B53,1)-1))","v":0},0]
[null,null,"Material de Consumo",{"$f":"SUMIFS(TBCompras[Valor Total Item (R$)],TBCompras[Mês do Projeto],\"<=\" & 1,TBCompras[Até],\">=\"& 1,TBCompras[Meta:Atividade],LEFT(B53,FIND(\" \",B53,1)-1),TBCompras[Tipo de Material],\"CONSUMO\")","v":0},{"$f":"SUMIFS(TBCompras[Valor Total Item (R$)],TBCompras[Mês do Projeto],\"<=\" & 2,TBCompras[Até],\">=\"& 2,TBCompras[Meta:Atividade],LEFT(B53,FIND(\" \",B53,1)-1),TBCompras[Tipo de Material],\"CONSUMO\")","v":0},{"$f":"SUMIFS(TBCompras[Valor Total Item (R$)],TBCompras[Mês do Projeto],\"<=\" & 3,TBCompras[Até],\">=\"& 3,TBCompras[Meta:Atividade],LEFT(B53,FIND(\" \",B53,1)-1),TBCompras[Tipo de Material],\"CONSUMO\")","v":0},{"$f":"SUMIFS(TBCompras[Valor Total Item (R$)],TBCompras[Mês do Projeto],\"<=\" & 4,TBCompras[Até],\">=\"& 4,TBCompras[Meta:Atividade],LEFT(B53,FIND(\" \",B53,1)-1),TBCompras[Tipo de Material],\"CONSUMO\")","v":0},{"$f":"SUMIFS(TBCompras[Valor Total Item (R$)],TBCompras[Mês do Projeto],\"<=\" & 5,TBCompras[Até],\">=\"& 5,TBCompras[Meta:Atividade],LEFT(B53,FIND(\" \",B53,1)-1),TBCompras[Tipo de Material],\"CONSUMO\")","v":0},{"$f":"SUMIFS(TBCompras[Valor Total Item (R$)],TBCompras[Mês do Projeto],\"<=\" & 6,TBCompras[Até],\">=\"& 6,TBCompras[Meta:Atividade],LEFT(B53,FIND(\" \",B53,1)-1),TBCompras[Tipo de Material],\"CONSUMO\")","v":0},{"$f":"SUMIFS(TBCompras[Valor Total Item (R$)],TBCompras[Mês do Projeto],\"<=\" & 7,TBCompras[Até],\">=\"& 7,TBCompras[Meta:Atividade],LEFT(B53,FIND(\" \",B53,1)-1),TBCompras[Tipo de Material],\"CONSUMO\")","v":0},{"$f":"SUMIFS(TBCompras[Valor Total Item (R$)],TBCompras[Mês do Projeto],\"<=\" & 8,TBCompras[Até],\">=\"& 8,TBCompras[Meta:Atividade],LEFT(B53,FIND(\" \",B53,1)-1),TBCompras[Tipo de Material],\"CONSUMO\")","v":0},{"$f":"SUMIFS(TBCompras[Valor Total Item (R$)],TBCompras[Mês do Projeto],\"<=\" & 9,TBCompras[Até],\">=\"& 9,TBCompras[Meta:Atividade],LEFT(B53,FIND(\" \",B53,1)-1),TBCompras[Tipo de Material],\"CONSUMO\")","v":0},{"$f":"SUMIFS(TBCompras[Valor Total Item (R$)],TBCompras[Mês do Projeto],\"<=\" & 10,TBCompras[Até],\">=\"& 10,TBCompras[Meta:Atividade],LEFT(B53,FIND(\" \",B53,1)-1),TBCompras[Tipo de Material],\"CONSUMO\")","v":0},{"$f":"SUMIFS(TBCompras[Valor Total Item (R$)],TBCompras[Mês do Projeto],\"<=\" & 11,TBCompras[Até],\">=\"& 11,TBCompras[Meta:Atividade],LEFT(B53,FIND(\" \",B53,1)-1),TBCompras[Tipo de Material],\"CONSUMO\")","v":0},{"$f":"SUMIFS(TBCompras[Valor Total Item (R$)],TBCompras[Mês do Projeto],\"<=\" & 12,TBCompras[Até],\">=\"& 12,TBCompras[Meta:Atividade],LEFT(B53,FIND(\" \",B53,1)-1),TBCompras[Tipo de Material],\"CONSUMO\")","v":0},{"$f":"SUMIFS(TBCompras[Valor Total Item (R$)],TBCompras[Mês do Projeto],\"<=\" & 13,TBCompras[Até],\">=\"& 13,TBCompras[Meta:Atividade],LEFT(B53,FIND(\" \",B53,1)-1),TBCompras[Tipo de Material],\"CONSUMO\")","v":0},{"$f":"SUMIFS(TBCompras[Valor Total Item (R$)],TBCompras[Mês do Projeto],\"<=\" & 14,TBCompras[Até],\">=\"& 14,TBCompras[Meta:Atividade],LEFT(B53,FIND(\" \",B53,1)-1),TBCompras[Tipo de Material],\"CONSUMO\")","v":0},{"$f":"SUMIFS(TBCompras[Valor Total Item (R$)],TBCompras[Mês do Projeto],\"<=\" & 15,TBCompras[Até],\">=\"& 15,TBCompras[Meta:Atividade],LEFT(B53,FIND(\" \",B53,1)-1),TBCompras[Tipo de Material],\"CONSUMO\")","v":0},{"$f":"SUMIFS(TBCompras[Valor Total Item (R$)],TBCompras[Mês do Projeto],\"<=\" & 16,TBCompras[Até],\">=\"& 16,TBCompras[Meta:Atividade],LEFT(B53,FIND(\" \",B53,1)-1),TBCompras[Tipo de Material],\"CONSUMO\")","v":0},{"$f":"SUMIFS(TBCompras[Valor Total Item (R$)],TBCompras[Mês do Projeto],\"<=\" & 17,TBCompras[Até],\">=\"& 17,TBCompras[Meta:Atividade],LEFT(B53,FIND(\" \",B53,1)-1),TBCompras[Tipo de Material],\"CONSUMO\")","v":0},{"$f":"SUMIFS(TBCompras[Valor Total Item (R$)],TBCompras[Mês do Projeto],\"<=\" & 18,TBCompras[Até],\">=\"& 18,TBCompras[Meta:Atividade],LEFT(B53,FIND(\" \",B53,1)-1),TBCompras[Tipo de Material],\"CONSUMO\")","v":0},{"$f":"SUMIFS(TBCompras[Valor Total Item (R$)],TBCompras[Mês do Projeto],\"<=\" & 19,TBCompras[Até],\">=\"& 19,TBCompras[Meta:Atividade],LEFT(B53,FIND(\" \",B53,1)-1),TBCompras[Tipo de Material],\"CONSUMO\")","v":0},{"$f":"SUMIFS(TBCompras[Valor Total Item (R$)],TBCompras[Mês do Projeto],\"<=\" & 20,TBCompras[Até],\">=\"& 20,TBCompras[Meta:Atividade],LEFT(B53,FIND(\" \",B53,1)-1),TBCompras[Tipo de Material],\"CONSUMO\")","v":0},{"$f":"SUMIFS(TBCompras[Valor Total Item (R$)],TBCompras[Mês do Projeto],\"<=\" & 21,TBCompras[Até],\">=\"& 21,TBCompras[Meta:Atividade],LEFT(B53,FIND(\" \",B53,1)-1),TBCompras[Tipo de Material],\"CONSUMO\")","v":0},{"$f":"SUMIFS(TBCompras[Valor Total Item (R$)],TBCompras[Mês do Projeto],\"<=\" & 22,TBCompras[Até],\">=\"& 22,TBCompras[Meta:Atividade],LEFT(B53,FIND(\" \",B53,1)-1),TBCompras[Tipo de Material],\"CONSUMO\")","v":0},{"$f":"SUMIFS(TBCompras[Valor Total Item (R$)],TBCompras[Mês do Projeto],\"<=\" & 23,TBCompras[Até],\">=\"& 23,TBCompras[Meta:Atividade],LEFT(B53,FIND(\" \",B53,1)-1),TBCompras[Tipo de Material],\"CONSUMO\")","v":0},{"$f":"SUMIFS(TBCompras[Valor Total Item (R$)],TBCompras[Mês do Projeto],\"<=\" & 24,TBCompras[Até],\">=\"& 24,TBCompras[Meta:Atividade],LEFT(B53,FIND(\" \",B53,1)-1),TBCompras[Tipo de Material],\"CONSUMO\")","v":0},{"$f":"SUMIFS(TBCompras[Valor Total Item (R$)],TBCompras[Mês do Projeto],\"<=\" & 25,TBCompras[Até],\">=\"& 25,TBCompras[Meta:Atividade],LEFT(B53,FIND(\" \",B53,1)-1),TBCompras[Tipo de Material],\"CONSUMO\")","v":0},{"$f":"SUMIFS(TBCompras[Valor Total Item (R$)],TBCompras[Mês do Projeto],\"<=\" & 26,TBCompras[Até],\">=\"& 26,TBCompras[Meta:Atividade],LEFT(B53,FIND(\" \",B53,1)-1),TBCompras[Tipo de Material],\"CONSUMO\")","v":0},{"$f":"SUMIFS(TBCompras[Valor Total Item (R$)],TBCompras[Mês do Projeto],\"<=\" & 27,TBCompras[Até],\">=\"& 27,TBCompras[Meta:Atividade],LEFT(B53,FIND(\" \",B53,1)-1),TBCompras[Tipo de Material],\"CONSUMO\")","v":0},{"$f":"SUMIFS(TBCompras[Valor Total Item (R$)],TBCompras[Mês do Projeto],\"<=\" & 28,TBCompras[Até],\">=\"& 28,TBCompras[Meta:Atividade],LEFT(B53,FIND(\" \",B53,1)-1),TBCompras[Tipo de Material],\"CONSUMO\")","v":0},{"$f":"SUMIFS(TBCompras[Valor Total Item (R$)],TBCompras[Mês do Projeto],\"<=\" & 29,TBCompras[Até],\">=\"& 29,TBCompras[Meta:Atividade],LEFT(B53,FIND(\" \",B53,1)-1),TBCompras[Tipo de Material],\"CONSUMO\")","v":0},{"$f":"SUMIFS(TBCompras[Valor Total Item (R$)],TBCompras[Mês do Projeto],\"<=\" & 30,TBCompras[Até],\">=\"& 30,TBCompras[Meta:Atividade],LEFT(B53,FIND(\" \",B53,1)-1),TBCompras[Tipo de Material],\"CONSUMO\")","v":0},{"$f":"SUMIFS(TBCompras[Valor Total Item (R$)],TBCompras[Mês do Projeto],\"<=\" & 31,TBCompras[Até],\">=\"& 31,TBCompras[Meta:Atividade],LEFT(B53,FIND(\" \",B53,1)-1),TBCompras[Tipo de Material],\"CONSUMO\")","v":0},{"$f":"SUMIFS(TBCompras[Valor Total Item (R$)],TBCompras[Mês do Projeto],\"<=\" & 32,TBCompras[Até],\">=\"& 32,TBCompras[Meta:Atividade],LEFT(B53,FIND(\" \",B53,1)-1),TBCompras[Tipo de Material],\"CONSUMO\")","v":0},{"$f":"SUMIFS(TBCompras[Valor Total Item (R$)],TBCompras[Mês do Projeto],\"<=\" & 33,TBCompras[Até],\">=\"& 33,TBCompras[Meta:Atividade],LEFT(B53,FIND(\" \",B53,1)-1),TBCompras[Tipo de Material],\"CONSUMO\")","v":0},{"$f":"SUMIFS(TBCompras[Valor Total Item (R$)],TBCompras[Mês do Projeto],\"<=\" & 34,TBCompras[Até],\">=\"& 34,TBCompras[Meta:Atividade],LEFT(B53,FIND(\" \",B53,1)-1),TBCompras[Tipo de Material],\"CONSUMO\")","v":0},{"$f":"SUMIFS(TBCompras[Valor Total Item (R$)],TBCompras[Mês do Projeto],\"<=\" & 35,TBCompras[Até],\">=\"& 35,TBCompras[Meta:Atividade],LEFT(B53,FIND(\" \",B53,1)-1),TBCompras[Tipo de Material],\"CONSUMO\")","v":0},{"$f":"SUMIFS(TBCompras[Valor Total Item (R$)],TBCompras[Mês do Projeto],\"<=\" & 36,TBCompras[Até],\">=\"& 36,TBCompras[Meta:Atividade],LEFT(B53,FIND(\" \",B53,1)-1),TBCompras[Tipo de Material],\"CONSUMO\")","v":0},0]
[null,null,"Equipamentos",{"$f":"SUMIFS(TBCompras[Valor Total Item (R$)],TBCompras[Mês do Projeto],\"<=\" & 1,TBCompras[Até],\">=\"& 1,TBCompras[Meta:Atividade],LEFT(B53,FIND(\" \",B53,1)-1),TBCompras[Tipo de Material],\"EQUIPAMENTO\")","v":0},{"$f":"SUMIFS(TBCompras[Valor Total Item (R$)],TBCompras[Mês do Projeto],\"<=\" & 2,TBCompras[Até],\">=\"& 2,TBCompras[Meta:Atividade],LEFT(B53,FIND(\" \",B53,1)-1),TBCompras[Tipo de Material],\"EQUIPAMENTO\")","v":0},{"$f":"SUMIFS(TBCompras[Valor Total Item (R$)],TBCompras[Mês do Projeto],\"<=\" & 3,TBCompras[Até],\">=\"& 3,TBCompras[Meta:Atividade],LEFT(B53,FIND(\" \",B53,1)-1),TBCompras[Tipo de Material],\"EQUIPAMENTO\")","v":0},{"$f":"SUMIFS(TBCompras[Valor Total Item (R$)],TBCompras[Mês do Projeto],\"<=\" & 4,TBCompras[Até],\">=\"& 4,TBCompras[Meta:Atividade],LEFT(B53,FIND(\" \",B53,1)-1),TBCompras[Tipo de Material],\"EQUIPAMENTO\")","v":0},{"$f":"SUMIFS(TBCompras[Valor Total Item (R$)],TBCompras[Mês do Projeto],\"<=\" & 5,TBCompras[Até],\">=\"& 5,TBCompras[Meta:Atividade],LEFT(B53,FIND(\" \",B53,1)-1),TBCompras[Tipo de Material],\"EQUIPAMENTO\")","v":0},{"$f":"SUMIFS(TBCompras[Valor Total Item (R$)],TBCompras[Mês do Projeto],\"<=\" & 6,TBCompras[Até],\">=\"& 6,TBCompras[Meta:Atividade],LEFT(B53,FIND(\" \",B53,1)-1),TBCompras[Tipo de Material],\"EQUIPAMENTO\")","v":0},{"$f":"SUMIFS(TBCompras[Valor Total Item (R$)],TBCompras[Mês do Projeto],\"<=\" & 7,TBCompras[Até],\">=\"& 7,TBCompras[Meta:Atividade],LEFT(B53,FIND(\" \",B53,1)-1),TBCompras[Tipo de Material],\"EQUIPAMENTO\")","v":0},{"$f":"SUMIFS(TBCompras[Valor Total Item (R$)],TBCompras[Mês do Projeto],\"<=\" & 8,TBCompras[Até],\">=\"& 8,TBCompras[Meta:Atividade],LEFT(B53,FIND(\" \",B53,1)-1),TBCompras[Tipo de Material],\"EQUIPAMENTO\")","v":0},{"$f":"SUMIFS(TBCompras[Valor Total Item (R$)],TBCompras[Mês do Projeto],\"<=\" & 9,TBCompras[Até],\">=\"& 9,TBCompras[Meta:Atividade],LEFT(B53,FIND(\" \",B53,1)-1),TBCompras[Tipo de Material],\"EQUIPAMENTO\")","v":0},{"$f":"SUMIFS(TBCompras[Valor Total Item (R$)],TBCompras[Mês do Projeto],\"<=\" & 10,TBCompras[Até],\">=\"& 10,TBCompras[Meta:Atividade],LEFT(B53,FIND(\" \",B53,1)-1),TBCompras[Tipo de Material],\"EQUIPAMENTO\")","v":0},{"$f":"SUMIFS(TBCompras[Valor Total Item (R$)],TBCompras[Mês do Projeto],\"<=\" & 11,TBCompras[Até],\">=\"& 11,TBCompras[Meta:Atividade],LEFT(B53,FIND(\" \",B53,1)-1),TBCompras[Tipo de Material],\"EQUIPAMENTO\")","v":0},{"$f":"SUMIFS(TBCompras[Valor Total Item (R$)],TBCompras[Mês do Projeto],\"<=\" & 12,TBCompras[Até],\">=\"& 12,TBCompras[Meta:Atividade],LEFT(B53,FIND(\" \",B53,1)-1),TBCompras[Tipo de Material],\"EQUIPAMENTO\")","v":0},{"$f":"SUMIFS(TBCompras[Valor Total Item (R$)],TBCompras[Mês do Projeto],\"<=\" & 13,TBCompras[Até],\">=\"& 13,TBCompras[Meta:Atividade],LEFT(B53,FIND(\" \",B53,1)-1),TBCompras[Tipo de Material],\"EQUIPAMENTO\")","v":0},{"$f":"SUMIFS(TBCompras[Valor Total Item (R$)],TBCompras[Mês do Projeto],\"<=\" & 14,TBCompras[Até],\">=\"& 14,TBCompras[Meta:Atividade],LEFT(B53,FIND(\" \",B53,1)-1),TBCompras[Tipo de Material],\"EQUIPAMENTO\")","v":0},{"$f":"SUMIFS(TBCompras[Valor Total Item (R$)],TBCompras[Mês do Projeto],\"<=\" & 15,TBCompras[Até],\">=\"& 15,TBCompras[Meta:Atividade],LEFT(B53,FIND(\" \",B53,1)-1),TBCompras[Tipo de Material],\"EQUIPAMENTO\")","v":0},{"$f":"SUMIFS(TBCompras[Valor Total Item (R$)],TBCompras[Mês do Projeto],\"<=\" & 16,TBCompras[Até],\">=\"& 16,TBCompras[Meta:Atividade],LEFT(B53,FIND(\" \",B53,1)-1),TBCompras[Tipo de Material],\"EQUIPAMENTO\")","v":0},{"$f":"SUMIFS(TBCompras[Valor Total Item (R$)],TBCompras[Mês do Projeto],\"<=\" & 17,TBCompras[Até],\">=\"& 17,TBCompras[Meta:Atividade],LEFT(B53,FIND(\" \",B53,1)-1),TBCompras[Tipo de Material],\"EQUIPAMENTO\")","v":0},{"$f":"SUMIFS(TBCompras[Valor Total Item (R$)],TBCompras[Mês do Projeto],\"<=\" & 18,TBCompras[Até],\">=\"& 18,TBCompras[Meta:Atividade],LEFT(B53,FIND(\" \",B53,1)-1),TBCompras[Tipo de Material],\"EQUIPAMENTO\")","v":0},{"$f":"SUMIFS(TBCompras[Valor Total Item (R$)],TBCompras[Mês do Projeto],\"<=\" & 19,TBCompras[Até],\">=\"& 19,TBCompras[Meta:Atividade],LEFT(B53,FIND(\" \",B53,1)-1),TBCompras[Tipo de Material],\"EQUIPAMENTO\")","v":0},{"$f":"SUMIFS(TBCompras[Valor Total Item (R$)],TBCompras[Mês do Projeto],\"<=\" & 20,TBCompras[Até],\">=\"& 20,TBCompras[Meta:Atividade],LEFT(B53,FIND(\" \",B53,1)-1),TBCompras[Tipo de Material],\"EQUIPAMENTO\")","v":0},{"$f":"SUMIFS(TBCompras[Valor Total Item (R$)],TBCompras[Mês do Projeto],\"<=\" & 21,TBCompras[Até],\">=\"& 21,TBCompras[Meta:Atividade],LEFT(B53,FIND(\" \",B53,1)-1),TBCompras[Tipo de Material],\"EQUIPAMENTO\")","v":0},{"$f":"SUMIFS(TBCompras[Valor Total Item (R$)],TBCompras[Mês do Projeto],\"<=\" & 22,TBCompras[Até],\">=\"& 22,TBCompras[Meta:Atividade],LEFT(B53,FIND(\" \",B53,1)-1),TBCompras[Tipo de Material],\"EQUIPAMENTO\")","v":0},{"$f":"SUMIFS(TBCompras[Valor Total Item (R$)],TBCompras[Mês do Projeto],\"<=\" & 23,TBCompras[Até],\">=\"& 23,TBCompras[Meta:Atividade],LEFT(B53,FIND(\" \",B53,1)-1),TBCompras[Tipo de Material],\"EQUIPAMENTO\")","v":0},{"$f":"SUMIFS(TBCompras[Valor Total Item (R$)],TBCompras[Mês do Projeto],\"<=\" & 24,TBCompras[Até],\">=\"& 24,TBCompras[Meta:Atividade],LEFT(B53,FIND(\" \",B53,1)-1),TBCompras[Tipo de Material],\"EQUIPAMENTO\")","v":0},{"$f":"SUMIFS(TBCompras[Valor Total Item (R$)],TBCompras[Mês do Projeto],\"<=\" & 25,TBCompras[Até],\">=\"& 25,TBCompras[Meta:Atividade],LEFT(B53,FIND(\" \",B53,1)-1),TBCompras[Tipo de Material],\"EQUIPAMENTO\")","v":0},{"$f":"SUMIFS(TBCompras[Valor Total Item (R$)],TBCompras[Mês do Projeto],\"<=\" & 26,TBCompras[Até],\">=\"& 26,TBCompras[Meta:Atividade],LEFT(B53,FIND(\" \",B53,1)-1),TBCompras[Tipo de Material],\"EQUIPAMENTO\")","v":0},{"$f":"SUMIFS(TBCompras[Valor Total Item (R$)],TBCompras[Mês do Projeto],\"<=\" & 27,TBCompras[Até],\">=\"& 27,TBCompras[Meta:Atividade],LEFT(B53,FIND(\" \",B53,1)-1),TBCompras[Tipo de Material],\"EQUIPAMENTO\")","v":0},{"$f":"SUMIFS(TBCompras[Valor Total Item (R$)],TBCompras[Mês do Projeto],\"<=\" & 28,TBCompras[Até],\">=\"& 28,TBCompras[Meta:Atividade],LEFT(B53,FIND(\" \",B53,1)-1),TBCompras[Tipo de Material],\"EQUIPAMENTO\")","v":0},{"$f":"SUMIFS(TBCompras[Valor Total Item (R$)],TBCompras[Mês do Projeto],\"<=\" & 29,TBCompras[Até],\">=\"& 29,TBCompras[Meta:Atividade],LEFT(B53,FIND(\" \",B53,1)-1),TBCompras[Tipo de Material],\"EQUIPAMENTO\")","v":0},{"$f":"SUMIFS(TBCompras[Valor Total Item (R$)],TBCompras[Mês do Projeto],\"<=\" & 30,TBCompras[Até],\">=\"& 30,TBCompras[Meta:Atividade],LEFT(B53,FIND(\" \",B53,1)-1),TBCompras[Tipo de Material],\"EQUIPAMENTO\")","v":0},{"$f":"SUMIFS(TBCompras[Valor Total Item (R$)],TBCompras[Mês do Projeto],\"<=\" & 31,TBCompras[Até],\">=\"& 31,TBCompras[Meta:Atividade],LEFT(B53,FIND(\" \",B53,1)-1),TBCompras[Tipo de Material],\"EQUIPAMENTO\")","v":0},{"$f":"SUMIFS(TBCompras[Valor Total Item (R$)],TBCompras[Mês do Projeto],\"<=\" & 32,TBCompras[Até],\">=\"& 32,TBCompras[Meta:Atividade],LEFT(B53,FIND(\" \",B53,1)-1),TBCompras[Tipo de Material],\"EQUIPAMENTO\")","v":0},{"$f":"SUMIFS(TBCompras[Valor Total Item (R$)],TBCompras[Mês do Projeto],\"<=\" & 33,TBCompras[Até],\">=\"& 33,TBCompras[Meta:Atividade],LEFT(B53,FIND(\" \",B53,1)-1),TBCompras[Tipo de Material],\"EQUIPAMENTO\")","v":0},{"$f":"SUMIFS(TBCompras[Valor Total Item (R$)],TBCompras[Mês do Projeto],\"<=\" & 34,TBCompras[Até],\">=\"& 34,TBCompras[Meta:Atividade],LEFT(B53,FIND(\" \",B53,1)-1),TBCompras[Tipo de Material],\"EQUIPAMENTO\")","v":0},{"$f":"SUMIFS(TBCompras[Valor Total Item (R$)],TBCompras[Mês do Projeto],\"<=\" & 35,TBCompras[Até],\">=\"& 35,TBCompras[Meta:Atividade],LEFT(B53,FIND(\" \",B53,1)-1),TBCompras[Tipo de Material],\"EQUIPAMENTO\")","v":0},{"$f":"SUMIFS(TBCompras[Valor Total Item (R$)],TBCompras[Mês do Projeto],\"<=\" & 36,TBCompras[Até],\">=\"& 36,TBCompras[Meta:Atividade],LEFT(B53,FIND(\" \",B53,1)-1),TBCompras[Tipo de Material],\"EQUIPAMENTO\")","v":0},0]
[null,null,"Total Atividade 4.1",{"$f":"SUBTOTAL(9,D53:D58)","v":0},0,0,0,0,0,0,0,0,0,0,0,0,0,0,0,0,0,0,0,0,0,0,0,0,0,0,0,0,0,0,0,0,0,0,0,0]
[null,"4.2 - Teste de neurovirulência em modelo de primatas não-humanos","Pessoa Física",{"$f":"SUMIFS(TbPessoas[Custo Total Mensal],TbPessoas[A partir do mês],\"<=\" & 1,TbPessoas[Até],\">=\"& 1,TbPessoas[Meta:Atividade],LEFT(B60,FIND(\" \",B60,1)-1))","v":0},{"$f":"SUMIFS(TbPessoas[Custo Total Mensal],TbPessoas[A partir do mês],\"<=\" & 2,TbPessoas[Até],\">=\"& 2,TbPessoas[Meta:Atividade],LEFT(B60,FIND(\" \",B60,1)-1))","v":0},{"$f":"SUMIFS(TbPessoas[Custo Total Mensal],TbPessoas[A partir do mês],\"<=\" & 3,TbPessoas[Até],\">=\"& 3,TbPessoas[Meta:Atividade],LEFT(B60,FIND(\" \",B60,1)-1))","v":0},{"$f":"SUMIFS(TbPessoas[Custo Total Mensal],TbPessoas[A partir do mês],\"<=\" & 4,TbPessoas[Até],\">=\"& 4,TbPessoas[Meta:Atividade],LEFT(B60,FIND(\" \",B60,1)-1))","v":0},{"$f":"SUMIFS(TbPessoas[Custo Total Mensal],TbPessoas[A partir do mês],\"<=\" & 5,TbPessoas[Até],\">=\"& 5,TbPessoas[Meta:Atividade],LEFT(B60,FIND(\" \",B60,1)-1))","v":0},{"$f":"SUMIFS(TbPessoas[Custo Total Mensal],TbPessoas[A partir do mês],\"<=\" & 6,TbPessoas[Até],\">=\"& 6,TbPessoas[Meta:Atividade],LEFT(B60,FIND(\" \",B60,1)-1))","v":0},{"$f":"SUMIFS(TbPessoas[Custo Total Mensal],TbPessoas[A partir do mês],\"<=\" & 7,TbPessoas[Até],\">=\"& 7,TbPessoas[Meta:Atividade],LEFT(B60,FIND(\" \",B60,1)-1))","v":0},{"$f":"SUMIFS(TbPessoas[Custo Total Mensal],TbPessoas[A partir do mês],\"<=\" & 8,TbPessoas[Até],\">=\"& 8,TbPessoas[Meta:Atividade],LEFT(B60,FIND(\" \",B60,1)-1))","v":0},{"$f":"SUMIFS(TbPessoas[Custo Total Mensal],TbPessoas[A partir do mês],\"<=\" & 9,TbPessoas[Até],\">=\"& 9,TbPessoas[Meta:Atividade],LEFT(B60,FIND(\" \",B60,1)-1))","v":0},{"$f":"SUMIFS(TbPessoas[Custo Total Mensal],TbPessoas[A partir do mês],\"<=\" & 10,TbPessoas[Até],\">=\"& 10,TbPessoas[Meta:Atividade],LEFT(B60,FIND(\" \",B60,1)-1))","v":0},{"$f":"SUMIFS(TbPessoas[Custo Total Mensal],TbPessoas[A partir do mês],\"<=\" & 11,TbPessoas[Até],\">=\"& 11,TbPessoas[Meta:Atividade],LEFT(B60,FIND(\" \",B60,1)-1))","v":0},{"$f":"SUMIFS(TbPessoas[Custo Total Mensal],TbPessoas[A partir do mês],\"<=\" & 12,TbPessoas[Até],\">=\"& 12,TbPessoas[Meta:Atividade],LEFT(B60,FIND(\" \",B60,1)-1))","v":0},{"$f":"SUMIFS(TbPessoas[Custo Total Mensal],TbPessoas[A partir do mês],\"<=\" & 13,TbPessoas[Até],\">=\"& 13,TbPessoas[Meta:Atividade],LEFT(B60,FIND(\" \",B60,1)-1))","v":0},{"$f":"SUMIFS(TbPessoas[Custo Total Mensal],TbPessoas[A partir do mês],\"<=\" & 14,TbPessoas[Até],\">=\"& 14,TbPessoas[Meta:Atividade],LEFT(B60,FIND(\" \",B60,1)-1))","v":0},{"$f":"SUMIFS(TbPessoas[Custo Total Mensal],TbPessoas[A partir do mês],\"<=\" & 15,TbPessoas[Até],\">=\"& 15,TbPessoas[Meta:Atividade],LEFT(B60,FIND(\" \",B60,1)-1))","v":0},{"$f":"SUMIFS(TbPessoas[Custo Total Mensal],TbPessoas[A partir do mês],\"<=\" & 16,TbPessoas[Até],\">=\"& 16,TbPessoas[Meta:Atividade],LEFT(B60,FIND(\" \",B60,1)-1))","v":0},{"$f":"SUMIFS(TbPessoas[Custo Total Mensal],TbPessoas[A partir do mês],\"<=\" & 17,TbPessoas[Até],\">=\"& 17,TbPessoas[Meta:Atividade],LEFT(B60,FIND(\" \",B60,1)-1))","v":0},{"$f":"SUMIFS(TbPessoas[Custo Total Mensal],TbPessoas[A partir do mês],\"<=\" & 18,TbPessoas[Até],\">=\"& 18,TbPessoas[Meta:Atividade],LEFT(B60,FIND(\" \",B60,1)-1))","v":0},{"$f":"SUMIFS(TbPessoas[Custo Total Mensal],TbPessoas[A partir do mês],\"<=\" & 19,TbPessoas[Até],\">=\"& 19,TbPessoas[Meta:Atividade],LEFT(B60,FIND(\" \",B60,1)-1))","v":0},{"$f":"SUMIFS(TbPessoas[Custo Total Mensal],TbPessoas[A partir do mês],\"<=\" & 20,TbPessoas[Até],\">=\"& 20,TbPessoas[Meta:Atividade],LEFT(B60,FIND(\" \",B60,1)-1))","v":0},{"$f":"SUMIFS(TbPessoas[Custo Total Mensal],TbPessoas[A partir do mês],\"<=\" & 21,TbPessoas[Até],\">=\"& 21,TbPessoas[Meta:Atividade],LEFT(B60,FIND(\" \",B60,1)-1))","v":0},{"$f":"SUMIFS(TbPessoas[Custo Total Mensal],TbPessoas[A partir do mês],\"<=\" & 22,TbPessoas[Até],\">=\"& 22,TbPessoas[Meta:Atividade],LEFT(B60,FIND(\" \",B60,1)-1))","v":0},{"$f":"SUMIFS(TbPessoas[Custo Total Mensal],TbPessoas[A partir do mês],\"<=\" & 23,TbPessoas[Até],\">=\"& 23,TbPessoas[Meta:Atividade],LEFT(B60,FIND(\" \",B60,1)-1))","v":0},{"$f":"SUMIFS(TbPessoas[Custo Total Mensal],TbPessoas[A partir do mês],\"<=\" & 24,TbPessoas[Até],\">=\"& 24,TbPessoas[Meta:Atividade],LEFT(B60,FIND(\" \",B60,1)-1))","v":0},{"$f":"SUMIFS(TbPessoas[Custo Total Mensal],TbPessoas[A partir do mês],\"<=\" & 25,TbPessoas[Até],\">=\"& 25,TbPessoas[Meta:Atividade],LEFT(B60,FIND(\" \",B60,1)-1))","v":0},{"$f":"SUMIFS(TbPessoas[Custo Total Mensal],TbPessoas[A partir do mês],\"<=\" & 26,TbPessoas[Até],\">=\"& 26,TbPessoas[Meta:Atividade],LEFT(B60,FIND(\" \",B60,1)-1))","v":0},{"$f":"SUMIFS(TbPessoas[Custo Total Mensal],TbPessoas[A partir do mês],\"<=\" & 27,TbPessoas[Até],\">=\"& 27,TbPessoas[Meta:Atividade],LEFT(B60,FIND(\" \",B60,1)-1))","v":0},{"$f":"SUMIFS(TbPessoas[Custo Total Mensal],TbPessoas[A partir do mês],\"<=\" & 28,TbPessoas[Até],\">=\"& 28,TbPessoas[Meta:Atividade],LEFT(B60,FIND(\" \",B60,1)-1))","v":0},{"$f":"SUMIFS(TbPessoas[Custo Total Mensal],TbPessoas[A partir do mês],\"<=\" & 29,TbPessoas[Até],\">=\"& 29,TbPessoas[Meta:Atividade],LEFT(B60,FIND(\" \",B60,1)-1))","v":0},{"$f":"SUMIFS(TbPessoas[Custo Total Mensal],TbPessoas[A partir do mês],\"<=\" & 30,TbPessoas[Até],\">=\"& 30,TbPessoas[Meta:Atividade],LEFT(B60,FIND(\" \",B60,1)-1))","v":0},{"$f":"SUMIFS(TbPessoas[Custo Total Mensal],TbPessoas[A partir do mês],\"<=\" & 31,TbPessoas[Até],\">=\"& 31,TbPessoas[Meta:Atividade],LEFT(B60,FIND(\" \",B60,1)-1))","v":0},{"$f":"SUMIFS(TbPessoas[Custo Total Mensal],TbPessoas[A partir do mês],\"<=\" & 32,TbPessoas[Até],\">=\"& 32,TbPessoas[Meta:Atividade],LEFT(B60,FIND(\" \",B60,1)-1))","v":0},{"$f":"SUMIFS(TbPessoas[Custo Total Mensal],TbPessoas[A partir do mês],\"<=\" & 33,TbPessoas[Até],\">=\"& 33,TbPessoas[Meta:Atividade],LEFT(B60,FIND(\" \",B60,1)-1))","v":0},{"$f":"SUMIFS(TbPessoas[Custo Total Mensal],TbPessoas[A partir do mês],\"<=\" & 34,TbPessoas[Até],\">=\"& 34,TbPessoas[Meta:Atividade],LEFT(B60,FIND(\" \",B60,1)-1))","v":0},{"$f":"SUMIFS(TbPessoas[Custo Total Mensal],TbPessoas[A partir do mês],\"<=\" & 35,TbPessoas[Até],\">=\"& 35,TbPessoas[Meta:Atividade],LEFT(B60,FIND(\" \",B60,1)-1))","v":0},{"$f":"SUMIFS(TbPessoas[Custo Total Mensal],TbPessoas[A partir do mês],\"<=\" & 36,TbPessoas[Até],\">=\"& 36,TbPessoas[Meta:Atividade],LEFT(B60,FIND(\" \",B60,1)-1))","v":0},{"$f":"SUM(D60:AM60)","v":0}]
[null,null,"Pessoa Jurídica",{"$f":"SUMIFS(TBCompras[Valor Total Item (R$)],TBCompras[Mês do Projeto],\"<=\" & 1,TBCompras[Até],\">=\"& 1,TBCompras[Meta:Atividade],LEFT(B60,FIND(\" \",B60,1)-1),TBCompras[Tipo de Material],\"SERVIÇO\")","v":0},{"$f":"SUMIFS(TBCompras[Valor Total Item (R$)],TBCompras[Mês do Projeto],\"<=\" & 2,TBCompras[Até],\">=\"& 2,TBCompras[Meta:Atividade],LEFT(B60,FIND(\" \",B60,1)-1),TBCompras[Tipo de Material],\"SERVIÇO\")","v":0},{"$f":"SUMIFS(TBCompras[Valor Total Item (R$)],TBCompras[Mês do Projeto],\"<=\" & 3,TBCompras[Até],\">=\"& 3,TBCompras[Meta:Atividade],LEFT(B60,FIND(\" \",B60,1)-1),TBCompras[Tipo de Material],\"SERVIÇO\")","v":0},{"$f":"SUMIFS(TBCompras[Valor Total Item (R$)],TBCompras[Mês do Projeto],\"<=\" & 4,TBCompras[Até],\">=\"& 4,TBCompras[Meta:Atividade],LEFT(B60,FIND(\" \",B60,1)-1),TBCompras[Tipo de Material],\"SERVIÇO\")","v":0},{"$f":"SUMIFS(TBCompras[Valor Total Item (R$)],TBCompras[Mês do Projeto],\"<=\" & 5,TBCompras[Até],\">=\"& 5,TBCompras[Meta:Atividade],LEFT(B60,FIND(\" \",B60,1)-1),TBCompras[Tipo de Material],\"SERVIÇO\")","v":0},{"$f":"SUMIFS(TBCompras[Valor Total Item (R$)],TBCompras[Mês do Projeto],\"<=\" & 6,TBCompras[Até],\">=\"& 6,TBCompras[Meta:Atividade],LEFT(B60,FIND(\" \",B60,1)-1),TBCompras[Tipo de Material],\"SERVIÇO\")","v":0},{"$f":"SUMIFS(TBCompras[Valor Total Item (R$)],TBCompras[Mês do Projeto],\"<=\" & 7,TBCompras[Até],\">=\"& 7,TBCompras[Meta:Atividade],LEFT(B60,FIND(\" \",B60,1)-1),TBCompras[Tipo de Material],\"SERVIÇO\")","v":0},{"$f":"SUMIFS(TBCompras[Valor Total Item (R$)],TBCompras[Mês do Projeto],\"<=\" & 8,TBCompras[Até],\">=\"& 8,TBCompras[Meta:Atividade],LEFT(B60,FIND(\" \",B60,1)-1),TBCompras[Tipo de Material],\"SERVIÇO\")","v":0},{"$f":"SUMIFS(TBCompras[Valor Total Item (R$)],TBCompras[Mês do Projeto],\"<=\" & 9,TBCompras[Até],\">=\"& 9,TBCompras[Meta:Atividade],LEFT(B60,FIND(\" \",B60,1)-1),TBCompras[Tipo de Material],\"SERVIÇO\")","v":0},{"$f":"SUMIFS(TBCompras[Valor Total Item (R$)],TBCompras[Mês do Projeto],\"<=\" & 10,TBCompras[Até],\">=\"& 10,TBCompras[Meta:Atividade],LEFT(B60,FIND(\" \",B60,1)-1),TBCompras[Tipo de Material],\"SERVIÇO\")","v":0},{"$f":"SUMIFS(TBCompras[Valor Total Item (R$)],TBCompras[Mês do Projeto],\"<=\" & 11,TBCompras[Até],\">=\"& 11,TBCompras[Meta:Atividade],LEFT(B60,FIND(\" \",B60,1)-1),TBCompras[Tipo de Material],\"SERVIÇO\")","v":0},{"$f":"SUMIFS(TBCompras[Valor Total Item (R$)],TBCompras[Mês do Projeto],\"<=\" & 12,TBCompras[Até],\">=\"& 12,TBCompras[Meta:Atividade],LEFT(B60,FIND(\" \",B60,1)-1),TBCompras[Tipo de Material],\"SERVIÇO\")","v":0},{"$f":"SUMIFS(TBCompras[Valor Total Item (R$)],TBCompras[Mês do Projeto],\"<=\" & 13,TBCompras[Até],\">=\"& 13,TBCompras[Meta:Atividade],LEFT(B60,FIND(\" \",B60,1)-1),TBCompras[Tipo de Material],\"SERVIÇO\")","v":0},{"$f":"SUMIFS(TBCompras[Valor Total Item (R$)],TBCompras[Mês do Projeto],\"<=\" & 14,TBCompras[Até],\">=\"& 14,TBCompras[Meta:Atividade],LEFT(B60,FIND(\" \",B60,1)-1),TBCompras[Tipo de Material],\"SERVIÇO\")","v":0},{"$f":"SUMIFS(TBCompras[Valor Total Item (R$)],TBCompras[Mês do Projeto],\"<=\" & 15,TBCompras[Até],\">=\"& 15,TBCompras[Meta:Atividade],LEFT(B60,FIND(\" \",B60,1)-1),TBCompras[Tipo de Material],\"SERVIÇO\")","v":0},{"$f":"SUMIFS(TBCompras[Valor Total Item (R$)],TBCompras[Mês do Projeto],\"<=\" & 16,TBCompras[Até],\">=\"& 16,TBCompras[Meta:Atividade],LEFT(B60,FIND(\" \",B60,1)-1),TBCompras[Tipo de Material],\"SERVIÇO\")","v":0},{"$f":"SUMIFS(TBCompras[Valor Total Item (R$)],TBCompras[Mês do Projeto],\"<=\" & 17,TBCompras[Até],\">=\"& 17,TBCompras[Meta:Atividade],LEFT(B60,FIND(\" \",B60,1)-1),TBCompras[Tipo de Material],\"SERVIÇO\")","v":0},{"$f":"SUMIFS(TBCompras[Valor Total Item (R$)],TBCompras[Mês do Projeto],\"<=\" & 18,TBCompras[Até],\">=\"& 18,TBCompras[Meta:Atividade],LEFT(B60,FIND(\" \",B60,1)-1),TBCompras[Tipo de Material],\"SERVIÇO\")","v":0},{"$f":"SUMIFS(TBCompras[Valor Total Item (R$)],TBCompras[Mês do Projeto],\"<=\" & 19,TBCompras[Até],\">=\"& 19,TBCompras[Meta:Atividade],LEFT(B60,FIND(\" \",B60,1)-1),TBCompras[Tipo de Material],\"SERVIÇO\")","v":0},{"$f":"SUMIFS(TBCompras[Valor Total Item (R$)],TBCompras[Mês do Projeto],\"<=\" & 20,TBCompras[Até],\">=\"& 20,TBCompras[Meta:Atividade],LEFT(B60,FIND(\" \",B60,1)-1),TBCompras[Tipo de Material],\"SERVIÇO\")","v":0},{"$f":"SUMIFS(TBCompras[Valor Total Item (R$)],TBCompras[Mês do Projeto],\"<=\" & 21,TBCompras[Até],\">=\"& 21,TBCompras[Meta:Atividade],LEFT(B60,FIND(\" \",B60,1)-1),TBCompras[Tipo de Material],\"SERVIÇO\")","v":0},{"$f":"SUMIFS(TBCompras[Valor Total Item (R$)],TBCompras[Mês do Projeto],\"<=\" & 22,TBCompras[Até],\">=\"& 22,TBCompras[Meta:Atividade],LEFT(B60,FIND(\" \",B60,1)-1),TBCompras[Tipo de Material],\"SERVIÇO\")","v":0},{"$f":"SUMIFS(TBCompras[Valor Total Item (R$)],TBCompras[Mês do Projeto],\"<=\" & 23,TBCompras[Até],\">=\"& 23,TBCompras[Meta:Atividade],LEFT(B60,FIND(\" \",B60,1)-1),TBCompras[Tipo de Material],\"SERVIÇO\")","v":0},{"$f":"SUMIFS(TBCompras[Valor Total Item (R$)],TBCompras[Mês do Projeto],\"<=\" & 24,TBCompras[Até],\">=\"& 24,TBCompras[Meta:Atividade],LEFT(B60,FIND(\" \",B60,1)-1),TBCompras[Tipo de Material],\"SERVIÇO\")","v":0},{"$f":"SUMIFS(TBCompras[Valor Total Item (R$)],TBCompras[Mês do Projeto],\"<=\" & 25,TBCompras[Até],\">=\"& 25,TBCompras[Meta:Atividade],LEFT(B60,FIND(\" \",B60,1)-1),TBCompras[Tipo de Material],\"SERVIÇO\")","v":0},{"$f":"SUMIFS(TBCompras[Valor Total Item (R$)],TBCompras[Mês do Projeto],\"<=\" & 26,TBCompras[Até],\">=\"& 26,TBCompras[Meta:Atividade],LEFT(B60,FIND(\" \",B60,1)-1),TBCompras[Tipo de Material],\"SERVIÇO\")","v":0},{"$f":"SUMIFS(TBCompras[Valor Total Item (R$)],TBCompras[Mês do Projeto],\"<=\" & 27,TBCompras[Até],\">=\"& 27,TBCompras[Meta:Atividade],LEFT(B60,FIND(\" \",B60,1)-1),TBCompras[Tipo de Material],\"SERVIÇO\")","v":0},{"$f":"SUMIFS(TBCompras[Valor Total Item (R$)],TBCompras[Mês do Projeto],\"<=\" & 28,TBCompras[Até],\">=\"& 28,TBCompras[Meta:Atividade],LEFT(B60,FIND(\" \",B60,1)-1),TBCompras[Tipo de Material],\"SERVIÇO\")","v":0},{"$f":"SUMIFS(TBCompras[Valor Total Item (R$)],TBCompras[Mês do Projeto],\"<=\" & 29,TBCompras[Até],\">=\"& 29,TBCompras[Meta:Atividade],LEFT(B60,FIND(\" \",B60,1)-1),TBCompras[Tipo de Material],\"SERVIÇO\")","v":0},{"$f":"SUMIFS(TBCompras[Valor Total Item (R$)],TBCompras[Mês do Projeto],\"<=\" & 30,TBCompras[Até],\">=\"& 30,TBCompras[Meta:Atividade],LEFT(B60,FIND(\" \",B60,1)-1),TBCompras[Tipo de Material],\"SERVIÇO\")","v":0},{"$f":"SUMIFS(TBCompras[Valor Total Item (R$)],TBCompras[Mês do Projeto],\"<=\" & 31,TBCompras[Até],\">=\"& 31,TBCompras[Meta:Atividade],LEFT(B60,FIND(\" \",B60,1)-1),TBCompras[Tipo de Material],\"SERVIÇO\")","v":0},{"$f":"SUMIFS(TBCompras[Valor Total Item (R$)],TBCompras[Mês do Projeto],\"<=\" & 32,TBCompras[Até],\">=\"& 32,TBCompras[Meta:Atividade],LEFT(B60,FIND(\" \",B60,1)-1),TBCompras[Tipo de Material],\"SERVIÇO\")","v":0},{"$f":"SUMIFS(TBCompras[Valor Total Item (R$)],TBCompras[Mês do Projeto],\"<=\" & 33,TBCompras[Até],\">=\"& 33,TBCompras[Meta:Atividade],LEFT(B60,FIND(\" \",B60,1)-1),TBCompras[Tipo de Material],\"SERVIÇO\")","v":0},{"$f":"SUMIFS(TBCompras[Valor Total Item (R$)],TBCompras[Mês do Projeto],\"<=\" & 34,TBCompras[Até],\">=\"& 34,TBCompras[Meta:Atividade],LEFT(B60,FIND(\" \",B60,1)-1),TBCompras[Tipo de Material],\"SERVIÇO\")","v":0},{"$f":"SUMIFS(TBCompras[Valor Total Item (R$)],TBCompras[Mês do Projeto],\"<=\" & 35,TBCompras[Até],\">=\"& 35,TBCompras[Meta:Atividade],LEFT(B60,FIND(\" \",B60,1)-1),TBCompras[Tipo de Material],\"SERVIÇO\")","v":0},{"$f":"SUMIFS(TBCompras[Valor Total Item (R$)],TBCompras[Mês do Projeto],\"<=\" & 36,TBCompras[Até],\">=\"& 36,TBCompras[Meta:Atividade],LEFT(B60,FIND(\" \",B60,1)-1),TBCompras[Tipo de Material],\"SERVIÇO\")","v":0},0]
[null,null,"Passagens",{"$f":"SUMIFS(TbPassagens[Valor Total Passagem],TbPassagens[A partir do mês],\"<=\" & 1,TbPassagens[Até],\">=\"& 1,TbPassagens[Meta:Atividade],LEFT(B60,FIND(\" \",B60,1)-1))","v":0},{"$f":"SUMIFS(TbPassagens[Valor Total Passagem],TbPassagens[A partir do mês],\"<=\" & 2,TbPassagens[Até],\">=\"& 2,TbPassagens[Meta:Atividade],LEFT(B60,FIND(\" \",B60,1)-1))","v":0},{"$f":"SUMIFS(TbPassagens[Valor Total Passagem],TbPassagens[A partir do mês],\"<=\" & 3,TbPassagens[Até],\">=\"& 3,TbPassagens[Meta:Atividade],LEFT(B60,FIND(\" \",B60,1)-1))","v":0},{"$f":"SUMIFS(TbPassagens[Valor Total Passagem],TbPassagens[A partir do mês],\"<=\" & 4,TbPassagens[Até],\">=\"& 4,TbPassagens[Meta:Atividade],LEFT(B60,FIND(\" \",B60,1)-1))","v":0},{"$f":"SUMIFS(TbPassagens[Valor Total Passagem],TbPassagens[A partir do mês],\"<=\" & 5,TbPassagens[Até],\">=\"& 5,TbPassagens[Meta:Atividade],LEFT(B60,FIND(\" \",B60,1)-1))","v":0},{"$f":"SUMIFS(TbPassagens[Valor Total Passagem],TbPassagens[A partir do mês],\"<=\" & 6,TbPassagens[Até],\">=\"& 6,TbPassagens[Meta:Atividade],LEFT(B60,FIND(\" \",B60,1)-1))","v":0},{"$f":"SUMIFS(TbPassagens[Valor Total Passagem],TbPassagens[A partir do mês],\"<=\" & 7,TbPassagens[Até],\">=\"& 7,TbPassagens[Meta:Atividade],LEFT(B60,FIND(\" \",B60,1)-1))","v":0},{"$f":"SUMIFS(TbPassagens[Valor Total Passagem],TbPassagens[A partir do mês],\"<=\" & 8,TbPassagens[Até],\">=\"& 8,TbPassagens[Meta:Atividade],LEFT(B60,FIND(\" \",B60,1)-1))","v":0},{"$f":"SUMIFS(TbPassagens[Valor Total Passagem],TbPassagens[A partir do mês],\"<=\" & 9,TbPassagens[Até],\">=\"& 9,TbPassagens[Meta:Atividade],LEFT(B60,FIND(\" \",B60,1)-1))","v":0},{"$f":"SUMIFS(TbPassagens[Valor Total Passagem],TbPassagens[A partir do mês],\"<=\" & 10,TbPassagens[Até],\">=\"& 10,TbPassagens[Meta:Atividade],LEFT(B60,FIND(\" \",B60,1)-1))","v":0},{"$f":"SUMIFS(TbPassagens[Valor Total Passagem],TbPassagens[A partir do mês],\"<=\" & 11,TbPassagens[Até],\">=\"& 11,TbPassagens[Meta:Atividade],LEFT(B60,FIND(\" \",B60,1)-1))","v":0},{"$f":"SUMIFS(TbPassagens[Valor Total Passagem],TbPassagens[A partir do mês],\"<=\" & 12,TbPassagens[Até],\">=\"& 12,TbPassagens[Meta:Atividade],LEFT(B60,FIND(\" \",B60,1)-1))","v":0},{"$f":"SUMIFS(TbPassagens[Valor Total Passagem],TbPassagens[A partir do mês],\"<=\" & 13,TbPassagens[Até],\">=\"& 13,TbPassagens[Meta:Atividade],LEFT(B60,FIND(\" \",B60,1)-1))","v":0},{"$f":"SUMIFS(TbPassagens[Valor Total Passagem],TbPassagens[A partir do mês],\"<=\" & 14,TbPassagens[Até],\">=\"& 14,TbPassagens[Meta:Atividade],LEFT(B60,FIND(\" \",B60,1)-1))","v":0},{"$f":"SUMIFS(TbPassagens[Valor Total Passagem],TbPassagens[A partir do mês],\"<=\" & 15,TbPassagens[Até],\">=\"& 15,TbPassagens[Meta:Atividade],LEFT(B60,FIND(\" \",B60,1)-1))","v":0},{"$f":"SUMIFS(TbPassagens[Valor Total Passagem],TbPassagens[A partir do mês],\"<=\" & 16,TbPassagens[Até],\">=\"& 16,TbPassagens[Meta:Atividade],LEFT(B60,FIND(\" \",B60,1)-1))","v":0},{"$f":"SUMIFS(TbPassagens[Valor Total Passagem],TbPassagens[A partir do mês],\"<=\" & 17,TbPassagens[Até],\">=\"& 17,TbPassagens[Meta:Atividade],LEFT(B60,FIND(\" \",B60,1)-1))","v":0},{"$f":"SUMIFS(TbPassagens[Valor Total Passagem],TbPassagens[A partir do mês],\"<=\" & 18,TbPassagens[Até],\">=\"& 18,TbPassagens[Meta:Atividade],LEFT(B60,FIND(\" \",B60,1)-1))","v":0},{"$f":"SUMIFS(TbPassagens[Valor Total Passagem],TbPassagens[A partir do mês],\"<=\" & 19,TbPassagens[Até],\">=\"& 19,TbPassagens[Meta:Atividade],LEFT(B60,FIND(\" \",B60,1)-1))","v":0},{"$f":"SUMIFS(TbPassagens[Valor Total Passagem],TbPassagens[A partir do mês],\"<=\" & 20,TbPassagens[Até],\">=\"& 20,TbPassagens[Meta:Atividade],LEFT(B60,FIND(\" \",B60,1)-1))","v":0},{"$f":"SUMIFS(TbPassagens[Valor Total Passagem],TbPassagens[A partir do mês],\"<=\" & 21,TbPassagens[Até],\">=\"& 21,TbPassagens[Meta:Atividade],LEFT(B60,FIND(\" \",B60,1)-1))","v":0},{"$f":"SUMIFS(TbPassagens[Valor Total Passagem],TbPassagens[A partir do mês],\"<=\" & 22,TbPassagens[Até],\">=\"& 22,TbPassagens[Meta:Atividade],LEFT(B60,FIND(\" \",B60,1)-1))","v":0},{"$f":"SUMIFS(TbPassagens[Valor Total Passagem],TbPassagens[A partir do mês],\"<=\" & 23,TbPassagens[Até],\">=\"& 23,TbPassagens[Meta:Atividade],LEFT(B60,FIND(\" \",B60,1)-1))","v":0},{"$f":"SUMIFS(TbPassagens[Valor Total Passagem],TbPassagens[A partir do mês],\"<=\" & 24,TbPassagens[Até],\">=\"& 24,TbPassagens[Meta:Atividade],LEFT(B60,FIND(\" \",B60,1)-1))","v":0},{"$f":"SUMIFS(TbPassagens[Valor Total Passagem],TbPassagens[A partir do mês],\"<=\" & 25,TbPassagens[Até],\">=\"& 25,TbPassagens[Meta:Atividade],LEFT(B60,FIND(\" \",B60,1)-1))","v":0},{"$f":"SUMIFS(TbPassagens[Valor Total Passagem],TbPassagens[A partir do mês],\"<=\" & 26,TbPassagens[Até],\">=\"& 26,TbPassagens[Meta:Atividade],LEFT(B60,FIND(\" \",B60,1)-1))","v":0},{"$f":"SUMIFS(TbPassagens[Valor Total Passagem],TbPassagens[A partir do mês],\"<=\" & 27,TbPassagens[Até],\">=\"& 27,TbPassagens[Meta:Atividade],LEFT(B60,FIND(\" \",B60,1)-1))","v":0},{"$f":"SUMIFS(TbPassagens[Valor Total Passagem],TbPassagens[A partir do mês],\"<=\" & 28,TbPassagens[Até],\">=\"& 28,TbPassagens[Meta:Atividade],LEFT(B60,FIND(\" \",B60,1)-1))","v":0},{"$f":"SUMIFS(TbPassagens[Valor Total Passagem],TbPassagens[A partir do mês],\"<=\" & 29,TbPassagens[Até],\">=\"& 29,TbPassagens[Meta:Atividade],LEFT(B60,FIND(\" \",B60,1)-1))","v":0},{"$f":"SUMIFS(TbPassagens[Valor Total Passagem],TbPassagens[A partir do mês],\"<=\" & 30,TbPassagens[Até],\">=\"& 30,TbPassagens[Meta:Atividade],LEFT(B60,FIND(\" \",B60,1)-1))","v":0},{"$f":"SUMIFS(TbPassagens[Valor Total Passagem],TbPassagens[A partir do mês],\"<=\" & 31,TbPassagens[Até],\">=\"& 31,TbPassagens[Meta:Atividade],LEFT(B60,FIND(\" \",B60,1)-1))","v":0},{"$f":"SUMIFS(TbPassagens[Valor Total Passagem],TbPassagens[A partir do mês],\"<=\" & 32,TbPassagens[Até],\">=\"& 32,TbPassagens[Meta:Atividade],LEFT(B60,FIND(\" \",B60,1)-1))","v":0},{"$f":"SUMIFS(TbPassagens[Valor Total Passagem],TbPassagens[A partir do mês],\"<=\" & 33,TbPassagens[Até],\">=\"& 33,TbPassagens[Meta:Atividade],LEFT(B60,FIND(\" \",B60,1)-1))","v":0},{"$f":"SUMIFS(TbPassagens[Valor Total Passagem],TbPassagens[A partir do mês],\"<=\" & 34,TbPassagens[Até],\">=\"& 34,TbPassagens[Meta:Atividade],LEFT(B60,FIND(\" \",B60,1)-1))","v":0},{"$f":"SUMIFS(TbPassagens[Valor Total Passagem],TbPassagens[A partir do mês],\"<=\" & 35,TbPassagens[Até],\">=\"& 35,TbPassagens[Meta:Atividade],LEFT(B60,FIND(\" \",B60,1)-1))","v":0},{"$f":"SUMIFS(TbPassagens[Valor Total Passagem],TbPassagens[A partir do mês],\"<=\" & 36,TbPassagens[Até],\">=\"& 36,TbPassagens[Meta:Atividade],LEFT(B60,FIND(\" \",B60,1)-1))","v":0},0]
[null,null,"Diárias",{"$f":"SUMIFS(TbPassagens[Valor Total Diária],TbPassagens[A partir do mês],\"<=\" & 1,TbPassagens[Até],\">=\"& 1,TbPassagens[Meta:Atividade],LEFT(B60,FIND(\" \",B60,1)-1))","v":0},{"$f":"SUMIFS(TbPassagens[Valor Total Diária],TbPassagens[A partir do mês],\"<=\" & 2,TbPassagens[Até],\">=\"& 2,TbPassagens[Meta:Atividade],LEFT(B60,FIND(\" \",B60,1)-1))","v":0},{"$f":"SUMIFS(TbPassagens[Valor Total Diária],TbPassagens[A partir do mês],\"<=\" & 3,TbPassagens[Até],\">=\"& 3,TbPassagens[Meta:Atividade],LEFT(B60,FIND(\" \",B60,1)-1))","v":0},{"$f":"SUMIFS(TbPassagens[Valor Total Diária],TbPassagens[A partir do mês],\"<=\" & 4,TbPassagens[Até],\">=\"& 4,TbPassagens[Meta:Atividade],LEFT(B60,FIND(\" \",B60,1)-1))","v":0},{"$f":"SUMIFS(TbPassagens[Valor Total Diária],TbPassagens[A partir do mês],\"<=\" & 5,TbPassagens[Até],\">=\"& 5,TbPassagens[Meta:Atividade],LEFT(B60,FIND(\" \",B60,1)-1))","v":0},{"$f":"SUMIFS(TbPassagens[Valor Total Diária],TbPassagens[A partir do mês],\"<=\" & 6,TbPassagens[Até],\">=\"& 6,TbPassagens[Meta:Atividade],LEFT(B60,FIND(\" \",B60,1)-1))","v":0},{"$f":"SUMIFS(TbPassagens[Valor Total Diária],TbPassagens[A partir do mês],\"<=\" & 7,TbPassagens[Até],\">=\"& 7,TbPassagens[Meta:Atividade],LEFT(B60,FIND(\" \",B60,1)-1))","v":0},{"$f":"SUMIFS(TbPassagens[Valor Total Diária],TbPassagens[A partir do mês],\"<=\" & 8,TbPassagens[Até],\">=\"& 8,TbPassagens[Meta:Atividade],LEFT(B60,FIND(\" \",B60,1)-1))","v":0},{"$f":"SUMIFS(TbPassagens[Valor Total Diária],TbPassagens[A partir do mês],\"<=\" & 9,TbPassagens[Até],\">=\"& 9,TbPassagens[Meta:Atividade],LEFT(B60,FIND(\" \",B60,1)-1))","v":0},{"$f":"SUMIFS(TbPassagens[Valor Total Diária],TbPassagens[A partir do mês],\"<=\" & 10,TbPassagens[Até],\">=\"& 10,TbPassagens[Meta:Atividade],LEFT(B60,FIND(\" \",B60,1)-1))","v":0},{"$f":"SUMIFS(TbPassagens[Valor Total Diária],TbPassagens[A partir do mês],\"<=\" & 11,TbPassagens[Até],\">=\"& 11,TbPassagens[Meta:Atividade],LEFT(B60,FIND(\" \",B60,1)-1))","v":0},{"$f":"SUMIFS(TbPassagens[Valor Total Diária],TbPassagens[A partir do mês],\"<=\" & 12,TbPassagens[Até],\">=\"& 12,TbPassagens[Meta:Atividade],LEFT(B60,FIND(\" \",B60,1)-1))","v":0},{"$f":"SUMIFS(TbPassagens[Valor Total Diária],TbPassagens[A partir do mês],\"<=\" & 13,TbPassagens[Até],\">=\"& 13,TbPassagens[Meta:Atividade],LEFT(B60,FIND(\" \",B60,1)-1))","v":0},{"$f":"SUMIFS(TbPassagens[Valor Total Diária],TbPassagens[A partir do mês],\"<=\" & 14,TbPassagens[Até],\">=\"& 14,TbPassagens[Meta:Atividade],LEFT(B60,FIND(\" \",B60,1)-1))","v":0},{"$f":"SUMIFS(TbPassagens[Valor Total Diária],TbPassagens[A partir do mês],\"<=\" & 15,TbPassagens[Até],\">=\"& 15,TbPassagens[Meta:Atividade],LEFT(B60,FIND(\" \",B60,1)-1))","v":0},{"$f":"SUMIFS(TbPassagens[Valor Total Diária],TbPassagens[A partir do mês],\"<=\" & 16,TbPassagens[Até],\">=\"& 16,TbPassagens[Meta:Atividade],LEFT(B60,FIND(\" \",B60,1)-1))","v":0},{"$f":"SUMIFS(TbPassagens[Valor Total Diária],TbPassagens[A partir do mês],\"<=\" & 17,TbPassagens[Até],\">=\"& 17,TbPassagens[Meta:Atividade],LEFT(B60,FIND(\" \",B60,1)-1))","v":0},{"$f":"SUMIFS(TbPassagens[Valor Total Diária],TbPassagens[A partir do mês],\"<=\" & 18,TbPassagens[Até],\">=\"& 18,TbPassagens[Meta:Atividade],LEFT(B60,FIND(\" \",B60,1)-1))","v":0},{"$f":"SUMIFS(TbPassagens[Valor Total Diária],TbPassagens[A partir do mês],\"<=\" & 19,TbPassagens[Até],\">=\"& 19,TbPassagens[Meta:Atividade],LEFT(B60,FIND(\" \",B60,1)-1))","v":0},{"$f":"SUMIFS(TbPassagens[Valor Total Diária],TbPassagens[A partir do mês],\"<=\" & 20,TbPassagens[Até],\">=\"& 20,TbPassagens[Meta:Atividade],LEFT(B60,FIND(\" \",B60,1)-1))","v":0},{"$f":"SUMIFS(TbPassagens[Valor Total Diária],TbPassagens[A partir do mês],\"<=\" & 21,TbPassagens[Até],\">=\"& 21,TbPassagens[Meta:Atividade],LEFT(B60,FIND(\" \",B60,1)-1))","v":0},{"$f":"SUMIFS(TbPassagens[Valor Total Diária],TbPassagens[A partir do mês],\"<=\" & 22,TbPassagens[Até],\">=\"& 22,TbPassagens[Meta:Atividade],LEFT(B60,FIND(\" \",B60,1)-1))","v":0},{"$f":"SUMIFS(TbPassagens[Valor Total Diária],TbPassagens[A partir do mês],\"<=\" & 23,TbPassagens[Até],\">=\"& 23,TbPassagens[Meta:Atividade],LEFT(B60,FIND(\" \",B60,1)-1))","v":0},{"$f":"SUMIFS(TbPassagens[Valor Total Diária],TbPassagens[A partir do mês],\"<=\" & 24,TbPassagens[Até],\">=\"& 24,TbPassagens[Meta:Atividade],LEFT(B60,FIND(\" \",B60,1)-1))","v":0},{"$f":"SUMIFS(TbPassagens[Valor Total Diária],TbPassagens[A partir do mês],\"<=\" & 25,TbPassagens[Até],\">=\"& 25,TbPassagens[Meta:Atividade],LEFT(B60,FIND(\" \",B60,1)-1))","v":0},{"$f":"SUMIFS(TbPassagens[Valor Total Diária],TbPassagens[A partir do mês],\"<=\" & 26,TbPassagens[Até],\">=\"& 26,TbPassagens[Meta:Atividade],LEFT(B60,FIND(\" \",B60,1)-1))","v":0},{"$f":"SUMIFS(TbPassagens[Valor Total Diária],TbPassagens[A partir do mês],\"<=\" & 27,TbPassagens[Até],\">=\"& 27,TbPassagens[Meta:Atividade],LEFT(B60,FIND(\" \",B60,1)-1))","v":0},{"$f":"SUMIFS(TbPassagens[Valor Total Diária],TbPassagens[A partir do mês],\"<=\" & 28,TbPassagens[Até],\">=\"& 28,TbPassagens[Meta:Atividade],LEFT(B60,FIND(\" \",B60,1)-1))","v":0},{"$f":"SUMIFS(TbPassagens[Valor Total Diária],TbPassagens[A partir do mês],\"<=\" & 29,TbPassagens[Até],\">=\"& 29,TbPassagens[Meta:Atividade],LEFT(B60,FIND(\" \",B60,1)-1))","v":0},{"$f":"SUMIFS(TbPassagens[Valor Total Diária],TbPassagens[A partir do mês],\"<=\" & 30,TbPassagens[Até],\">=\"& 30,TbPassagens[Meta:Atividade],LEFT(B60,FIND(\" \",B60,1)-1))","v":0},{"$f":"SUMIFS(TbPassagens[Valor Total Diária],TbPassagens[A partir do mês],\"<=\" & 31,TbPassagens[Até],\">=\"& 31,TbPassagens[Meta:Atividade],LEFT(B60,FIND(\" \",B60,1)-1))","v":0},{"$f":"SUMIFS(TbPassagens[Valor Total Diária],TbPassagens[A partir do mês],\"<=\" & 32,TbPassagens[Até],\">=\"& 32,TbPassagens[Meta:Atividade],LEFT(B60,FIND(\" \",B60,1)-1))","v":0},{"$f":"SUMIFS(TbPassagens[Valor Total Diária],TbPassagens[A partir do mês],\"<=\" & 33,TbPassagens[Até],\">=\"& 33,TbPassagens[Meta:Atividade],LEFT(B60,FIND(\" \",B60,1)-1))","v":0},{"$f":"SUMIFS(TbPassagens[Valor Total Diária],TbPassagens[A partir do mês],\"<=\" & 34,TbPassagens[Até],\">=\"& 34,TbPassagens[Meta:Atividade],LEFT(B60,FIND(\" \",B60,1)-1))","v":0},{"$f":"SUMIFS(TbPassagens[Valor Total Diária],TbPassagens[A partir do mês],\"<=\" & 35,TbPassagens[Até],\">=\"& 35,TbPassagens[Meta:Atividade],LEFT(B60,FIND(\" \",B60,1)-1))","v":0},{"$f":"SUMIFS(TbPassagens[Valor Total Diária],TbPassagens[A partir do mês],\"<=\" & 36,TbPassagens[Até],\">=\"& 36,TbPassagens[Meta:Atividade],LEFT(B60,FIND(\" \",B60,1)-1))","v":0},0]
[null,null,"Material de Consumo",{"$f":"SUMIFS(TBCompras[Valor Total Item (R$)],TBCompras[Mês do Projeto],\"<=\" & 1,TBCompras[Até],\">=\"& 1,TBCompras[Meta:Atividade],LEFT(B60,FIND(\" \",B60,1)-1),TBCompras[Tipo de Material],\"CONSUMO\")","v":0},{"$f":"SUMIFS(TBCompras[Valor Total Item (R$)],TBCompras[Mês do Projeto],\"<=\" & 2,TBCompras[Até],\">=\"& 2,TBCompras[Meta:Atividade],LEFT(B60,FIND(\" \",B60,1)-1),TBCompras[Tipo de Material],\"CONSUMO\")","v":0},{"$f":"SUMIFS(TBCompras[Valor Total Item (R$)],TBCompras[Mês do Projeto],\"<=\" & 3,TBCompras[Até],\">=\"& 3,TBCompras[Meta:Atividade],LEFT(B60,FIND(\" \",B60,1)-1),TBCompras[Tipo de Material],\"CONSUMO\")","v":0},{"$f":"SUMIFS(TBCompras[Valor Total Item (R$)],TBCompras[Mês do Projeto],\"<=\" & 4,TBCompras[Até],\">=\"& 4,TBCompras[Meta:Atividade],LEFT(B60,FIND(\" \",B60,1)-1),TBCompras[Tipo de Material],\"CONSUMO\")","v":0},{"$f":"SUMIFS(TBCompras[Valor Total Item (R$)],TBCompras[Mês do Projeto],\"<=\" & 5,TBCompras[Até],\">=\"& 5,TBCompras[Meta:Atividade],LEFT(B60,FIND(\" \",B60,1)-1),TBCompras[Tipo de Material],\"CONSUMO\")","v":0},{"$f":"SUMIFS(TBCompras[Valor Total Item (R$)],TBCompras[Mês do Projeto],\"<=\" & 6,TBCompras[Até],\">=\"& 6,TBCompras[Meta:Atividade],LEFT(B60,FIND(\" \",B60,1)-1),TBCompras[Tipo de Material],\"CONSUMO\")","v":0},{"$f":"SUMIFS(TBCompras[Valor Total Item (R$)],TBCompras[Mês do Projeto],\"<=\" & 7,TBCompras[Até],\">=\"& 7,TBCompras[Meta:Atividade],LEFT(B60,FIND(\" \",B60,1)-1),TBCompras[Tipo de Material],\"CONSUMO\")","v":0},{"$f":"SUMIFS(TBCompras[Valor Total Item (R$)],TBCompras[Mês do Projeto],\"<=\" & 8,TBCompras[Até],\">=\"& 8,TBCompras[Meta:Atividade],LEFT(B60,FIND(\" \",B60,1)-1),TBCompras[Tipo de Material],\"CONSUMO\")","v":0},{"$f":"SUMIFS(TBCompras[Valor Total Item (R$)],TBCompras[Mês do Projeto],\"<=\" & 9,TBCompras[Até],\">=\"& 9,TBCompras[Meta:Atividade],LEFT(B60,FIND(\" \",B60,1)-1),TBCompras[Tipo de Material],\"CONSUMO\")","v":0},{"$f":"SUMIFS(TBCompras[Valor Total Item (R$)],TBCompras[Mês do Projeto],\"<=\" & 10,TBCompras[Até],\">=\"& 10,TBCompras[Meta:Atividade],LEFT(B60,FIND(\" \",B60,1)-1),TBCompras[Tipo de Material],\"CONSUMO\")","v":0},{"$f":"SUMIFS(TBCompras[Valor Total Item (R$)],TBCompras[Mês do Projeto],\"<=\" & 11,TBCompras[Até],\">=\"& 11,TBCompras[Meta:Atividade],LEFT(B60,FIND(\" \",B60,1)-1),TBCompras[Tipo de Material],\"CONSUMO\")","v":0},{"$f":"SUMIFS(TBCompras[Valor Total Item (R$)],TBCompras[Mês do Projeto],\"<=\" & 12,TBCompras[Até],\">=\"& 12,TBCompras[Meta:Atividade],LEFT(B60,FIND(\" \",B60,1)-1),TBCompras[Tipo de Material],\"CONSUMO\")","v":0},{"$f":"SUMIFS(TBCompras[Valor Total Item (R$)],TBCompras[Mês do Projeto],\"<=\" & 13,TBCompras[Até],\">=\"& 13,TBCompras[Meta:Atividade],LEFT(B60,FIND(\" \",B60,1)-1),TBCompras[Tipo de Material],\"CONSUMO\")","v":0},{"$f":"SUMIFS(TBCompras[Valor Total Item (R$)],TBCompras[Mês do Projeto],\"<=\" & 14,TBCompras[Até],\">=\"& 14,TBCompras[Meta:Atividade],LEFT(B60,FIND(\" \",B60,1)-1),TBCompras[Tipo de Material],\"CONSUMO\")","v":0},{"$f":"SUMIFS(TBCompras[Valor Total Item (R$)],TBCompras[Mês do Projeto],\"<=\" & 15,TBCompras[Até],\">=\"& 15,TBCompras[Meta:Atividade],LEFT(B60,FIND(\" \",B60,1)-1),TBCompras[Tipo de Material],\"CONSUMO\")","v":0},{"$f":"SUMIFS(TBCompras[Valor Total Item (R$)],TBCompras[Mês do Projeto],\"<=\" & 16,TBCompras[Até],\">=\"& 16,TBCompras[Meta:Atividade],LEFT(B60,FIND(\" \",B60,1)-1),TBCompras[Tipo de Material],\"CONSUMO\")","v":0},{"$f":"SUMIFS(TBCompras[Valor Total Item (R$)],TBCompras[Mês do Projeto],\"<=\" & 17,TBCompras[Até],\">=\"& 17,TBCompras[Meta:Atividade],LEFT(B60,FIND(\" \",B60,1)-1),TBCompras[Tipo de Material],\"CONSUMO\")","v":0},{"$f":"SUMIFS(TBCompras[Valor Total Item (R$)],TBCompras[Mês do Projeto],\"<=\" & 18,TBCompras[Até],\">=\"& 18,TBCompras[Meta:Atividade],LEFT(B60,FIND(\" \",B60,1)-1),TBCompras[Tipo de Material],\"CONSUMO\")","v":0},{"$f":"SUMIFS(TBCompras[Valor Total Item (R$)],TBCompras[Mês do Projeto],\"<=\" & 19,TBCompras[Até],\">=\"& 19,TBCompras[Meta:Atividade],LEFT(B60,FIND(\" \",B60,1)-1),TBCompras[Tipo de Material],\"CONSUMO\")","v":0},{"$f":"SUMIFS(TBCompras[Valor Total Item (R$)],TBCompras[Mês do Projeto],\"<=\" & 20,TBCompras[Até],\">=\"& 20,TBCompras[Meta:Atividade],LEFT(B60,FIND(\" \",B60,1)-1),TBCompras[Tipo de Material],\"CONSUMO\")","v":0},{"$f":"SUMIFS(TBCompras[Valor Total Item (R$)],TBCompras[Mês do Projeto],\"<=\" & 21,TBCompras[Até],\">=\"& 21,TBCompras[Meta:Atividade],LEFT(B60,FIND(\" \",B60,1)-1),TBCompras[Tipo de Material],\"CONSUMO\")","v":0},{"$f":"SUMIFS(TBCompras[Valor Total Item (R$)],TBCompras[Mês do Projeto],\"<=\" & 22,TBCompras[Até],\">=\"& 22,TBCompras[Meta:Atividade],LEFT(B60,FIND(\" \",B60,1)-1),TBCompras[Tipo de Material],\"CONSUMO\")","v":0},{"$f":"SUMIFS(TBCompras[Valor Total Item (R$)],TBCompras[Mês do Projeto],\"<=\" & 23,TBCompras[Até],\">=\"& 23,TBCompras[Meta:Atividade],LEFT(B60,FIND(\" \",B60,1)-1),TBCompras[Tipo de Material],\"CONSUMO\")","v":0},{"$f":"SUMIFS(TBCompras[Valor Total Item (R$)],TBCompras[Mês do Projeto],\"<=\" & 24,TBCompras[Até],\">=\"& 24,TBCompras[Meta:Atividade],LEFT(B60,FIND(\" \",B60,1)-1),TBCompras[Tipo de Material],\"CONSUMO\")","v":0},{"$f":"SUMIFS(TBCompras[Valor Total Item (R$)],TBCompras[Mês do Projeto],\"<=\" & 25,TBCompras[Até],\">=\"& 25,TBCompras[Meta:Atividade],LEFT(B60,FIND(\" \",B60,1)-1),TBCompras[Tipo de Material],\"CONSUMO\")","v":0},{"$f":"SUMIFS(TBCompras[Valor Total Item (R$)],TBCompras[Mês do Projeto],\"<=\" & 26,TBCompras[Até],\">=\"& 26,TBCompras[Meta:Atividade],LEFT(B60,FIND(\" \",B60,1)-1),TBCompras[Tipo de Material],\"CONSUMO\")","v":0},{"$f":"SUMIFS(TBCompras[Valor Total Item (R$)],TBCompras[Mês do Projeto],\"<=\" & 27,TBCompras[Até],\">=\"& 27,TBCompras[Meta:Atividade],LEFT(B60,FIND(\" \",B60,1)-1),TBCompras[Tipo de Material],\"CONSUMO\")","v":0},{"$f":"SUMIFS(TBCompras[Valor Total Item (R$)],TBCompras[Mês do Projeto],\"<=\" & 28,TBCompras[Até],\">=\"& 28,TBCompras[Meta:Atividade],LEFT(B60,FIND(\" \",B60,1)-1),TBCompras[Tipo de Material],\"CONSUMO\")","v":0},{"$f":"SUMIFS(TBCompras[Valor Total Item (R$)],TBCompras[Mês do Projeto],\"<=\" & 29,TBCompras[Até],\">=\"& 29,TBCompras[Meta:Atividade],LEFT(B60,FIND(\" \",B60,1)-1),TBCompras[Tipo de Material],\"CONSUMO\")","v":0},{"$f":"SUMIFS(TBCompras[Valor Total Item (R$)],TBCompras[Mês do Projeto],\"<=\" & 30,TBCompras[Até],\">=\"& 30,TBCompras[Meta:Atividade],LEFT(B60,FIND(\" \",B60,1)-1),TBCompras[Tipo de Material],\"CONSUMO\")","v":0},{"$f":"SUMIFS(TBCompras[Valor Total Item (R$)],TBCompras[Mês do Projeto],\"<=\" & 31,TBCompras[Até],\">=\"& 31,TBCompras[Meta:Atividade],LEFT(B60,FIND(\" \",B60,1)-1),TBCompras[Tipo de Material],\"CONSUMO\")","v":0},{"$f":"SUMIFS(TBCompras[Valor Total Item (R$)],TBCompras[Mês do Projeto],\"<=\" & 32,TBCompras[Até],\">=\"& 32,TBCompras[Meta:Atividade],LEFT(B60,FIND(\" \",B60,1)-1),TBCompras[Tipo de Material],\"CONSUMO\")","v":0},{"$f":"SUMIFS(TBCompras[Valor Total Item (R$)],TBCompras[Mês do Projeto],\"<=\" & 33,TBCompras[Até],\">=\"& 33,TBCompras[Meta:Atividade],LEFT(B60,FIND(\" \",B60,1)-1),TBCompras[Tipo de Material],\"CONSUMO\")","v":0},{"$f":"SUMIFS(TBCompras[Valor Total Item (R$)],TBCompras[Mês do Projeto],\"<=\" & 34,TBCompras[Até],\">=\"& 34,TBCompras[Meta:Atividade],LEFT(B60,FIND(\" \",B60,1)-1),TBCompras[Tipo de Material],\"CONSUMO\")","v":0},{"$f":"SUMIFS(TBCompras[Valor Total Item (R$)],TBCompras[Mês do Projeto],\"<=\" & 35,TBCompras[Até],\">=\"& 35,TBCompras[Meta:Atividade],LEFT(B60,FIND(\" \",B60,1)-1),TBCompras[Tipo de Material],\"CONSUMO\")","v":0},{"$f":"SUMIFS(TBCompras[Valor Total Item (R$)],TBCompras[Mês do Projeto],\"<=\" & 36,TBCompras[Até],\">=\"& 36,TBCompras[Meta:Atividade],LEFT(B60,FIND(\" \",B60,1)-1),TBCompras[Tipo de Material],\"CONSUMO\")","v":0},0]
[null,null,"Equipamentos",{"$f":"SUMIFS(TBCompras[Valor Total Item (R$)],TBCompras[Mês do Projeto],\"<=\" & 1,TBCompras[Até],\">=\"& 1,TBCompras[Meta:Atividade],LEFT(B60,FIND(\" \",B60,1)-1),TBCompras[Tipo de Material],\"EQUIPAMENTO\")","v":0},{"$f":"SUMIFS(TBCompras[Valor Total Item (R$)],TBCompras[Mês do Projeto],\"<=\" & 2,TBCompras[Até],\">=\"& 2,TBCompras[Meta:Atividade],LEFT(B60,FIND(\" \",B60,1)-1),TBCompras[Tipo de Material],\"EQUIPAMENTO\")","v":0},{"$f":"SUMIFS(TBCompras[Valor Total Item (R$)],TBCompras[Mês do Projeto],\"<=\" & 3,TBCompras[Até],\">=\"& 3,TBCompras[Meta:Atividade],LEFT(B60,FIND(\" \",B60,1)-1),TBCompras[Tipo de Material],\"EQUIPAMENTO\")","v":0},{"$f":"SUMIFS(TBCompras[Valor Total Item (R$)],TBCompras[Mês do Projeto],\"<=\" & 4,TBCompras[Até],\">=\"& 4,TBCompras[Meta:Atividade],LEFT(B60,FIND(\" \",B60,1)-1),TBCompras[Tipo de Material],\"EQUIPAMENTO\")","v":0},{"$f":"SUMIFS(TBCompras[Valor Total Item (R$)],TBCompras[Mês do Projeto],\"<=\" & 5,TBCompras[Até],\">=\"& 5,TBCompras[Meta:Atividade],LEFT(B60,FIND(\" \",B60,1)-1),TBCompras[Tipo de Material],\"EQUIPAMENTO\")","v":0},{"$f":"SUMIFS(TBCompras[Valor Total Item (R$)],TBCompras[Mês do Projeto],\"<=\" & 6,TBCompras[Até],\">=\"& 6,TBCompras[Meta:Atividade],LEFT(B60,FIND(\" \",B60,1)-1),TBCompras[Tipo de Material],\"EQUIPAMENTO\")","v":0},{"$f":"SUMIFS(TBCompras[Valor Total Item (R$)],TBCompras[Mês do Projeto],\"<=\" & 7,TBCompras[Até],\">=\"& 7,TBCompras[Meta:Atividade],LEFT(B60,FIND(\" \",B60,1)-1),TBCompras[Tipo de Material],\"EQUIPAMENTO\")","v":0},{"$f":"SUMIFS(TBCompras[Valor Total Item (R$)],TBCompras[Mês do Projeto],\"<=\" & 8,TBCompras[Até],\">=\"& 8,TBCompras[Meta:Atividade],LEFT(B60,FIND(\" \",B60,1)-1),TBCompras[Tipo de Material],\"EQUIPAMENTO\")","v":0},{"$f":"SUMIFS(TBCompras[Valor Total Item (R$)],TBCompras[Mês do Projeto],\"<=\" & 9,TBCompras[Até],\">=\"& 9,TBCompras[Meta:Atividade],LEFT(B60,FIND(\" \",B60,1)-1),TBCompras[Tipo de Material],\"EQUIPAMENTO\")","v":0},{"$f":"SUMIFS(TBCompras[Valor Total Item (R$)],TBCompras[Mês do Projeto],\"<=\" & 10,TBCompras[Até],\">=\"& 10,TBCompras[Meta:Atividade],LEFT(B60,FIND(\" \",B60,1)-1),TBCompras[Tipo de Material],\"EQUIPAMENTO\")","v":0},{"$f":"SUMIFS(TBCompras[Valor Total Item (R$)],TBCompras[Mês do Projeto],\"<=\" & 11,TBCompras[Até],\">=\"& 11,TBCompras[Meta:Atividade],LEFT(B60,FIND(\" \",B60,1)-1),TBCompras[Tipo de Material],\"EQUIPAMENTO\")","v":0},{"$f":"SUMIFS(TBCompras[Valor Total Item (R$)],TBCompras[Mês do Projeto],\"<=\" & 12,TBCompras[Até],\">=\"& 12,TBCompras[Meta:Atividade],LEFT(B60,FIND(\" \",B60,1)-1),TBCompras[Tipo de Material],\"EQUIPAMENTO\")","v":0},{"$f":"SUMIFS(TBCompras[Valor Total Item (R$)],TBCompras[Mês do Projeto],\"<=\" & 13,TBCompras[Até],\">=\"& 13,TBCompras[Meta:Atividade],LEFT(B60,FIND(\" \",B60,1)-1),TBCompras[Tipo de Material],\"EQUIPAMENTO\")","v":0},{"$f":"SUMIFS(TBCompras[Valor Total Item (R$)],TBCompras[Mês do Projeto],\"<=\" & 14,TBCompras[Até],\">=\"& 14,TBCompras[Meta:Atividade],LEFT(B60,FIND(\" \",B60,1)-1),TBCompras[Tipo de Material],\"EQUIPAMENTO\")","v":0},{"$f":"SUMIFS(TBCompras[Valor Total Item (R$)],TBCompras[Mês do Projeto],\"<=\" & 15,TBCompras[Até],\">=\"& 15,TBCompras[Meta:Atividade],LEFT(B60,FIND(\" \",B60,1)-1),TBCompras[Tipo de Material],\"EQUIPAMENTO\")","v":0},{"$f":"SUMIFS(TBCompras[Valor Total Item (R$)],TBCompras[Mês do Projeto],\"<=\" & 16,TBCompras[Até],\">=\"& 16,TBCompras[Meta:Atividade],LEFT(B60,FIND(\" \",B60,1)-1),TBCompras[Tipo de Material],\"EQUIPAMENTO\")","v":0},{"$f":"SUMIFS(TBCompras[Valor Total Item (R$)],TBCompras[Mês do Projeto],\"<=\" & 17,TBCompras[Até],\">=\"& 17,TBCompras[Meta:Atividade],LEFT(B60,FIND(\" \",B60,1)-1),TBCompras[Tipo de Material],\"EQUIPAMENTO\")","v":0},{"$f":"SUMIFS(TBCompras[Valor Total Item (R$)],TBCompras[Mês do Projeto],\"<=\" & 18,TBCompras[Até],\">=\"& 18,TBCompras[Meta:Atividade],LEFT(B60,FIND(\" \",B60,1)-1),TBCompras[Tipo de Material],\"EQUIPAMENTO\")","v":0},{"$f":"SUMIFS(TBCompras[Valor Total Item (R$)],TBCompras[Mês do Projeto],\"<=\" & 19,TBCompras[Até],\">=\"& 19,TBCompras[Meta:Atividade],LEFT(B60,FIND(\" \",B60,1)-1),TBCompras[Tipo de Material],\"EQUIPAMENTO\")","v":0},{"$f":"SUMIFS(TBCompras[Valor Total Item (R$)],TBCompras[Mês do Projeto],\"<=\" & 20,TBCompras[Até],\">=\"& 20,TBCompras[Meta:Atividade],LEFT(B60,FIND(\" \",B60,1)-1),TBCompras[Tipo de Material],\"EQUIPAMENTO\")","v":0},{"$f":"SUMIFS(TBCompras[Valor Total Item (R$)],TBCompras[Mês do Projeto],\"<=\" & 21,TBCompras[Até],\">=\"& 21,TBCompras[Meta:Atividade],LEFT(B60,FIND(\" \",B60,1)-1),TBCompras[Tipo de Material],\"EQUIPAMENTO\")","v":0},{"$f":"SUMIFS(TBCompras[Valor Total Item (R$)],TBCompras[Mês do Projeto],\"<=\" & 22,TBCompras[Até],\">=\"& 22,TBCompras[Meta:Atividade],LEFT(B60,FIND(\" \",B60,1)-1),TBCompras[Tipo de Material],\"EQUIPAMENTO\")","v":0},{"$f":"SUMIFS(TBCompras[Valor Total Item (R$)],TBCompras[Mês do Projeto],\"<=\" & 23,TBCompras[Até],\">=\"& 23,TBCompras[Meta:Atividade],LEFT(B60,FIND(\" \",B60,1)-1),TBCompras[Tipo de Material],\"EQUIPAMENTO\")","v":0},{"$f":"SUMIFS(TBCompras[Valor Total Item (R$)],TBCompras[Mês do Projeto],\"<=\" & 24,TBCompras[Até],\">=\"& 24,TBCompras[Meta:Atividade],LEFT(B60,FIND(\" \",B60,1)-1),TBCompras[Tipo de Material],\"EQUIPAMENTO\")","v":0},{"$f":"SUMIFS(TBCompras[Valor Total Item (R$)],TBCompras[Mês do Projeto],\"<=\" & 25,TBCompras[Até],\">=\"& 25,TBCompras[Meta:Atividade],LEFT(B60,FIND(\" \",B60,1)-1),TBCompras[Tipo de Material],\"EQUIPAMENTO\")","v":0},{"$f":"SUMIFS(TBCompras[Valor Total Item (R$)],TBCompras[Mês do Projeto],\"<=\" & 26,TBCompras[Até],\">=\"& 26,TBCompras[Meta:Atividade],LEFT(B60,FIND(\" \",B60,1)-1),TBCompras[Tipo de Material],\"EQUIPAMENTO\")","v":0},{"$f":"SUMIFS(TBCompras[Valor Total Item (R$)],TBCompras[Mês do Projeto],\"<=\" & 27,TBCompras[Até],\">=\"& 27,TBCompras[Meta:Atividade],LEFT(B60,FIND(\" \",B60,1)-1),TBCompras[Tipo de Material],\"EQUIPAMENTO\")","v":0},{"$f":"SUMIFS(TBCompras[Valor Total Item (R$)],TBCompras[Mês do Projeto],\"<=\" & 28,TBCompras[Até],\">=\"& 28,TBCompras[Meta:Atividade],LEFT(B60,FIND(\" \",B60,1)-1),TBCompras[Tipo de Material],\"EQUIPAMENTO\")","v":0},{"$f":"SUMIFS(TBCompras[Valor Total Item (R$)],TBCompras[Mês do Projeto],\"<=\" & 29,TBCompras[Até],\">=\"& 29,TBCompras[Meta:Atividade],LEFT(B60,FIND(\" \",B60,1)-1),TBCompras[Tipo de Material],\"EQUIPAMENTO\")","v":0},{"$f":"SUMIFS(TBCompras[Valor Total Item (R$)],TBCompras[Mês do Projeto],\"<=\" & 30,TBCompras[Até],\">=\"& 30,TBCompras[Meta:Atividade],LEFT(B60,FIND(\" \",B60,1)-1),TBCompras[Tipo de Material],\"EQUIPAMENTO\")","v":0},{"$f":"SUMIFS(TBCompras[Valor Total Item (R$)],TBCompras[Mês do Projeto],\"<=\" & 31,TBCompras[Até],\">=\"& 31,TBCompras[Meta:Atividade],LEFT(B60,FIND(\" \",B60,1)-1),TBCompras[Tipo de Material],\"EQUIPAMENTO\")","v":0},{"$f":"SUMIFS(TBCompras[Valor Total Item (R$)],TBCompras[Mês do Projeto],\"<=\" & 32,TBCompras[Até],\">=\"& 32,TBCompras[Meta:Atividade],LEFT(B60,FIND(\" \",B60,1)-1),TBCompras[Tipo de Material],\"EQUIPAMENTO\")","v":0},{"$f":"SUMIFS(TBCompras[Valor Total Item (R$)],TBCompras[Mês do Projeto],\"<=\" & 33,TBCompras[Até],\">=\"& 33,TBCompras[Meta:Atividade],LEFT(B60,FIND(\" \",B60,1)-1),TBCompras[Tipo de Material],\"EQUIPAMENTO\")","v":0},{"$f":"SUMIFS(TBCompras[Valor Total Item (R$)],TBCompras[Mês do Projeto],\"<=\" & 34,TBCompras[Até],\">=\"& 34,TBCompras[Meta:Atividade],LEFT(B60,FIND(\" \",B60,1)-1),TBCompras[Tipo de Material],\"EQUIPAMENTO\")","v":0},{"$f":"SUMIFS(TBCompras[Valor Total Item (R$)],TBCompras[Mês do Projeto],\"<=\" & 35,TBCompras[Até],\">=\"& 35,TBCompras[Meta:Atividade],LEFT(B60,FIND(\" \",B60,1)-1),TBCompras[Tipo de Material],\"EQUIPAMENTO\")","v":0},{"$f":"SUMIFS(TBCompras[Valor Total Item (R$)],TBCompras[Mês do Projeto],\"<=\" & 36,TBCompras[Até],\">=\"& 36,TBCompras[Meta:Atividade],LEFT(B60,FIND(\" \",B60,1)-1),TBCompras[Tipo de Material],\"EQUIPAMENTO\")","v":0},0]
[null,null,"Total Atividade 4.2",{"$f":"SUBTOTAL(9,D60:D65)","v":0},0,0,0,0,0,0,0,0,0,0,0,0,0,0,0,0,0,0,0,0,0,0,0,0,0,0,0,0,0,0,0,0,0,0,0,0]
[null,"Total da Meta 4",null,{"$f":"SUBTOTAL(9,D53:D66)","v":0},0,0,0,0,0,0,0,0,0,0,0,0,0,0,0,0,0,0,0,0,0,0,0,0,0,0,0,0,0,0,0,0,0,0,0,0]
["Meta 5 - Produção e controle de qualidade Lote Piloto Fase I","5.1 - Estudo de viabilidade técnica e econômica entre as abordagens vacinais em desenvolvimento","Pessoa Física",{"$f":"SUMIFS(TbPessoas[Custo Total Mensal],TbPessoas[A partir do mês],\"<=\" & 1,TbPessoas[Até],\">=\"& 1,TbPessoas[Meta:Atividade],LEFT(B68,FIND(\" \",B68,1)-1))","v":0},{"$f":"SUMIFS(TbPessoas[Custo Total Mensal],TbPessoas[A partir do mês],\"<=\" & 2,TbPessoas[Até],\">=\"& 2,TbPessoas[Meta:Atividade],LEFT(B68,FIND(\" \",B68,1)-1))","v":0},{"$f":"SUMIFS(TbPessoas[Custo Total Mensal],TbPessoas[A partir do mês],\"<=\" & 3,TbPessoas[Até],\">=\"& 3,TbPessoas[Meta:Atividade],LEFT(B68,FIND(\" \",B68,1)-1))","v":0},{"$f":"SUMIFS(TbPessoas[Custo Total Mensal],TbPessoas[A partir do mês],\"<=\" & 4,TbPessoas[Até],\">=\"& 4,TbPessoas[Meta:Atividade],LEFT(B68,FIND(\" \",B68,1)-1))","v":0},{"$f":"SUMIFS(TbPessoas[Custo Total Mensal],TbPessoas[A partir do mês],\"<=\" & 5,TbPessoas[Até],\">=\"& 5,TbPessoas[Meta:Atividade],LEFT(B68,FIND(\" \",B68,1)-1))","v":0},{"$f":"SUMIFS(TbPessoas[Custo Total Mensal],TbPessoas[A partir do mês],\"<=\" & 6,TbPessoas[Até],\">=\"& 6,TbPessoas[Meta:Atividade],LEFT(B68,FIND(\" \",B68,1)-1))","v":0},{"$f":"SUMIFS(TbPessoas[Custo Total Mensal],TbPessoas[A partir do mês],\"<=\" & 7,TbPessoas[Até],\">=\"& 7,TbPessoas[Meta:Atividade],LEFT(B68,FIND(\" \",B68,1)-1))","v":0},{"$f":"SUMIFS(TbPessoas[Custo Total Mensal],TbPessoas[A partir do mês],\"<=\" & 8,TbPessoas[Até],\">=\"& 8,TbPessoas[Meta:Atividade],LEFT(B68,FIND(\" \",B68,1)-1))","v":0},{"$f":"SUMIFS(TbPessoas[Custo Total Mensal],TbPessoas[A partir do mês],\"<=\" & 9,TbPessoas[Até],\">=\"& 9,TbPessoas[Meta:Atividade],LEFT(B68,FIND(\" \",B68,1)-1))","v":0},{"$f":"SUMIFS(TbPessoas[Custo Total Mensal],TbPessoas[A partir do mês],\"<=\" & 10,TbPessoas[Até],\">=\"& 10,TbPessoas[Meta:Atividade],LEFT(B68,FIND(\" \",B68,1)-1))","v":0},{"$f":"SUMIFS(TbPessoas[Custo Total Mensal],TbPessoas[A partir do mês],\"<=\" & 11,TbPessoas[Até],\">=\"& 11,TbPessoas[Meta:Atividade],LEFT(B68,FIND(\" \",B68,1)-1))","v":0},{"$f":"SUMIFS(TbPessoas[Custo Total Mensal],TbPessoas[A partir do mês],\"<=\" & 12,TbPessoas[Até],\">=\"& 12,TbPessoas[Meta:Atividade],LEFT(B68,FIND(\" \",B68,1)-1))","v":0},{"$f":"SUMIFS(TbPessoas[Custo Total Mensal],TbPessoas[A partir do mês],\"<=\" & 13,TbPessoas[Até],\">=\"& 13,TbPessoas[Meta:Atividade],LEFT(B68,FIND(\" \",B68,1)-1))","v":0},{"$f":"SUMIFS(TbPessoas[Custo Total Mensal],TbPessoas[A partir do mês],\"<=\" & 14,TbPessoas[Até],\">=\"& 14,TbPessoas[Meta:Atividade],LEFT(B68,FIND(\" \",B68,1)-1))","v":0},{"$f":"SUMIFS(TbPessoas[Custo Total Mensal],TbPessoas[A partir do mês],\"<=\" & 15,TbPessoas[Até],\">=\"& 15,TbPessoas[Meta:Atividade],LEFT(B68,FIND(\" \",B68,1)-1))","v":0},{"$f":"SUMIFS(TbPessoas[Custo Total Mensal],TbPessoas[A partir do mês],\"<=\" & 16,TbPessoas[Até],\">=\"& 16,TbPessoas[Meta:Atividade],LEFT(B68,FIND(\" \",B68,1)-1))","v":0},{"$f":"SUMIFS(TbPessoas[Custo Total Mensal],TbPessoas[A partir do mês],\"<=\" & 17,TbPessoas[Até],\">=\"& 17,TbPessoas[Meta:Atividade],LEFT(B68,FIND(\" \",B68,1)-1))","v":0},{"$f":"SUMIFS(TbPessoas[Custo Total Mensal],TbPessoas[A partir do mês],\"<=\" & 18,TbPessoas[Até],\">=\"& 18,TbPessoas[Meta:Atividade],LEFT(B68,FIND(\" \",B68,1)-1))","v":0},{"$f":"SUMIFS(TbPessoas[Custo Total Mensal],TbPessoas[A partir do mês],\"<=\" & 19,TbPessoas[Até],\">=\"& 19,TbPessoas[Meta:Atividade],LEFT(B68,FIND(\" \",B68,1)-1))","v":0},{"$f":"SUMIFS(TbPessoas[Custo Total Mensal],TbPessoas[A partir do mês],\"<=\" & 20,TbPessoas[Até],\">=\"& 20,TbPessoas[Meta:Atividade],LEFT(B68,FIND(\" \",B68,1)-1))","v":0},{"$f":"SUMIFS(TbPessoas[Custo Total Mensal],TbPessoas[A partir do mês],\"<=\" & 21,TbPessoas[Até],\">=\"& 21,TbPessoas[Meta:Atividade],LEFT(B68,FIND(\" \",B68,1)-1))","v":0},{"$f":"SUMIFS(TbPessoas[Custo Total Mensal],TbPessoas[A partir do mês],\"<=\" & 22,TbPessoas[Até],\">=\"& 22,TbPessoas[Meta:Atividade],LEFT(B68,FIND(\" \",B68,1)-1))","v":0},{"$f":"SUMIFS(TbPessoas[Custo Total Mensal],TbPessoas[A partir do mês],\"<=\" & 23,TbPessoas[Até],\">=\"& 23,TbPessoas[Meta:Atividade],LEFT(B68,FIND(\" \",B68,1)-1))","v":0},{"$f":"SUMIFS(TbPessoas[Custo Total Mensal],TbPessoas[A partir do mês],\"<=\" & 24,TbPessoas[Até],\">=\"& 24,TbPessoas[Meta:Atividade],LEFT(B68,FIND(\" \",B68,1)-1))","v":0},{"$f":"SUMIFS(TbPessoas[Custo Total Mensal],TbPessoas[A partir do mês],\"<=\" & 25,TbPessoas[Até],\">=\"& 25,TbPessoas[Meta:Atividade],LEFT(B68,FIND(\" \",B68,1)-1))","v":0},{"$f":"SUMIFS(TbPessoas[Custo Total Mensal],TbPessoas[A partir do mês],\"<=\" & 26,TbPessoas[Até],\">=\"& 26,TbPessoas[Meta:Atividade],LEFT(B68,FIND(\" \",B68,1)-1))","v":0},{"$f":"SUMIFS(TbPessoas[Custo Total Mensal],TbPessoas[A partir do mês],\"<=\" & 27,TbPessoas[Até],\">=\"& 27,TbPessoas[Meta:Atividade],LEFT(B68,FIND(\" \",B68,1)-1))","v":0},{"$f":"SUMIFS(TbPessoas[Custo Total Mensal],TbPessoas[A partir do mês],\"<=\" & 28,TbPessoas[Até],\">=\"& 28,TbPessoas[Meta:Atividade],LEFT(B68,FIND(\" \",B68,1)-1))","v":0},{"$f":"SUMIFS(TbPessoas[Custo Total Mensal],TbPessoas[A partir do mês],\"<=\" & 29,TbPessoas[Até],\">=\"& 29,TbPessoas[Meta:Atividade],LEFT(B68,FIND(\" \",B68,1)-1))","v":0},{"$f":"SUMIFS(TbPessoas[Custo Total Mensal],TbPessoas[A partir do mês],\"<=\" & 30,TbPessoas[Até],\">=\"& 30,TbPessoas[Meta:Atividade],LEFT(B68,FIND(\" \",B68,1)-1))","v":0},{"$f":"SUMIFS(TbPessoas[Custo Total Mensal],TbPessoas[A partir do mês],\"<=\" & 31,TbPessoas[Até],\">=\"& 31,TbPessoas[Meta:Atividade],LEFT(B68,FIND(\" \",B68,1)-1))","v":0},{"$f":"SUMIFS(TbPessoas[Custo Total Mensal],TbPessoas[A partir do mês],\"<=\" & 32,TbPessoas[Até],\">=\"& 32,TbPessoas[Meta:Atividade],LEFT(B68,FIND(\" \",B68,1)-1))","v":0},{"$f":"SUMIFS(TbPessoas[Custo Total Mensal],TbPessoas[A partir do mês],\"<=\" & 33,TbPessoas[Até],\">=\"& 33,TbPessoas[Meta:Atividade],LEFT(B68,FIND(\" \",B68,1)-1))","v":0},{"$f":"SUMIFS(TbPessoas[Custo Total Mensal],TbPessoas[A partir do mês],\"<=\" & 34,TbPessoas[Até],\">=\"& 34,TbPessoas[Meta:Atividade],LEFT(B68,FIND(\" \",B68,1)-1))","v":0},{"$f":"SUMIFS(TbPessoas[Custo Total Mensal],TbPessoas[A partir do mês],\"<=\" & 35,TbPessoas[Até],\">=\"& 35,TbPessoas[Meta:Atividade],LEFT(B68,FIND(\" \",B68,1)-1))","v":0},{"$f":"SUMIFS(TbPessoas[Custo Total Mensal],TbPessoas[A partir do mês],\"<=\" & 36,TbPessoas[Até],\">=\"& 36,TbPessoas[Meta:Atividade],LEFT(B68,FIND(\" \",B68,1)-1))","v":0},{"$f":"SUM(D68:AM68)","v":0}]
[null,null,"Pessoa Jurídica",{"$f":"SUMIFS(TBCompras[Valor Total Item (R$)],TBCompras[Mês do Projeto],\"<=\" & 1,TBCompras[Até],\">=\"& 1,TBCompras[Meta:Atividade],LEFT(B68,FIND(\" \",B68,1)-1),TBCompras[Tipo de Material],\"SERVIÇO\")","v":0},{"$f":"SUMIFS(TBCompras[Valor Total Item (R$)],TBCompras[Mês do Projeto],\"<=\" & 2,TBCompras[Até],\">=\"& 2,TBCompras[Meta:Atividade],LEFT(B68,FIND(\" \",B68,1)-1),TBCompras[Tipo de Material],\"SERVIÇO\")","v":0},{"$f":"SUMIFS(TBCompras[Valor Total Item (R$)],TBCompras[Mês do Projeto],\"<=\" & 3,TBCompras[Até],\">=\"& 3,TBCompras[Meta:Atividade],LEFT(B68,FIND(\" \",B68,1)-1),TBCompras[Tipo de Material],\"SERVIÇO\")","v":0},{"$f":"SUMIFS(TBCompras[Valor Total Item (R$)],TBCompras[Mês do Projeto],\"<=\" & 4,TBCompras[Até],\">=\"& 4,TBCompras[Meta:Atividade],LEFT(B68,FIND(\" \",B68,1)-1),TBCompras[Tipo de Material],\"SERVIÇO\")","v":0},{"$f":"SUMIFS(TBCompras[Valor Total Item (R$)],TBCompras[Mês do Projeto],\"<=\" & 5,TBCompras[Até],\">=\"& 5,TBCompras[Meta:Atividade],LEFT(B68,FIND(\" \",B68,1)-1),TBCompras[Tipo de Material],\"SERVIÇO\")","v":0},{"$f":"SUMIFS(TBCompras[Valor Total Item (R$)],TBCompras[Mês do Projeto],\"<=\" & 6,TBCompras[Até],\">=\"& 6,TBCompras[Meta:Atividade],LEFT(B68,FIND(\" \",B68,1)-1),TBCompras[Tipo de Material],\"SERVIÇO\")","v":0},{"$f":"SUMIFS(TBCompras[Valor Total Item (R$)],TBCompras[Mês do Projeto],\"<=\" & 7,TBCompras[Até],\">=\"& 7,TBCompras[Meta:Atividade],LEFT(B68,FIND(\" \",B68,1)-1),TBCompras[Tipo de Material],\"SERVIÇO\")","v":0},{"$f":"SUMIFS(TBCompras[Valor Total Item (R$)],TBCompras[Mês do Projeto],\"<=\" & 8,TBCompras[Até],\">=\"& 8,TBCompras[Meta:Atividade],LEFT(B68,FIND(\" \",B68,1)-1),TBCompras[Tipo de Material],\"SERVIÇO\")","v":0},{"$f":"SUMIFS(TBCompras[Valor Total Item (R$)],TBCompras[Mês do Projeto],\"<=\" & 9,TBCompras[Até],\">=\"& 9,TBCompras[Meta:Atividade],LEFT(B68,FIND(\" \",B68,1)-1),TBCompras[Tipo de Material],\"SERVIÇO\")","v":0},{"$f":"SUMIFS(TBCompras[Valor Total Item (R$)],TBCompras[Mês do Projeto],\"<=\" & 10,TBCompras[Até],\">=\"& 10,TBCompras[Meta:Atividade],LEFT(B68,FIND(\" \",B68,1)-1),TBCompras[Tipo de Material],\"SERVIÇO\")","v":0},{"$f":"SUMIFS(TBCompras[Valor Total Item (R$)],TBCompras[Mês do Projeto],\"<=\" & 11,TBCompras[Até],\">=\"& 11,TBCompras[Meta:Atividade],LEFT(B68,FIND(\" \",B68,1)-1),TBCompras[Tipo de Material],\"SERVIÇO\")","v":0},{"$f":"SUMIFS(TBCompras[Valor Total Item (R$)],TBCompras[Mês do Projeto],\"<=\" & 12,TBCompras[Até],\">=\"& 12,TBCompras[Meta:Atividade],LEFT(B68,FIND(\" \",B68,1)-1),TBCompras[Tipo de Material],\"SERVIÇO\")","v":0},{"$f":"SUMIFS(TBCompras[Valor Total Item (R$)],TBCompras[Mês do Projeto],\"<=\" & 13,TBCompras[Até],\">=\"& 13,TBCompras[Meta:Atividade],LEFT(B68,FIND(\" \",B68,1)-1),TBCompras[Tipo de Material],\"SERVIÇO\")","v":0},{"$f":"SUMIFS(TBCompras[Valor Total Item (R$)],TBCompras[Mês do Projeto],\"<=\" & 14,TBCompras[Até],\">=\"& 14,TBCompras[Meta:Atividade],LEFT(B68,FIND(\" \",B68,1)-1),TBCompras[Tipo de Material],\"SERVIÇO\")","v":0},{"$f":"SUMIFS(TBCompras[Valor Total Item (R$)],TBCompras[Mês do Projeto],\"<=\" & 15,TBCompras[Até],\">=\"& 15,TBCompras[Meta:Atividade],LEFT(B68,FIND(\" \",B68,1)-1),TBCompras[Tipo de Material],\"SERVIÇO\")","v":0},{"$f":"SUMIFS(TBCompras[Valor Total Item (R$)],TBCompras[Mês do Projeto],\"<=\" & 16,TBCompras[Até],\">=\"& 16,TBCompras[Meta:Atividade],LEFT(B68,FIND(\" \",B68,1)-1),TBCompras[Tipo de Material],\"SERVIÇO\")","v":0},{"$f":"SUMIFS(TBCompras[Valor Total Item (R$)],TBCompras[Mês do Projeto],\"<=\" & 17,TBCompras[Até],\">=\"& 17,TBCompras[Meta:Atividade],LEFT(B68,FIND(\" \",B68,1)-1),TBCompras[Tipo de Material],\"SERVIÇO\")","v":0},{"$f":"SUMIFS(TBCompras[Valor Total Item (R$)],TBCompras[Mês do Projeto],\"<=\" & 18,TBCompras[Até],\">=\"& 18,TBCompras[Meta:Atividade],LEFT(B68,FIND(\" \",B68,1)-1),TBCompras[Tipo de Material],\"SERVIÇO\")","v":0},{"$f":"SUMIFS(TBCompras[Valor Total Item (R$)],TBCompras[Mês do Projeto],\"<=\" & 19,TBCompras[Até],\">=\"& 19,TBCompras[Meta:Atividade],LEFT(B68,FIND(\" \",B68,1)-1),TBCompras[Tipo de Material],\"SERVIÇO\")","v":0},{"$f":"SUMIFS(TBCompras[Valor Total Item (R$)],TBCompras[Mês do Projeto],\"<=\" & 20,TBCompras[Até],\">=\"& 20,TBCompras[Meta:Atividade],LEFT(B68,FIND(\" \",B68,1)-1),TBCompras[Tipo de Material],\"SERVIÇO\")","v":0},{"$f":"SUMIFS(TBCompras[Valor Total Item (R$)],TBCompras[Mês do Projeto],\"<=\" & 21,TBCompras[Até],\">=\"& 21,TBCompras[Meta:Atividade],LEFT(B68,FIND(\" \",B68,1)-1),TBCompras[Tipo de Material],\"SERVIÇO\")","v":0},{"$f":"SUMIFS(TBCompras[Valor Total Item (R$)],TBCompras[Mês do Projeto],\"<=\" & 22,TBCompras[Até],\">=\"& 22,TBCompras[Meta:Atividade],LEFT(B68,FIND(\" \",B68,1)-1),TBCompras[Tipo de Material],\"SERVIÇO\")","v":0},{"$f":"SUMIFS(TBCompras[Valor Total Item (R$)],TBCompras[Mês do Projeto],\"<=\" & 23,TBCompras[Até],\">=\"& 23,TBCompras[Meta:Atividade],LEFT(B68,FIND(\" \",B68,1)-1),TBCompras[Tipo de Material],\"SERVIÇO\")","v":0},{"$f":"SUMIFS(TBCompras[Valor Total Item (R$)],TBCompras[Mês do Projeto],\"<=\" & 24,TBCompras[Até],\">=\"& 24,TBCompras[Meta:Atividade],LEFT(B68,FIND(\" \",B68,1)-1),TBCompras[Tipo de Material],\"SERVIÇO\")","v":0},{"$f":"SUMIFS(TBCompras[Valor Total Item (R$)],TBCompras[Mês do Projeto],\"<=\" & 25,TBCompras[Até],\">=\"& 25,TBCompras[Meta:Atividade],LEFT(B68,FIND(\" \",B68,1)-1),TBCompras[Tipo de Material],\"SERVIÇO\")","v":0},{"$f":"SUMIFS(TBCompras[Valor Total Item (R$)],TBCompras[Mês do Projeto],\"<=\" & 26,TBCompras[Até],\">=\"& 26,TBCompras[Meta:Atividade],LEFT(B68,FIND(\" \",B68,1)-1),TBCompras[Tipo de Material],\"SERVIÇO\")","v":0},{"$f":"SUMIFS(TBCompras[Valor Total Item (R$)],TBCompras[Mês do Projeto],\"<=\" & 27,TBCompras[Até],\">=\"& 27,TBCompras[Meta:Atividade],LEFT(B68,FIND(\" \",B68,1)-1),TBCompras[Tipo de Material],\"SERVIÇO\")","v":0},{"$f":"SUMIFS(TBCompras[Valor Total Item (R$)],TBCompras[Mês do Projeto],\"<=\" & 28,TBCompras[Até],\">=\"& 28,TBCompras[Meta:Atividade],LEFT(B68,FIND(\" \",B68,1)-1),TBCompras[Tipo de Material],\"SERVIÇO\")","v":0},{"$f":"SUMIFS(TBCompras[Valor Total Item (R$)],TBCompras[Mês do Projeto],\"<=\" & 29,TBCompras[Até],\">=\"& 29,TBCompras[Meta:Atividade],LEFT(B68,FIND(\" \",B68,1)-1),TBCompras[Tipo de Material],\"SERVIÇO\")","v":0},{"$f":"SUMIFS(TBCompras[Valor Total Item (R$)],TBCompras[Mês do Projeto],\"<=\" & 30,TBCompras[Até],\">=\"& 30,TBCompras[Meta:Atividade],LEFT(B68,FIND(\" \",B68,1)-1),TBCompras[Tipo de Material],\"SERVIÇO\")","v":0},{"$f":"SUMIFS(TBCompras[Valor Total Item (R$)],TBCompras[Mês do Projeto],\"<=\" & 31,TBCompras[Até],\">=\"& 31,TBCompras[Meta:Atividade],LEFT(B68,FIND(\" \",B68,1)-1),TBCompras[Tipo de Material],\"SERVIÇO\")","v":0},{"$f":"SUMIFS(TBCompras[Valor Total Item (R$)],TBCompras[Mês do Projeto],\"<=\" & 32,TBCompras[Até],\">=\"& 32,TBCompras[Meta:Atividade],LEFT(B68,FIND(\" \",B68,1)-1),TBCompras[Tipo de Material],\"SERVIÇO\")","v":0},{"$f":"SUMIFS(TBCompras[Valor Total Item (R$)],TBCompras[Mês do Projeto],\"<=\" & 33,TBCompras[Até],\">=\"& 33,TBCompras[Meta:Atividade],LEFT(B68,FIND(\" \",B68,1)-1),TBCompras[Tipo de Material],\"SERVIÇO\")","v":0},{"$f":"SUMIFS(TBCompras[Valor Total Item (R$)],TBCompras[Mês do Projeto],\"<=\" & 34,TBCompras[Até],\">=\"& 34,TBCompras[Meta:Atividade],LEFT(B68,FIND(\" \",B68,1)-1),TBCompras[Tipo de Material],\"SERVIÇO\")","v":0},{"$f":"SUMIFS(TBCompras[Valor Total Item (R$)],TBCompras[Mês do Projeto],\"<=\" & 35,TBCompras[Até],\">=\"& 35,TBCompras[Meta:Atividade],LEFT(B68,FIND(\" \",B68,1)-1),TBCompras[Tipo de Material],\"SERVIÇO\")","v":0},{"$f":"SUMIFS(TBCompras[Valor Total Item (R$)],TBCompras[Mês do Projeto],\"<=\" & 36,TBCompras[Até],\">=\"& 36,TBCompras[Meta:Atividade],LEFT(B68,FIND(\" \",B68,1)-1),TBCompras[Tipo de Material],\"SERVIÇO\")","v":0},0]
[null,null,"Passagens",{"$f":"SUMIFS(TbPassagens[Valor Total Passagem],TbPassagens[A partir do mês],\"<=\" & 1,TbPassagens[Até],\">=\"& 1,TbPassagens[Meta:Atividade],LEFT(B68,FIND(\" \",B68,1)-1))","v":0},{"$f":"SUMIFS(TbPassagens[Valor Total Passagem],TbPassagens[A partir do mês],\"<=\" & 2,TbPassagens[Até],\">=\"& 2,TbPassagens[Meta:Atividade],LEFT(B68,FIND(\" \",B68,1)-1))","v":0},{"$f":"SUMIFS(TbPassagens[Valor Total Passagem],TbPassagens[A partir do mês],\"<=\" & 3,TbPassagens[Até],\">=\"& 3,TbPassagens[Meta:Atividade],LEFT(B68,FIND(\" \",B68,1)-1))","v":0},{"$f":"SUMIFS(TbPassagens[Valor Total Passagem],TbPassagens[A partir do mês],\"<=\" & 4,TbPassagens[Até],\">=\"& 4,TbPassagens[Meta:Atividade],LEFT(B68,FIND(\" \",B68,1)-1))","v":0},{"$f":"SUMIFS(TbPassagens[Valor Total Passagem],TbPassagens[A partir do mês],\"<=\" & 5,TbPassagens[Até],\">=\"& 5,TbPassagens[Meta:Atividade],LEFT(B68,FIND(\" \",B68,1)-1))","v":0},{"$f":"SUMIFS(TbPassagens[Valor Total Passagem],TbPassagens[A partir do mês],\"<=\" & 6,TbPassagens[Até],\">=\"& 6,TbPassagens[Meta:Atividade],LEFT(B68,FIND(\" \",B68,1)-1))","v":0},{"$f":"SUMIFS(TbPassagens[Valor Total Passagem],TbPassagens[A partir do mês],\"<=\" & 7,TbPassagens[Até],\">=\"& 7,TbPassagens[Meta:Atividade],LEFT(B68,FIND(\" \",B68,1)-1))","v":0},{"$f":"SUMIFS(TbPassagens[Valor Total Passagem],TbPassagens[A partir do mês],\"<=\" & 8,TbPassagens[Até],\">=\"& 8,TbPassagens[Meta:Atividade],LEFT(B68,FIND(\" \",B68,1)-1))","v":0},{"$f":"SUMIFS(TbPassagens[Valor Total Passagem],TbPassagens[A partir do mês],\"<=\" & 9,TbPassagens[Até],\">=\"& 9,TbPassagens[Meta:Atividade],LEFT(B68,FIND(\" \",B68,1)-1))","v":0},{"$f":"SUMIFS(TbPassagens[Valor Total Passagem],TbPassagens[A partir do mês],\"<=\" & 10,TbPassagens[Até],\">=\"& 10,TbPassagens[Meta:Atividade],LEFT(B68,FIND(\" \",B68,1)-1))","v":0},{"$f":"SUMIFS(TbPassagens[Valor Total Passagem],TbPassagens[A partir do mês],\"<=\" & 11,TbPassagens[Até],\">=\"& 11,TbPassagens[Meta:Atividade],LEFT(B68,FIND(\" \",B68,1)-1))","v":0},{"$f":"SUMIFS(TbPassagens[Valor Total Passagem],TbPassagens[A partir do mês],\"<=\" & 12,TbPassagens[Até],\">=\"& 12,TbPassagens[Meta:Atividade],LEFT(B68,FIND(\" \",B68,1)-1))","v":0},{"$f":"SUMIFS(TbPassagens[Valor Total Passagem],TbPassagens[A partir do mês],\"<=\" & 13,TbPassagens[Até],\">=\"& 13,TbPassagens[Meta:Atividade],LEFT(B68,FIND(\" \",B68,1)-1))","v":0},{"$f":"SUMIFS(TbPassagens[Valor Total Passagem],TbPassagens[A partir do mês],\"<=\" & 14,TbPassagens[Até],\">=\"& 14,TbPassagens[Meta:Atividade],LEFT(B68,FIND(\" \",B68,1)-1))","v":0},{"$f":"SUMIFS(TbPassagens[Valor Total Passagem],TbPassagens[A partir do mês],\"<=\" & 15,TbPassagens[Até],\">=\"& 15,TbPassagens[Meta:Atividade],LEFT(B68,FIND(\" \",B68,1)-1))","v":0},{"$f":"SUMIFS(TbPassagens[Valor Total Passagem],TbPassagens[A partir do mês],\"<=\" & 16,TbPassagens[Até],\">=\"& 16,TbPassagens[Meta:Atividade],LEFT(B68,FIND(\" \",B68,1)-1))","v":0},{"$f":"SUMIFS(TbPassagens[Valor Total Passagem],TbPassagens[A partir do mês],\"<=\" & 17,TbPassagens[Até],\">=\"& 17,TbPassagens[Meta:Atividade],LEFT(B68,FIND(\" \",B68,1)-1))","v":0},{"$f":"SUMIFS(TbPassagens[Valor Total Passagem],TbPassagens[A partir do mês],\"<=\" & 18,TbPassagens[Até],\">=\"& 18,TbPassagens[Meta:Atividade],LEFT(B68,FIND(\" \",B68,1)-1))","v":0},{"$f":"SUMIFS(TbPassagens[Valor Total Passagem],TbPassagens[A partir do mês],\"<=\" & 19,TbPassagens[Até],\">=\"& 19,TbPassagens[Meta:Atividade],LEFT(B68,FIND(\" \",B68,1)-1))","v":0},{"$f":"SUMIFS(TbPassagens[Valor Total Passagem],TbPassagens[A partir do mês],\"<=\" & 20,TbPassagens[Até],\">=\"& 20,TbPassagens[Meta:Atividade],LEFT(B68,FIND(\" \",B68,1)-1))","v":0},{"$f":"SUMIFS(TbPassagens[Valor Total Passagem],TbPassagens[A partir do mês],\"<=\" & 21,TbPassagens[Até],\">=\"& 21,TbPassagens[Meta:Atividade],LEFT(B68,FIND(\" \",B68,1)-1))","v":0},{"$f":"SUMIFS(TbPassagens[Valor Total Passagem],TbPassagens[A partir do mês],\"<=\" & 22,TbPassagens[Até],\">=\"& 22,TbPassagens[Meta:Atividade],LEFT(B68,FIND(\" \",B68,1)-1))","v":0},{"$f":"SUMIFS(TbPassagens[Valor Total Passagem],TbPassagens[A partir do mês],\"<=\" & 23,TbPassagens[Até],\">=\"& 23,TbPassagens[Meta:Atividade],LEFT(B68,FIND(\" \",B68,1)-1))","v":0},{"$f":"SUMIFS(TbPassagens[Valor Total Passagem],TbPassagens[A partir do mês],\"<=\" & 24,TbPassagens[Até],\">=\"& 24,TbPassagens[Meta:Atividade],LEFT(B68,FIND(\" \",B68,1)-1))","v":0},{"$f":"SUMIFS(TbPassagens[Valor Total Passagem],TbPassagens[A partir do mês],\"<=\" & 25,TbPassagens[Até],\">=\"& 25,TbPassagens[Meta:Atividade],LEFT(B68,FIND(\" \",B68,1)-1))","v":0},{"$f":"SUMIFS(TbPassagens[Valor Total Passagem],TbPassagens[A partir do mês],\"<=\" & 26,TbPassagens[Até],\">=\"& 26,TbPassagens[Meta:Atividade],LEFT(B68,FIND(\" \",B68,1)-1))","v":0},{"$f":"SUMIFS(TbPassagens[Valor Total Passagem],TbPassagens[A partir do mês],\"<=\" & 27,TbPassagens[Até],\">=\"& 27,TbPassagens[Meta:Atividade],LEFT(B68,FIND(\" \",B68,1)-1))","v":0},{"$f":"SUMIFS(TbPassagens[Valor Total Passagem],TbPassagens[A partir do mês],\"<=\" & 28,TbPassagens[Até],\">=\"& 28,TbPassagens[Meta:Atividade],LEFT(B68,FIND(\" \",B68,1)-1))","v":0},{"$f":"SUMIFS(TbPassagens[Valor Total Passagem],TbPassagens[A partir do mês],\"<=\" & 29,TbPassagens[Até],\">=\"& 29,TbPassagens[Meta:Atividade],LEFT(B68,FIND(\" \",B68,1)-1))","v":0},{"$f":"SUMIFS(TbPassagens[Valor Total Passagem],TbPassagens[A partir do mês],\"<=\" & 30,TbPassagens[Até],\">=\"& 30,TbPassagens[Meta:Atividade],LEFT(B68,FIND(\" \",B68,1)-1))","v":0},{"$f":"SUMIFS(TbPassagens[Valor Total Passagem],TbPassagens[A partir do mês],\"<=\" & 31,TbPassagens[Até],\">=\"& 31,TbPassagens[Meta:Atividade],LEFT(B68,FIND(\" \",B68,1)-1))","v":0},{"$f":"SUMIFS(TbPassagens[Valor Total Passagem],TbPassagens[A partir do mês],\"<=\" & 32,TbPassagens[Até],\">=\"& 32,TbPassagens[Meta:Atividade],LEFT(B68,FIND(\" \",B68,1)-1))","v":0},{"$f":"SUMIFS(TbPassagens[Valor Total Passagem],TbPassagens[A partir do mês],\"<=\" & 33,TbPassagens[Até],\">=\"& 33,TbPassagens[Meta:Atividade],LEFT(B68,FIND(\" \",B68,1)-1))","v":0},{"$f":"SUMIFS(TbPassagens[Valor Total Passagem],TbPassagens[A partir do mês],\"<=\" & 34,TbPassagens[Até],\">=\"& 34,TbPassagens[Meta:Atividade],LEFT(B68,FIND(\" \",B68,1)-1))","v":0},{"$f":"SUMIFS(TbPassagens[Valor Total Passagem],TbPassagens[A partir do mês],\"<=\" & 35,TbPassagens[Até],\">=\"& 35,TbPassagens[Meta:Atividade],LEFT(B68,FIND(\" \",B68,1)-1))","v":0},{"$f":"SUMIFS(TbPassagens[Valor Total Passagem],TbPassagens[A partir do mês],\"<=\" & 36,TbPassagens[Até],\">=\"& 36,TbPassagens[Meta:Atividade],LEFT(B68,FIND(\" \",B68,1)-1))","v":0},0]
[null,null,"Diárias",{"$f":"SUMIFS(TbPassagens[Valor Total Diária],TbPassagens[A partir do mês],\"<=\" & 1,TbPassagens[Até],\">=\"& 1,TbPassagens[Meta:Atividade],LEFT(B68,FIND(\" \",B68,1)-1))","v":0},{"$f":"SUMIFS(TbPassagens[Valor Total Diária],TbPassagens[A partir do mês],\"<=\" & 2,TbPassagens[Até],\">=\"& 2,TbPassagens[Meta:Atividade],LEFT(B68,FIND(\" \",B68,1)-1))","v":0},{"$f":"SUMIFS(TbPassagens[Valor Total Diária],TbPassagens[A partir do mês],\"<=\" & 3,TbPassagens[Até],\">=\"& 3,TbPassagens[Meta:Atividade],LEFT(B68,FIND(\" \",B68,1)-1))","v":0},{"$f":"SUMIFS(TbPassagens[Valor Total Diária],TbPassagens[A partir do mês],\"<=\" & 4,TbPassagens[Até],\">=\"& 4,TbPassagens[Meta:Atividade],LEFT(B68,FIND(\" \",B68,1)-1))","v":0},{"$f":"SUMIFS(TbPassagens[Valor Total Diária],TbPassagens[A partir do mês],\"<=\" & 5,TbPassagens[Até],\">=\"& 5,TbPassagens[Meta:Atividade],LEFT(B68,FIND(\" \",B68,1)-1))","v":0},{"$f":"SUMIFS(TbPassagens[Valor Total Diária],TbPassagens[A partir do mês],\"<=\" & 6,TbPassagens[Até],\">=\"& 6,TbPassagens[Meta:Atividade],LEFT(B68,FIND(\" \",B68,1)-1))","v":0},{"$f":"SUMIFS(TbPassagens[Valor Total Diária],TbPassagens[A partir do mês],\"<=\" & 7,TbPassagens[Até],\">=\"& 7,TbPassagens[Meta:Atividade],LEFT(B68,FIND(\" \",B68,1)-1))","v":0},{"$f":"SUMIFS(TbPassagens[Valor Total Diária],TbPassagens[A partir do mês],\"<=\" & 8,TbPassagens[Até],\">=\"& 8,TbPassagens[Meta:Atividade],LEFT(B68,FIND(\" \",B68,1)-1))","v":0},{"$f":"SUMIFS(TbPassagens[Valor Total Diária],TbPassagens[A partir do mês],\"<=\" & 9,TbPassagens[Até],\">=\"& 9,TbPassagens[Meta:Atividade],LEFT(B68,FIND(\" \",B68,1)-1))","v":0},{"$f":"SUMIFS(TbPassagens[Valor Total Diária],TbPassagens[A partir do mês],\"<=\" & 10,TbPassagens[Até],\">=\"& 10,TbPassagens[Meta:Atividade],LEFT(B68,FIND(\" \",B68,1)-1))","v":0},{"$f":"SUMIFS(TbPassagens[Valor Total Diária],TbPassagens[A partir do mês],\"<=\" & 11,TbPassagens[Até],\">=\"& 11,TbPassagens[Meta:Atividade],LEFT(B68,FIND(\" \",B68,1)-1))","v":0},{"$f":"SUMIFS(TbPassagens[Valor Total Diária],TbPassagens[A partir do mês],\"<=\" & 12,TbPassagens[Até],\">=\"& 12,TbPassagens[Meta:Atividade],LEFT(B68,FIND(\" \",B68,1)-1))","v":0},{"$f":"SUMIFS(TbPassagens[Valor Total Diária],TbPassagens[A partir do mês],\"<=\" & 13,TbPassagens[Até],\">=\"& 13,TbPassagens[Meta:Atividade],LEFT(B68,FIND(\" \",B68,1)-1))","v":0},{"$f":"SUMIFS(TbPassagens[Valor Total Diária],TbPassagens[A partir do mês],\"<=\" & 14,TbPassagens[Até],\">=\"& 14,TbPassagens[Meta:Atividade],LEFT(B68,FIND(\" \",B68,1)-1))","v":0},{"$f":"SUMIFS(TbPassagens[Valor Total Diária],TbPassagens[A partir do mês],\"<=\" & 15,TbPassagens[Até],\">=\"& 15,TbPassagens[Meta:Atividade],LEFT(B68,FIND(\" \",B68,1)-1))","v":0},{"$f":"SUMIFS(TbPassagens[Valor Total Diária],TbPassagens[A partir do mês],\"<=\" & 16,TbPassagens[Até],\">=\"& 16,TbPassagens[Meta:Atividade],LEFT(B68,FIND(\" \",B68,1)-1))","v":0},{"$f":"SUMIFS(TbPassagens[Valor Total Diária],TbPassagens[A partir do mês],\"<=\" & 17,TbPassagens[Até],\">=\"& 17,TbPassagens[Meta:Atividade],LEFT(B68,FIND(\" \",B68,1)-1))","v":0},{"$f":"SUMIFS(TbPassagens[Valor Total Diária],TbPassagens[A partir do mês],\"<=\" & 18,TbPassagens[Até],\">=\"& 18,TbPassagens[Meta:Atividade],LEFT(B68,FIND(\" \",B68,1)-1))","v":0},{"$f":"SUMIFS(TbPassagens[Valor Total Diária],TbPassagens[A partir do mês],\"<=\" & 19,TbPassagens[Até],\">=\"& 19,TbPassagens[Meta:Atividade],LEFT(B68,FIND(\" \",B68,1)-1))","v":0},{"$f":"SUMIFS(TbPassagens[Valor Total Diária],TbPassagens[A partir do mês],\"<=\" & 20,TbPassagens[Até],\">=\"& 20,TbPassagens[Meta:Atividade],LEFT(B68,FIND(\" \",B68,1)-1))","v":0},{"$f":"SUMIFS(TbPassagens[Valor Total Diária],TbPassagens[A partir do mês],\"<=\" & 21,TbPassagens[Até],\">=\"& 21,TbPassagens[Meta:Atividade],LEFT(B68,FIND(\" \",B68,1)-1))","v":0},{"$f":"SUMIFS(TbPassagens[Valor Total Diária],TbPassagens[A partir do mês],\"<=\" & 22,TbPassagens[Até],\">=\"& 22,TbPassagens[Meta:Atividade],LEFT(B68,FIND(\" \",B68,1)-1))","v":0},{"$f":"SUMIFS(TbPassagens[Valor Total Diária],TbPassagens[A partir do mês],\"<=\" & 23,TbPassagens[Até],\">=\"& 23,TbPassagens[Meta:Atividade],LEFT(B68,FIND(\" \",B68,1)-1))","v":0},{"$f":"SUMIFS(TbPassagens[Valor Total Diária],TbPassagens[A partir do mês],\"<=\" & 24,TbPassagens[Até],\">=\"& 24,TbPassagens[Meta:Atividade],LEFT(B68,FIND(\" \",B68,1)-1))","v":0},{"$f":"SUMIFS(TbPassagens[Valor Total Diária],TbPassagens[A partir do mês],\"<=\" & 25,TbPassagens[Até],\">=\"& 25,TbPassagens[Meta:Atividade],LEFT(B68,FIND(\" \",B68,1)-1))","v":0},{"$f":"SUMIFS(TbPassagens[Valor Total Diária],TbPassagens[A partir do mês],\"<=\" & 26,TbPassagens[Até],\">=\"& 26,TbPassagens[Meta:Atividade],LEFT(B68,FIND(\" \",B68,1)-1))","v":0},{"$f":"SUMIFS(TbPassagens[Valor Total Diária],TbPassagens[A partir do mês],\"<=\" & 27,TbPassagens[Até],\">=\"& 27,TbPassagens[Meta:Atividade],LEFT(B68,FIND(\" \",B68,1)-1))","v":0},{"$f":"SUMIFS(TbPassagens[Valor Total Diária],TbPassagens[A partir do mês],\"<=\" & 28,TbPassagens[Até],\">=\"& 28,TbPassagens[Meta:Atividade],LEFT(B68,FIND(\" \",B68,1)-1))","v":0},{"$f":"SUMIFS(TbPassagens[Valor Total Diária],TbPassagens[A partir do mês],\"<=\" & 29,TbPassagens[Até],\">=\"& 29,TbPassagens[Meta:Atividade],LEFT(B68,FIND(\" \",B68,1)-1))","v":0},{"$f":"SUMIFS(TbPassagens[Valor Total Diária],TbPassagens[A partir do mês],\"<=\" & 30,TbPassagens[Até],\">=\"& 30,TbPassagens[Meta:Atividade],LEFT(B68,FIND(\" \",B68,1)-1))","v":0},{"$f":"SUMIFS(TbPassagens[Valor Total Diária],TbPassagens[A partir do mês],\"<=\" & 31,TbPassagens[Até],\">=\"& 31,TbPassagens[Meta:Atividade],LEFT(B68,FIND(\" \",B68,1)-1))","v":0},{"$f":"SUMIFS(TbPassagens[Valor Total Diária],TbPassagens[A partir do mês],\"<=\" & 32,TbPassagens[Até],\">=\"& 32,TbPassagens[Meta:Atividade],LEFT(B68,FIND(\" \",B68,1)-1))","v":0},{"$f":"SUMIFS(TbPassagens[Valor Total Diária],TbPassagens[A partir do mês],\"<=\" & 33,TbPassagens[Até],\">=\"& 33,TbPassagens[Meta:Atividade],LEFT(B68,FIND(\" \",B68,1)-1))","v":0},{"$f":"SUMIFS(TbPassagens[Valor Total Diária],TbPassagens[A partir do mês],\"<=\" & 34,TbPassagens[Até],\">=\"& 34,TbPassagens[Meta:Atividade],LEFT(B68,FIND(\" \",B68,1)-1))","v":0},{"$f":"SUMIFS(TbPassagens[Valor Total Diária],TbPassagens[A partir do mês],\"<=\" & 35,TbPassagens[Até],\">=\"& 35,TbPassagens[Meta:Atividade],LEFT(B68,FIND(\" \",B68,1)-1))","v":0},{"$f":"SUMIFS(TbPassagens[Valor Total Diária],TbPassagens[A partir do mês],\"<=\" & 36,TbPassagens[Até],\">=\"& 36,TbPassagens[Meta:Atividade],LEFT(B68,FIND(\" \",B68,1)-1))","v":0},0]
[null,null,"Material de Consumo",{"$f":"SUMIFS(TBCompras[Valor Total Item (R$)],TBCompras[Mês do Projeto],\"<=\" & 1,TBCompras[Até],\">=\"& 1,TBCompras[Meta:Atividade],LEFT(B68,FIND(\" \",B68,1)-1),TBCompras[Tipo de Material],\"CONSUMO\")","v":0},{"$f":"SUMIFS(TBCompras[Valor Total Item (R$)],TBCompras[Mês do Projeto],\"<=\" & 2,TBCompras[Até],\">=\"& 2,TBCompras[Meta:Atividade],LEFT(B68,FIND(\" \",B68,1)-1),TBCompras[Tipo de Material],\"CONSUMO\")","v":0},{"$f":"SUMIFS(TBCompras[Valor Total Item (R$)],TBCompras[Mês do Projeto],\"<=\" & 3,TBCompras[Até],\">=\"& 3,TBCompras[Meta:Atividade],LEFT(B68,FIND(\" \",B68,1)-1),TBCompras[Tipo de Material],\"CONSUMO\")","v":0},{"$f":"SUMIFS(TBCompras[Valor Total Item (R$)],TBCompras[Mês do Projeto],\"<=\" & 4,TBCompras[Até],\">=\"& 4,TBCompras[Meta:Atividade],LEFT(B68,FIND(\" \",B68,1)-1),TBCompras[Tipo de Material],\"CONSUMO\")","v":0},{"$f":"SUMIFS(TBCompras[Valor Total Item (R$)],TBCompras[Mês do Projeto],\"<=\" & 5,TBCompras[Até],\">=\"& 5,TBCompras[Meta:Atividade],LEFT(B68,FIND(\" \",B68,1)-1),TBCompras[Tipo de Material],\"CONSUMO\")","v":0},{"$f":"SUMIFS(TBCompras[Valor Total Item (R$)],TBCompras[Mês do Projeto],\"<=\" & 6,TBCompras[Até],\">=\"& 6,TBCompras[Meta:Atividade],LEFT(B68,FIND(\" \",B68,1)-1),TBCompras[Tipo de Material],\"CONSUMO\")","v":0},{"$f":"SUMIFS(TBCompras[Valor Total Item (R$)],TBCompras[Mês do Projeto],\"<=\" & 7,TBCompras[Até],\">=\"& 7,TBCompras[Meta:Atividade],LEFT(B68,FIND(\" \",B68,1)-1),TBCompras[Tipo de Material],\"CONSUMO\")","v":0},{"$f":"SUMIFS(TBCompras[Valor Total Item (R$)],TBCompras[Mês do Projeto],\"<=\" & 8,TBCompras[Até],\">=\"& 8,TBCompras[Meta:Atividade],LEFT(B68,FIND(\" \",B68,1)-1),TBCompras[Tipo de Material],\"CONSUMO\")","v":0},{"$f":"SUMIFS(TBCompras[Valor Total Item (R$)],TBCompras[Mês do Projeto],\"<=\" & 9,TBCompras[Até],\">=\"& 9,TBCompras[Meta:Atividade],LEFT(B68,FIND(\" \",B68,1)-1),TBCompras[Tipo de Material],\"CONSUMO\")","v":0},{"$f":"SUMIFS(TBCompras[Valor Total Item (R$)],TBCompras[Mês do Projeto],\"<=\" & 10,TBCompras[Até],\">=\"& 10,TBCompras[Meta:Atividade],LEFT(B68,FIND(\" \",B68,1)-1),TBCompras[Tipo de Material],\"CONSUMO\")","v":0},{"$f":"SUMIFS(TBCompras[Valor Total Item (R$)],TBCompras[Mês do Projeto],\"<=\" & 11,TBCompras[Até],\">=\"& 11,TBCompras[Meta:Atividade],LEFT(B68,FIND(\" \",B68,1)-1),TBCompras[Tipo de Material],\"CONSUMO\")","v":0},{"$f":"SUMIFS(TBCompras[Valor Total Item (R$)],TBCompras[Mês do Projeto],\"<=\" & 12,TBCompras[Até],\">=\"& 12,TBCompras[Meta:Atividade],LEFT(B68,FIND(\" \",B68,1)-1),TBCompras[Tipo de Material],\"CONSUMO\")","v":0},{"$f":"SUMIFS(TBCompras[Valor Total Item (R$)],TBCompras[Mês do Projeto],\"<=\" & 13,TBCompras[Até],\">=\"& 13,TBCompras[Meta:Atividade],LEFT(B68,FIND(\" \",B68,1)-1),TBCompras[Tipo de Material],\"CONSUMO\")","v":0},{"$f":"SUMIFS(TBCompras[Valor Total Item (R$)],TBCompras[Mês do Projeto],\"<=\" & 14,TBCompras[Até],\">=\"& 14,TBCompras[Meta:Atividade],LEFT(B68,FIND(\" \",B68,1)-1),TBCompras[Tipo de Material],\"CONSUMO\")","v":0},{"$f":"SUMIFS(TBCompras[Valor Total Item (R$)],TBCompras[Mês do Projeto],\"<=\" & 15,TBCompras[Até],\">=\"& 15,TBCompras[Meta:Atividade],LEFT(B68,FIND(\" \",B68,1)-1),TBCompras[Tipo de Material],\"CONSUMO\")","v":0},{"$f":"SUMIFS(TBCompras[Valor Total Item (R$)],TBCompras[Mês do Projeto],\"<=\" & 16,TBCompras[Até],\">=\"& 16,TBCompras[Meta:Atividade],LEFT(B68,FIND(\" \",B68,1)-1),TBCompras[Tipo de Material],\"CONSUMO\")","v":0},{"$f":"SUMIFS(TBCompras[Valor Total Item (R$)],TBCompras[Mês do Projeto],\"<=\" & 17,TBCompras[Até],\">=\"& 17,TBCompras[Meta:Atividade],LEFT(B68,FIND(\" \",B68,1)-1),TBCompras[Tipo de Material],\"CONSUMO\")","v":0},{"$f":"SUMIFS(TBCompras[Valor Total Item (R$)],TBCompras[Mês do Projeto],\"<=\" & 18,TBCompras[Até],\">=\"& 18,TBCompras[Meta:Atividade],LEFT(B68,FIND(\" \",B68,1)-1),TBCompras[Tipo de Material],\"CONSUMO\")","v":0},{"$f":"SUMIFS(TBCompras[Valor Total Item (R$)],TBCompras[Mês do Projeto],\"<=\" & 19,TBCompras[Até],\">=\"& 19,TBCompras[Meta:Atividade],LEFT(B68,FIND(\" \",B68,1)-1),TBCompras[Tipo de Material],\"CONSUMO\")","v":0},{"$f":"SUMIFS(TBCompras[Valor Total Item (R$)],TBCompras[Mês do Projeto],\"<=\" & 20,TBCompras[Até],\">=\"& 20,TBCompras[Meta:Atividade],LEFT(B68,FIND(\" \",B68,1)-1),TBCompras[Tipo de Material],\"CONSUMO\")","v":0},{"$f":"SUMIFS(TBCompras[Valor Total Item (R$)],TBCompras[Mês do Projeto],\"<=\" & 21,TBCompras[Até],\">=\"& 21,TBCompras[Meta:Atividade],LEFT(B68,FIND(\" \",B68,1)-1),TBCompras[Tipo de Material],\"CONSUMO\")","v":0},{"$f":"SUMIFS(TBCompras[Valor Total Item (R$)],TBCompras[Mês do Projeto],\"<=\" & 22,TBCompras[Até],\">=\"& 22,TBCompras[Meta:Atividade],LEFT(B68,FIND(\" \",B68,1)-1),TBCompras[Tipo de Material],\"CONSUMO\")","v":0},{"$f":"SUMIFS(TBCompras[Valor Total Item (R$)],TBCompras[Mês do Projeto],\"<=\" & 23,TBCompras[Até],\">=\"& 23,TBCompras[Meta:Atividade],LEFT(B68,FIND(\" \",B68,1)-1),TBCompras[Tipo de Material],\"CONSUMO\")","v":0},{"$f":"SUMIFS(TBCompras[Valor Total Item (R$)],TBCompras[Mês do Projeto],\"<=\" & 24,TBCompras[Até],\">=\"& 24,TBCompras[Meta:Atividade],LEFT(B68,FIND(\" \",B68,1)-1),TBCompras[Tipo de Material],\"CONSUMO\")","v":0},{"$f":"SUMIFS(TBCompras[Valor Total Item (R$)],TBCompras[Mês do Projeto],\"<=\" & 25,TBCompras[Até],\">=\"& 25,TBCompras[Meta:Atividade],LEFT(B68,FIND(\" \",B68,1)-1),TBCompras[Tipo de Material],\"CONSUMO\")","v":0},{"$f":"SUMIFS(TBCompras[Valor Total Item (R$)],TBCompras[Mês do Projeto],\"<=\" & 26,TBCompras[Até],\">=\"& 26,TBCompras[Meta:Atividade],LEFT(B68,FIND(\" \",B68,1)-1),TBCompras[Tipo de Material],\"CONSUMO\")","v":0},{"$f":"SUMIFS(TBCompras[Valor Total Item (R$)],TBCompras[Mês do Projeto],\"<=\" & 27,TBCompras[Até],\">=\"& 27,TBCompras[Meta:Atividade],LEFT(B68,FIND(\" \",B68,1)-1),TBCompras[Tipo de Material],\"CONSUMO\")","v":0},{"$f":"SUMIFS(TBCompras[Valor Total Item (R$)],TBCompras[Mês do Projeto],\"<=\" & 28,TBCompras[Até],\">=\"& 28,TBCompras[Meta:Atividade],LEFT(B68,FIND(\" \",B68,1)-1),TBCompras[Tipo de Material],\"CONSUMO\")","v":0},{"$f":"SUMIFS(TBCompras[Valor Total Item (R$)],TBCompras[Mês do Projeto],\"<=\" & 29,TBCompras[Até],\">=\"& 29,TBCompras[Meta:Atividade],LEFT(B68,FIND(\" \",B68,1)-1),TBCompras[Tipo de Material],\"CONSUMO\")","v":0},{"$f":"SUMIFS(TBCompras[Valor Total Item (R$)],TBCompras[Mês do Projeto],\"<=\" & 30,TBCompras[Até],\">=\"& 30,TBCompras[Meta:Atividade],LEFT(B68,FIND(\" \",B68,1)-1),TBCompras[Tipo de Material],\"CONSUMO\")","v":0},{"$f":"SUMIFS(TBCompras[Valor Total Item (R$)],TBCompras[Mês do Projeto],\"<=\" & 31,TBCompras[Até],\">=\"& 31,TBCompras[Meta:Atividade],LEFT(B68,FIND(\" \",B68,1)-1),TBCompras[Tipo de Material],\"CONSUMO\")","v":0},{"$f":"SUMIFS(TBCompras[Valor Total Item (R$)],TBCompras[Mês do Projeto],\"<=\" & 32,TBCompras[Até],\">=\"& 32,TBCompras[Meta:Atividade],LEFT(B68,FIND(\" \",B68,1)-1),TBCompras[Tipo de Material],\"CONSUMO\")","v":0},{"$f":"SUMIFS(TBCompras[Valor Total Item (R$)],TBCompras[Mês do Projeto],\"<=\" & 33,TBCompras[Até],\">=\"& 33,TBCompras[Meta:Atividade],LEFT(B68,FIND(\" \",B68,1)-1),TBCompras[Tipo de Material],\"CONSUMO\")","v":0},{"$f":"SUMIFS(TBCompras[Valor Total Item (R$)],TBCompras[Mês do Projeto],\"<=\" & 34,TBCompras[Até],\">=\"& 34,TBCompras[Meta:Atividade],LEFT(B68,FIND(\" \",B68,1)-1),TBCompras[Tipo de Material],\"CONSUMO\")","v":0},{"$f":"SUMIFS(TBCompras[Valor Total Item (R$)],TBCompras[Mês do Projeto],\"<=\" & 35,TBCompras[Até],\">=\"& 35,TBCompras[Meta:Atividade],LEFT(B68,FIND(\" \",B68,1)-1),TBCompras[Tipo de Material],\"CONSUMO\")","v":0},{"$f":"SUMIFS(TBCompras[Valor Total Item (R$)],TBCompras[Mês do Projeto],\"<=\" & 36,TBCompras[Até],\">=\"& 36,TBCompras[Meta:Atividade],LEFT(B68,FIND(\" \",B68,1)-1),TBCompras[Tipo de Material],\"CONSUMO\")","v":0},0]
[null,null,"Equipamentos",{"$f":"SUMIFS(TBCompras[Valor Total Item (R$)],TBCompras[Mês do Projeto],\"<=\" & 1,TBCompras[Até],\">=\"& 1,TBCompras[Meta:Atividade],LEFT(B68,FIND(\" \",B68,1)-1),TBCompras[Tipo de Material],\"EQUIPAMENTO\")","v":0},{"$f":"SUMIFS(TBCompras[Valor Total Item (R$)],TBCompras[Mês do Projeto],\"<=\" & 2,TBCompras[Até],\">=\"& 2,TBCompras[Meta:Atividade],LEFT(B68,FIND(\" \",B68,1)-1),TBCompras[Tipo de Material],\"EQUIPAMENTO\")","v":0},{"$f":"SUMIFS(TBCompras[Valor Total Item (R$)],TBCompras[Mês do Projeto],\"<=\" & 3,TBCompras[Até],\">=\"& 3,TBCompras[Meta:Atividade],LEFT(B68,FIND(\" \",B68,1)-1),TBCompras[Tipo de Material],\"EQUIPAMENTO\")","v":0},{"$f":"SUMIFS(TBCompras[Valor Total Item (R$)],TBCompras[Mês do Projeto],\"<=\" & 4,TBCompras[Até],\">=\"& 4,TBCompras[Meta:Atividade],LEFT(B68,FIND(\" \",B68,1)-1),TBCompras[Tipo de Material],\"EQUIPAMENTO\")","v":0},{"$f":"SUMIFS(TBCompras[Valor Total Item (R$)],TBCompras[Mês do Projeto],\"<=\" & 5,TBCompras[Até],\">=\"& 5,TBCompras[Meta:Atividade],LEFT(B68,FIND(\" \",B68,1)-1),TBCompras[Tipo de Material],\"EQUIPAMENTO\")","v":0},{"$f":"SUMIFS(TBCompras[Valor Total Item (R$)],TBCompras[Mês do Projeto],\"<=\" & 6,TBCompras[Até],\">=\"& 6,TBCompras[Meta:Atividade],LEFT(B68,FIND(\" \",B68,1)-1),TBCompras[Tipo de Material],\"EQUIPAMENTO\")","v":0},{"$f":"SUMIFS(TBCompras[Valor Total Item (R$)],TBCompras[Mês do Projeto],\"<=\" & 7,TBCompras[Até],\">=\"& 7,TBCompras[Meta:Atividade],LEFT(B68,FIND(\" \",B68,1)-1),TBCompras[Tipo de Material],\"EQUIPAMENTO\")","v":0},{"$f":"SUMIFS(TBCompras[Valor Total Item (R$)],TBCompras[Mês do Projeto],\"<=\" & 8,TBCompras[Até],\">=\"& 8,TBCompras[Meta:Atividade],LEFT(B68,FIND(\" \",B68,1)-1),TBCompras[Tipo de Material],\"EQUIPAMENTO\")","v":0},{"$f":"SUMIFS(TBCompras[Valor Total Item (R$)],TBCompras[Mês do Projeto],\"<=\" & 9,TBCompras[Até],\">=\"& 9,TBCompras[Meta:Atividade],LEFT(B68,FIND(\" \",B68,1)-1),TBCompras[Tipo de Material],\"EQUIPAMENTO\")","v":0},{"$f":"SUMIFS(TBCompras[Valor Total Item (R$)],TBCompras[Mês do Projeto],\"<=\" & 10,TBCompras[Até],\">=\"& 10,TBCompras[Meta:Atividade],LEFT(B68,FIND(\" \",B68,1)-1),TBCompras[Tipo de Material],\"EQUIPAMENTO\")","v":0},{"$f":"SUMIFS(TBCompras[Valor Total Item (R$)],TBCompras[Mês do Projeto],\"<=\" & 11,TBCompras[Até],\">=\"& 11,TBCompras[Meta:Atividade],LEFT(B68,FIND(\" \",B68,1)-1),TBCompras[Tipo de Material],\"EQUIPAMENTO\")","v":0},{"$f":"SUMIFS(TBCompras[Valor Total Item (R$)],TBCompras[Mês do Projeto],\"<=\" & 12,TBCompras[Até],\">=\"& 12,TBCompras[Meta:Atividade],LEFT(B68,FIND(\" \",B68,1)-1),TBCompras[Tipo de Material],\"EQUIPAMENTO\")","v":0},{"$f":"SUMIFS(TBCompras[Valor Total Item (R$)],TBCompras[Mês do Projeto],\"<=\" & 13,TBCompras[Até],\">=\"& 13,TBCompras[Meta:Atividade],LEFT(B68,FIND(\" \",B68,1)-1),TBCompras[Tipo de Material],\"EQUIPAMENTO\")","v":0},{"$f":"SUMIFS(TBCompras[Valor Total Item (R$)],TBCompras[Mês do Projeto],\"<=\" & 14,TBCompras[Até],\">=\"& 14,TBCompras[Meta:Atividade],LEFT(B68,FIND(\" \",B68,1)-1),TBCompras[Tipo de Material],\"EQUIPAMENTO\")","v":0},{"$f":"SUMIFS(TBCompras[Valor Total Item (R$)],TBCompras[Mês do Projeto],\"<=\" & 15,TBCompras[Até],\">=\"& 15,TBCompras[Meta:Atividade],LEFT(B68,FIND(\" \",B68,1)-1),TBCompras[Tipo de Material],\"EQUIPAMENTO\")","v":0},{"$f":"SUMIFS(TBCompras[Valor Total Item (R$)],TBCompras[Mês do Projeto],\"<=\" & 16,TBCompras[Até],\">=\"& 16,TBCompras[Meta:Atividade],LEFT(B68,FIND(\" \",B68,1)-1),TBCompras[Tipo de Material],\"EQUIPAMENTO\")","v":0},{"$f":"SUMIFS(TBCompras[Valor Total Item (R$)],TBCompras[Mês do Projeto],\"<=\" & 17,TBCompras[Até],\">=\"& 17,TBCompras[Meta:Atividade],LEFT(B68,FIND(\" \",B68,1)-1),TBCompras[Tipo de Material],\"EQUIPAMENTO\")","v":0},{"$f":"SUMIFS(TBCompras[Valor Total Item (R$)],TBCompras[Mês do Projeto],\"<=\" & 18,TBCompras[Até],\">=\"& 18,TBCompras[Meta:Atividade],LEFT(B68,FIND(\" \",B68,1)-1),TBCompras[Tipo de Material],\"EQUIPAMENTO\")","v":0},{"$f":"SUMIFS(TBCompras[Valor Total Item (R$)],TBCompras[Mês do Projeto],\"<=\" & 19,TBCompras[Até],\">=\"& 19,TBCompras[Meta:Atividade],LEFT(B68,FIND(\" \",B68,1)-1),TBCompras[Tipo de Material],\"EQUIPAMENTO\")","v":0},{"$f":"SUMIFS(TBCompras[Valor Total Item (R$)],TBCompras[Mês do Projeto],\"<=\" & 20,TBCompras[Até],\">=\"& 20,TBCompras[Meta:Atividade],LEFT(B68,FIND(\" \",B68,1)-1),TBCompras[Tipo de Material],\"EQUIPAMENTO\")","v":0},{"$f":"SUMIFS(TBCompras[Valor Total Item (R$)],TBCompras[Mês do Projeto],\"<=\" & 21,TBCompras[Até],\">=\"& 21,TBCompras[Meta:Atividade],LEFT(B68,FIND(\" \",B68,1)-1),TBCompras[Tipo de Material],\"EQUIPAMENTO\")","v":0},{"$f":"SUMIFS(TBCompras[Valor Total Item (R$)],TBCompras[Mês do Projeto],\"<=\" & 22,TBCompras[Até],\">=\"& 22,TBCompras[Meta:Atividade],LEFT(B68,FIND(\" \",B68,1)-1),TBCompras[Tipo de Material],\"EQUIPAMENTO\")","v":0},{"$f":"SUMIFS(TBCompras[Valor Total Item (R$)],TBCompras[Mês do Projeto],\"<=\" & 23,TBCompras[Até],\">=\"& 23,TBCompras[Meta:Atividade],LEFT(B68,FIND(\" \",B68,1)-1),TBCompras[Tipo de Material],\"EQUIPAMENTO\")","v":0},{"$f":"SUMIFS(TBCompras[Valor Total Item (R$)],TBCompras[Mês do Projeto],\"<=\" & 24,TBCompras[Até],\">=\"& 24,TBCompras[Meta:Atividade],LEFT(B68,FIND(\" \",B68,1)-1),TBCompras[Tipo de Material],\"EQUIPAMENTO\")","v":0},{"$f":"SUMIFS(TBCompras[Valor Total Item (R$)],TBCompras[Mês do Projeto],\"<=\" & 25,TBCompras[Até],\">=\"& 25,TBCompras[Meta:Atividade],LEFT(B68,FIND(\" \",B68,1)-1),TBCompras[Tipo de Material],\"EQUIPAMENTO\")","v":0},{"$f":"SUMIFS(TBCompras[Valor Total Item (R$)],TBCompras[Mês do Projeto],\"<=\" & 26,TBCompras[Até],\">=\"& 26,TBCompras[Meta:Atividade],LEFT(B68,FIND(\" \",B68,1)-1),TBCompras[Tipo de Material],\"EQUIPAMENTO\")","v":0},{"$f":"SUMIFS(TBCompras[Valor Total Item (R$)],TBCompras[Mês do Projeto],\"<=\" & 27,TBCompras[Até],\">=\"& 27,TBCompras[Meta:Atividade],LEFT(B68,FIND(\" \",B68,1)-1),TBCompras[Tipo de Material],\"EQUIPAMENTO\")","v":0},{"$f":"SUMIFS(TBCompras[Valor Total Item (R$)],TBCompras[Mês do Projeto],\"<=\" & 28,TBCompras[Até],\">=\"& 28,TBCompras[Meta:Atividade],LEFT(B68,FIND(\" \",B68,1)-1),TBCompras[Tipo de Material],\"EQUIPAMENTO\")","v":0},{"$f":"SUMIFS(TBCompras[Valor Total Item (R$)],TBCompras[Mês do Projeto],\"<=\" & 29,TBCompras[Até],\">=\"& 29,TBCompras[Meta:Atividade],LEFT(B68,FIND(\" \",B68,1)-1),TBCompras[Tipo de Material],\"EQUIPAMENTO\")","v":0},{"$f":"SUMIFS(TBCompras[Valor Total Item (R$)],TBCompras[Mês do Projeto],\"<=\" & 30,TBCompras[Até],\">=\"& 30,TBCompras[Meta:Atividade],LEFT(B68,FIND(\" \",B68,1)-1),TBCompras[Tipo de Material],\"EQUIPAMENTO\")","v":0},{"$f":"SUMIFS(TBCompras[Valor Total Item (R$)],TBCompras[Mês do Projeto],\"<=\" & 31,TBCompras[Até],\">=\"& 31,TBCompras[Meta:Atividade],LEFT(B68,FIND(\" \",B68,1)-1),TBCompras[Tipo de Material],\"EQUIPAMENTO\")","v":0},{"$f":"SUMIFS(TBCompras[Valor Total Item (R$)],TBCompras[Mês do Projeto],\"<=\" & 32,TBCompras[Até],\">=\"& 32,TBCompras[Meta:Atividade],LEFT(B68,FIND(\" \",B68,1)-1),TBCompras[Tipo de Material],\"EQUIPAMENTO\")","v":0},{"$f":"SUMIFS(TBCompras[Valor Total Item (R$)],TBCompras[Mês do Projeto],\"<=\" & 33,TBCompras[Até],\">=\"& 33,TBCompras[Meta:Atividade],LEFT(B68,FIND(\" \",B68,1)-1),TBCompras[Tipo de Material],\"EQUIPAMENTO\")","v":0},{"$f":"SUMIFS(TBCompras[Valor Total Item (R$)],TBCompras[Mês do Projeto],\"<=\" & 34,TBCompras[Até],\">=\"& 34,TBCompras[Meta:Atividade],LEFT(B68,FIND(\" \",B68,1)-1),TBCompras[Tipo de Material],\"EQUIPAMENTO\")","v":0},{"$f":"SUMIFS(TBCompras[Valor Total Item (R$)],TBCompras[Mês do Projeto],\"<=\" & 35,TBCompras[Até],\">=\"& 35,TBCompras[Meta:Atividade],LEFT(B68,FIND(\" \",B68,1)-1),TBCompras[Tipo de Material],\"EQUIPAMENTO\")","v":0},{"$f":"SUMIFS(TBCompras[Valor Total Item (R$)],TBCompras[Mês do Projeto],\"<=\" & 36,TBCompras[Até],\">=\"& 36,TBCompras[Meta:Atividade],LEFT(B68,FIND(\" \",B68,1)-1),TBCompras[Tipo de Material],\"EQUIPAMENTO\")","v":0},0]
[null,null,"Total Atividade 5.1",{"$f":"SUBTOTAL(9,D68:D73)","v":0},0,0,0,0,0,0,0,0,0,0,0,0,0,0,0,0,0,0,0,0,0,0,0,0,0,0,0,0,0,0,0,0,0,0,0,0]
[null,"5.2 - Seleção do candidato vacinal","Pessoa Física",{"$f":"SUMIFS(TbPessoas[Custo Total Mensal],TbPessoas[A partir do mês],\"<=\" & 1,TbPessoas[Até],\">=\"& 1,TbPessoas[Meta:Atividade],LEFT(B75,FIND(\" \",B75,1)-1))","v":0},{"$f":"SUMIFS(TbPessoas[Custo Total Mensal],TbPessoas[A partir do mês],\"<=\" & 2,TbPessoas[Até],\">=\"& 2,TbPessoas[Meta:Atividade],LEFT(B75,FIND(\" \",B75,1)-1))","v":0},{"$f":"SUMIFS(TbPessoas[Custo Total Mensal],TbPessoas[A partir do mês],\"<=\" & 3,TbPessoas[Até],\">=\"& 3,TbPessoas[Meta:Atividade],LEFT(B75,FIND(\" \",B75,1)-1))","v":0},{"$f":"SUMIFS(TbPessoas[Custo Total Mensal],TbPessoas[A partir do mês],\"<=\" & 4,TbPessoas[Até],\">=\"& 4,TbPessoas[Meta:Atividade],LEFT(B75,FIND(\" \",B75,1)-1))","v":0},{"$f":"SUMIFS(TbPessoas[Custo Total Mensal],TbPessoas[A partir do mês],\"<=\" & 5,TbPessoas[Até],\">=\"& 5,TbPessoas[Meta:Atividade],LEFT(B75,FIND(\" \",B75,1)-1))","v":0},{"$f":"SUMIFS(TbPessoas[Custo Total Mensal],TbPessoas[A partir do mês],\"<=\" & 6,TbPessoas[Até],\">=\"& 6,TbPessoas[Meta:Atividade],LEFT(B75,FIND(\" \",B75,1)-1))","v":0},{"$f":"SUMIFS(TbPessoas[Custo Total Mensal],TbPessoas[A partir do mês],\"<=\" & 7,TbPessoas[Até],\">=\"& 7,TbPessoas[Meta:Atividade],LEFT(B75,FIND(\" \",B75,1)-1))","v":0},{"$f":"SUMIFS(TbPessoas[Custo Total Mensal],TbPessoas[A partir do mês],\"<=\" & 8,TbPessoas[Até],\">=\"& 8,TbPessoas[Meta:Atividade],LEFT(B75,FIND(\" \",B75,1)-1))","v":0},{"$f":"SUMIFS(TbPessoas[Custo Total Mensal],TbPessoas[A partir do mês],\"<=\" & 9,TbPessoas[Até],\">=\"& 9,TbPessoas[Meta:Atividade],LEFT(B75,FIND(\" \",B75,1)-1))","v":0},{"$f":"SUMIFS(TbPessoas[Custo Total Mensal],TbPessoas[A partir do mês],\"<=\" & 10,TbPessoas[Até],\">=\"& 10,TbPessoas[Meta:Atividade],LEFT(B75,FIND(\" \",B75,1)-1))","v":0},{"$f":"SUMIFS(TbPessoas[Custo Total Mensal],TbPessoas[A partir do mês],\"<=\" & 11,TbPessoas[Até],\">=\"& 11,TbPessoas[Meta:Atividade],LEFT(B75,FIND(\" \",B75,1)-1))","v":0},{"$f":"SUMIFS(TbPessoas[Custo Total Mensal],TbPessoas[A partir do mês],\"<=\" & 12,TbPessoas[Até],\">=\"& 12,TbPessoas[Meta:Atividade],LEFT(B75,FIND(\" \",B75,1)-1))","v":0},{"$f":"SUMIFS(TbPessoas[Custo Total Mensal],TbPessoas[A partir do mês],\"<=\" & 13,TbPessoas[Até],\">=\"& 13,TbPessoas[Meta:Atividade],LEFT(B75,FIND(\" \",B75,1)-1))","v":0},{"$f":"SUMIFS(TbPessoas[Custo Total Mensal],TbPessoas[A partir do mês],\"<=\" & 14,TbPessoas[Até],\">=\"& 14,TbPessoas[Meta:Atividade],LEFT(B75,FIND(\" \",B75,1)-1))","v":0},{"$f":"SUMIFS(TbPessoas[Custo Total Mensal],TbPessoas[A partir do mês],\"<=\" & 15,TbPessoas[Até],\">=\"& 15,TbPessoas[Meta:Atividade],LEFT(B75,FIND(\" \",B75,1)-1))","v":0},{"$f":"SUMIFS(TbPessoas[Custo Total Mensal],TbPessoas[A partir do mês],\"<=\" & 16,TbPessoas[Até],\">=\"& 16,TbPessoas[Meta:Atividade],LEFT(B75,FIND(\" \",B75,1)-1))","v":0},{"$f":"SUMIFS(TbPessoas[Custo Total Mensal],TbPessoas[A partir do mês],\"<=\" & 17,TbPessoas[Até],\">=\"& 17,TbPessoas[Meta:Atividade],LEFT(B75,FIND(\" \",B75,1)-1))","v":0},{"$f":"SUMIFS(TbPessoas[Custo Total Mensal],TbPessoas[A partir do mês],\"<=\" & 18,TbPessoas[Até],\">=\"& 18,TbPessoas[Meta:Atividade],LEFT(B75,FIND(\" \",B75,1)-1))","v":0},{"$f":"SUMIFS(TbPessoas[Custo Total Mensal],TbPessoas[A partir do mês],\"<=\" & 19,TbPessoas[Até],\">=\"& 19,TbPessoas[Meta:Atividade],LEFT(B75,FIND(\" \",B75,1)-1))","v":0},{"$f":"SUMIFS(TbPessoas[Custo Total Mensal],TbPessoas[A partir do mês],\"<=\" & 20,TbPessoas[Até],\">=\"& 20,TbPessoas[Meta:Atividade],LEFT(B75,FIND(\" \",B75,1)-1))","v":0},{"$f":"SUMIFS(TbPessoas[Custo Total Mensal],TbPessoas[A partir do mês],\"<=\" & 21,TbPessoas[Até],\">=\"& 21,TbPessoas[Meta:Atividade],LEFT(B75,FIND(\" \",B75,1)-1))","v":0},{"$f":"SUMIFS(TbPessoas[Custo Total Mensal],TbPessoas[A partir do mês],\"<=\" & 22,TbPessoas[Até],\">=\"& 22,TbPessoas[Meta:Atividade],LEFT(B75,FIND(\" \",B75,1)-1))","v":0},{"$f":"SUMIFS(TbPessoas[Custo Total Mensal],TbPessoas[A partir do mês],\"<=\" & 23,TbPessoas[Até],\">=\"& 23,TbPessoas[Meta:Atividade],LEFT(B75,FIND(\" \",B75,1)-1))","v":0},{"$f":"SUMIFS(TbPessoas[Custo Total Mensal],TbPessoas[A partir do mês],\"<=\" & 24,TbPessoas[Até],\">=\"& 24,TbPessoas[Meta:Atividade],LEFT(B75,FIND(\" \",B75,1)-1))","v":0},{"$f":"SUMIFS(TbPessoas[Custo Total Mensal],TbPessoas[A partir do mês],\"<=\" & 25,TbPessoas[Até],\">=\"& 25,TbPessoas[Meta:Atividade],LEFT(B75,FIND(\" \",B75,1)-1))","v":0},{"$f":"SUMIFS(TbPessoas[Custo Total Mensal],TbPessoas[A partir do mês],\"<=\" & 26,TbPessoas[Até],\">=\"& 26,TbPessoas[Meta:Atividade],LEFT(B75,FIND(\" \",B75,1)-1))","v":0},{"$f":"SUMIFS(TbPessoas[Custo Total Mensal],TbPessoas[A partir do mês],\"<=\" & 27,TbPessoas[Até],\">=\"& 27,TbPessoas[Meta:Atividade],LEFT(B75,FIND(\" \",B75,1)-1))","v":0},{"$f":"SUMIFS(TbPessoas[Custo Total Mensal],TbPessoas[A partir do mês],\"<=\" & 28,TbPessoas[Até],\">=\"& 28,TbPessoas[Meta:Atividade],LEFT(B75,FIND(\" \",B75,1)-1))","v":0},{"$f":"SUMIFS(TbPessoas[Custo Total Mensal],TbPessoas[A partir do mês],\"<=\" & 29,TbPessoas[Até],\">=\"& 29,TbPessoas[Meta:Atividade],LEFT(B75,FIND(\" \",B75,1)-1))","v":0},{"$f":"SUMIFS(TbPessoas[Custo Total Mensal],TbPessoas[A partir do mês],\"<=\" & 30,TbPessoas[Até],\">=\"& 30,TbPessoas[Meta:Atividade],LEFT(B75,FIND(\" \",B75,1)-1))","v":0},{"$f":"SUMIFS(TbPessoas[Custo Total Mensal],TbPessoas[A partir do mês],\"<=\" & 31,TbPessoas[Até],\">=\"& 31,TbPessoas[Meta:Atividade],LEFT(B75,FIND(\" \",B75,1)-1))","v":0},{"$f":"SUMIFS(TbPessoas[Custo Total Mensal],TbPessoas[A partir do mês],\"<=\" & 32,TbPessoas[Até],\">=\"& 32,TbPessoas[Meta:Atividade],LEFT(B75,FIND(\" \",B75,1)-1))","v":0},{"$f":"SUMIFS(TbPessoas[Custo Total Mensal],TbPessoas[A partir do mês],\"<=\" & 33,TbPessoas[Até],\">=\"& 33,TbPessoas[Meta:Atividade],LEFT(B75,FIND(\" \",B75,1)-1))","v":0},{"$f":"SUMIFS(TbPessoas[Custo Total Mensal],TbPessoas[A partir do mês],\"<=\" & 34,TbPessoas[Até],\">=\"& 34,TbPessoas[Meta:Atividade],LEFT(B75,FIND(\" \",B75,1)-1))","v":0},{"$f":"SUMIFS(TbPessoas[Custo Total Mensal],TbPessoas[A partir do mês],\"<=\" & 35,TbPessoas[Até],\">=\"& 35,TbPessoas[Meta:Atividade],LEFT(B75,FIND(\" \",B75,1)-1))","v":0},{"$f":"SUMIFS(TbPessoas[Custo Total Mensal],TbPessoas[A partir do mês],\"<=\" & 36,TbPessoas[Até],\">=\"& 36,TbPessoas[Meta:Atividade],LEFT(B75,FIND(\" \",B75,1)-1))","v":0},{"$f":"SUM(D75:AM75)","v":0}]
[null,null,"Pessoa Jurídica",{"$f":"SUMIFS(TBCompras[Valor Total Item (R$)],TBCompras[Mês do Projeto],\"<=\" & 1,TBCompras[Até],\">=\"& 1,TBCompras[Meta:Atividade],LEFT(B75,FIND(\" \",B75,1)-1),TBCompras[Tipo de Material],\"SERVIÇO\")","v":0},{"$f":"SUMIFS(TBCompras[Valor Total Item (R$)],TBCompras[Mês do Projeto],\"<=\" & 2,TBCompras[Até],\">=\"& 2,TBCompras[Meta:Atividade],LEFT(B75,FIND(\" \",B75,1)-1),TBCompras[Tipo de Material],\"SERVIÇO\")","v":0},{"$f":"SUMIFS(TBCompras[Valor Total Item (R$)],TBCompras[Mês do Projeto],\"<=\" & 3,TBCompras[Até],\">=\"& 3,TBCompras[Meta:Atividade],LEFT(B75,FIND(\" \",B75,1)-1),TBCompras[Tipo de Material],\"SERVIÇO\")","v":0},{"$f":"SUMIFS(TBCompras[Valor Total Item (R$)],TBCompras[Mês do Projeto],\"<=\" & 4,TBCompras[Até],\">=\"& 4,TBCompras[Meta:Atividade],LEFT(B75,FIND(\" \",B75,1)-1),TBCompras[Tipo de Material],\"SERVIÇO\")","v":0},{"$f":"SUMIFS(TBCompras[Valor Total Item (R$)],TBCompras[Mês do Projeto],\"<=\" & 5,TBCompras[Até],\">=\"& 5,TBCompras[Meta:Atividade],LEFT(B75,FIND(\" \",B75,1)-1),TBCompras[Tipo de Material],\"SERVIÇO\")","v":0},{"$f":"SUMIFS(TBCompras[Valor Total Item (R$)],TBCompras[Mês do Projeto],\"<=\" & 6,TBCompras[Até],\">=\"& 6,TBCompras[Meta:Atividade],LEFT(B75,FIND(\" \",B75,1)-1),TBCompras[Tipo de Material],\"SERVIÇO\")","v":0},{"$f":"SUMIFS(TBCompras[Valor Total Item (R$)],TBCompras[Mês do Projeto],\"<=\" & 7,TBCompras[Até],\">=\"& 7,TBCompras[Meta:Atividade],LEFT(B75,FIND(\" \",B75,1)-1),TBCompras[Tipo de Material],\"SERVIÇO\")","v":0},{"$f":"SUMIFS(TBCompras[Valor Total Item (R$)],TBCompras[Mês do Projeto],\"<=\" & 8,TBCompras[Até],\">=\"& 8,TBCompras[Meta:Atividade],LEFT(B75,FIND(\" \",B75,1)-1),TBCompras[Tipo de Material],\"SERVIÇO\")","v":0},{"$f":"SUMIFS(TBCompras[Valor Total Item (R$)],TBCompras[Mês do Projeto],\"<=\" & 9,TBCompras[Até],\">=\"& 9,TBCompras[Meta:Atividade],LEFT(B75,FIND(\" \",B75,1)-1),TBCompras[Tipo de Material],\"SERVIÇO\")","v":0},{"$f":"SUMIFS(TBCompras[Valor Total Item (R$)],TBCompras[Mês do Projeto],\"<=\" & 10,TBCompras[Até],\">=\"& 10,TBCompras[Meta:Atividade],LEFT(B75,FIND(\" \",B75,1)-1),TBCompras[Tipo de Material],\"SERVIÇO\")","v":0},{"$f":"SUMIFS(TBCompras[Valor Total Item (R$)],TBCompras[Mês do Projeto],\"<=\" & 11,TBCompras[Até],\">=\"& 11,TBCompras[Meta:Atividade],LEFT(B75,FIND(\" \",B75,1)-1),TBCompras[Tipo de Material],\"SERVIÇO\")","v":0},{"$f":"SUMIFS(TBCompras[Valor Total Item (R$)],TBCompras[Mês do Projeto],\"<=\" & 12,TBCompras[Até],\">=\"& 12,TBCompras[Meta:Atividade],LEFT(B75,FIND(\" \",B75,1)-1),TBCompras[Tipo de Material],\"SERVIÇO\")","v":0},{"$f":"SUMIFS(TBCompras[Valor Total Item (R$)],TBCompras[Mês do Projeto],\"<=\" & 13,TBCompras[Até],\">=\"& 13,TBCompras[Meta:Atividade],LEFT(B75,FIND(\" \",B75,1)-1),TBCompras[Tipo de Material],\"SERVIÇO\")","v":0},{"$f":"SUMIFS(TBCompras[Valor Total Item (R$)],TBCompras[Mês do Projeto],\"<=\" & 14,TBCompras[Até],\">=\"& 14,TBCompras[Meta:Atividade],LEFT(B75,FIND(\" \",B75,1)-1),TBCompras[Tipo de Material],\"SERVIÇO\")","v":0},{"$f":"SUMIFS(TBCompras[Valor Total Item (R$)],TBCompras[Mês do Projeto],\"<=\" & 15,TBCompras[Até],\">=\"& 15,TBCompras[Meta:Atividade],LEFT(B75,FIND(\" \",B75,1)-1),TBCompras[Tipo de Material],\"SERVIÇO\")","v":0},{"$f":"SUMIFS(TBCompras[Valor Total Item (R$)],TBCompras[Mês do Projeto],\"<=\" & 16,TBCompras[Até],\">=\"& 16,TBCompras[Meta:Atividade],LEFT(B75,FIND(\" \",B75,1)-1),TBCompras[Tipo de Material],\"SERVIÇO\")","v":0},{"$f":"SUMIFS(TBCompras[Valor Total Item (R$)],TBCompras[Mês do Projeto],\"<=\" & 17,TBCompras[Até],\">=\"& 17,TBCompras[Meta:Atividade],LEFT(B75,FIND(\" \",B75,1)-1),TBCompras[Tipo de Material],\"SERVIÇO\")","v":0},{"$f":"SUMIFS(TBCompras[Valor Total Item (R$)],TBCompras[Mês do Projeto],\"<=\" & 18,TBCompras[Até],\">=\"& 18,TBCompras[Meta:Atividade],LEFT(B75,FIND(\" \",B75,1)-1),TBCompras[Tipo de Material],\"SERVIÇO\")","v":0},{"$f":"SUMIFS(TBCompras[Valor Total Item (R$)],TBCompras[Mês do Projeto],\"<=\" & 19,TBCompras[Até],\">=\"& 19,TBCompras[Meta:Atividade],LEFT(B75,FIND(\" \",B75,1)-1),TBCompras[Tipo de Material],\"SERVIÇO\")","v":0},{"$f":"SUMIFS(TBCompras[Valor Total Item (R$)],TBCompras[Mês do Projeto],\"<=\" & 20,TBCompras[Até],\">=\"& 20,TBCompras[Meta:Atividade],LEFT(B75,FIND(\" \",B75,1)-1),TBCompras[Tipo de Material],\"SERVIÇO\")","v":0},{"$f":"SUMIFS(TBCompras[Valor Total Item (R$)],TBCompras[Mês do Projeto],\"<=\" & 21,TBCompras[Até],\">=\"& 21,TBCompras[Meta:Atividade],LEFT(B75,FIND(\" \",B75,1)-1),TBCompras[Tipo de Material],\"SERVIÇO\")","v":0},{"$f":"SUMIFS(TBCompras[Valor Total Item (R$)],TBCompras[Mês do Projeto],\"<=\" & 22,TBCompras[Até],\">=\"& 22,TBCompras[Meta:Atividade],LEFT(B75,FIND(\" \",B75,1)-1),TBCompras[Tipo de Material],\"SERVIÇO\")","v":0},{"$f":"SUMIFS(TBCompras[Valor Total Item (R$)],TBCompras[Mês do Projeto],\"<=\" & 23,TBCompras[Até],\">=\"& 23,TBCompras[Meta:Atividade],LEFT(B75,FIND(\" \",B75,1)-1),TBCompras[Tipo de Material],\"SERVIÇO\")","v":0},{"$f":"SUMIFS(TBCompras[Valor Total Item (R$)],TBCompras[Mês do Projeto],\"<=\" & 24,TBCompras[Até],\">=\"& 24,TBCompras[Meta:Atividade],LEFT(B75,FIND(\" \",B75,1)-1),TBCompras[Tipo de Material],\"SERVIÇO\")","v":0},{"$f":"SUMIFS(TBCompras[Valor Total Item (R$)],TBCompras[Mês do Projeto],\"<=\" & 25,TBCompras[Até],\">=\"& 25,TBCompras[Meta:Atividade],LEFT(B75,FIND(\" \",B75,1)-1),TBCompras[Tipo de Material],\"SERVIÇO\")","v":0},{"$f":"SUMIFS(TBCompras[Valor Total Item (R$)],TBCompras[Mês do Projeto],\"<=\" & 26,TBCompras[Até],\">=\"& 26,TBCompras[Meta:Atividade],LEFT(B75,FIND(\" \",B75,1)-1),TBCompras[Tipo de Material],\"SERVIÇO\")","v":0},{"$f":"SUMIFS(TBCompras[Valor Total Item (R$)],TBCompras[Mês do Projeto],\"<=\" & 27,TBCompras[Até],\">=\"& 27,TBCompras[Meta:Atividade],LEFT(B75,FIND(\" \",B75,1)-1),TBCompras[Tipo de Material],\"SERVIÇO\")","v":0},{"$f":"SUMIFS(TBCompras[Valor Total Item (R$)],TBCompras[Mês do Projeto],\"<=\" & 28,TBCompras[Até],\">=\"& 28,TBCompras[Meta:Atividade],LEFT(B75,FIND(\" \",B75,1)-1),TBCompras[Tipo de Material],\"SERVIÇO\")","v":0},{"$f":"SUMIFS(TBCompras[Valor Total Item (R$)],TBCompras[Mês do Projeto],\"<=\" & 29,TBCompras[Até],\">=\"& 29,TBCompras[Meta:Atividade],LEFT(B75,FIND(\" \",B75,1)-1),TBCompras[Tipo de Material],\"SERVIÇO\")","v":0},{"$f":"SUMIFS(TBCompras[Valor Total Item (R$)],TBCompras[Mês do Projeto],\"<=\" & 30,TBCompras[Até],\">=\"& 30,TBCompras[Meta:Atividade],LEFT(B75,FIND(\" \",B75,1)-1),TBCompras[Tipo de Material],\"SERVIÇO\")","v":0},{"$f":"SUMIFS(TBCompras[Valor Total Item (R$)],TBCompras[Mês do Projeto],\"<=\" & 31,TBCompras[Até],\">=\"& 31,TBCompras[Meta:Atividade],LEFT(B75,FIND(\" \",B75,1)-1),TBCompras[Tipo de Material],\"SERVIÇO\")","v":0},{"$f":"SUMIFS(TBCompras[Valor Total Item (R$)],TBCompras[Mês do Projeto],\"<=\" & 32,TBCompras[Até],\">=\"& 32,TBCompras[Meta:Atividade],LEFT(B75,FIND(\" \",B75,1)-1),TBCompras[Tipo de Material],\"SERVIÇO\")","v":0},{"$f":"SUMIFS(TBCompras[Valor Total Item (R$)],TBCompras[Mês do Projeto],\"<=\" & 33,TBCompras[Até],\">=\"& 33,TBCompras[Meta:Atividade],LEFT(B75,FIND(\" \",B75,1)-1),TBCompras[Tipo de Material],\"SERVIÇO\")","v":0},{"$f":"SUMIFS(TBCompras[Valor Total Item (R$)],TBCompras[Mês do Projeto],\"<=\" & 34,TBCompras[Até],\">=\"& 34,TBCompras[Meta:Atividade],LEFT(B75,FIND(\" \",B75,1)-1),TBCompras[Tipo de Material],\"SERVIÇO\")","v":0},{"$f":"SUMIFS(TBCompras[Valor Total Item (R$)],TBCompras[Mês do Projeto],\"<=\" & 35,TBCompras[Até],\">=\"& 35,TBCompras[Meta:Atividade],LEFT(B75,FIND(\" \",B75,1)-1),TBCompras[Tipo de Material],\"SERVIÇO\")","v":0},{"$f":"SUMIFS(TBCompras[Valor Total Item (R$)],TBCompras[Mês do Projeto],\"<=\" & 36,TBCompras[Até],\">=\"& 36,TBCompras[Meta:Atividade],LEFT(B75,FIND(\" \",B75,1)-1),TBCompras[Tipo de Material],\"SERVIÇO\")","v":0},0]
[null,null,"Passagens",{"$f":"SUMIFS(TbPassagens[Valor Total Passagem],TbPassagens[A partir do mês],\"<=\" & 1,TbPassagens[Até],\">=\"& 1,TbPassagens[Meta:Atividade],LEFT(B75,FIND(\" \",B75,1)-1))","v":0},{"$f":"SUMIFS(TbPassagens[Valor Total Passagem],TbPassagens[A partir do mês],\"<=\" & 2,TbPassagens[Até],\">=\"& 2,TbPassagens[Meta:Atividade],LEFT(B75,FIND(\" \",B75,1)-1))","v":0},{"$f":"SUMIFS(TbPassagens[Valor Total Passagem],TbPassagens[A partir do mês],\"<=\" & 3,TbPassagens[Até],\">=\"& 3,TbPassagens[Meta:Atividade],LEFT(B75,FIND(\" \",B75,1)-1))","v":0},{"$f":"SUMIFS(TbPassagens[Valor Total Passagem],TbPassagens[A partir do mês],\"<=\" & 4,TbPassagens[Até],\">=\"& 4,TbPassagens[Meta:Atividade],LEFT(B75,FIND(\" \",B75,1)-1))","v":0},{"$f":"SUMIFS(TbPassagens[Valor Total Passagem],TbPassagens[A partir do mês],\"<=\" & 5,TbPassagens[Até],\">=\"& 5,TbPassagens[Meta:Atividade],LEFT(B75,FIND(\" \",B75,1)-1))","v":0},{"$f":"SUMIFS(TbPassagens[Valor Total Passagem],TbPassagens[A partir do mês],\"<=\" & 6,TbPassagens[Até],\">=\"& 6,TbPassagens[Meta:Atividade],LEFT(B75,FIND(\" \",B75,1)-1))","v":0},{"$f":"SUMIFS(TbPassagens[Valor Total Passagem],TbPassagens[A partir do mês],\"<=\" & 7,TbPassagens[Até],\">=\"& 7,TbPassagens[Meta:Atividade],LEFT(B75,FIND(\" \",B75,1)-1))","v":0},{"$f":"SUMIFS(TbPassagens[Valor Total Passagem],TbPassagens[A partir do mês],\"<=\" & 8,TbPassagens[Até],\">=\"& 8,TbPassagens[Meta:Atividade],LEFT(B75,FIND(\" \",B75,1)-1))","v":0},{"$f":"SUMIFS(TbPassagens[Valor Total Passagem],TbPassagens[A partir do mês],\"<=\" & 9,TbPassagens[Até],\">=\"& 9,TbPassagens[Meta:Atividade],LEFT(B75,FIND(\" \",B75,1)-1))","v":0},{"$f":"SUMIFS(TbPassagens[Valor Total Passagem],TbPassagens[A partir do mês],\"<=\" & 10,TbPassagens[Até],\">=\"& 10,TbPassagens[Meta:Atividade],LEFT(B75,FIND(\" \",B75,1)-1))","v":0},{"$f":"SUMIFS(TbPassagens[Valor Total Passagem],TbPassagens[A partir do mês],\"<=\" & 11,TbPassagens[Até],\">=\"& 11,TbPassagens[Meta:Atividade],LEFT(B75,FIND(\" \",B75,1)-1))","v":0},{"$f":"SUMIFS(TbPassagens[Valor Total Passagem],TbPassagens[A partir do mês],\"<=\" & 12,TbPassagens[Até],\">=\"& 12,TbPassagens[Meta:Atividade],LEFT(B75,FIND(\" \",B75,1)-1))","v":0},{"$f":"SUMIFS(TbPassagens[Valor Total Passagem],TbPassagens[A partir do mês],\"<=\" & 13,TbPassagens[Até],\">=\"& 13,TbPassagens[Meta:Atividade],LEFT(B75,FIND(\" \",B75,1)-1))","v":0},{"$f":"SUMIFS(TbPassagens[Valor Total Passagem],TbPassagens[A partir do mês],\"<=\" & 14,TbPassagens[Até],\">=\"& 14,TbPassagens[Meta:Atividade],LEFT(B75,FIND(\" \",B75,1)-1))","v":0},{"$f":"SUMIFS(TbPassagens[Valor Total Passagem],TbPassagens[A partir do mês],\"<=\" & 15,TbPassagens[Até],\">=\"& 15,TbPassagens[Meta:Atividade],LEFT(B75,FIND(\" \",B75,1)-1))","v":0},{"$f":"SUMIFS(TbPassagens[Valor Total Passagem],TbPassagens[A partir do mês],\"<=\" & 16,TbPassagens[Até],\">=\"& 16,TbPassagens[Meta:Atividade],LEFT(B75,FIND(\" \",B75,1)-1))","v":0},{"$f":"SUMIFS(TbPassagens[Valor Total Passagem],TbPassagens[A partir do mês],\"<=\" & 17,TbPassagens[Até],\">=\"& 17,TbPassagens[Meta:Atividade],LEFT(B75,FIND(\" \",B75,1)-1))","v":0},{"$f":"SUMIFS(TbPassagens[Valor Total Passagem],TbPassagens[A partir do mês],\"<=\" & 18,TbPassagens[Até],\">=\"& 18,TbPassagens[Meta:Atividade],LEFT(B75,FIND(\" \",B75,1)-1))","v":0},{"$f":"SUMIFS(TbPassagens[Valor Total Passagem],TbPassagens[A partir do mês],\"<=\" & 19,TbPassagens[Até],\">=\"& 19,TbPassagens[Meta:Atividade],LEFT(B75,FIND(\" \",B75,1)-1))","v":0},{"$f":"SUMIFS(TbPassagens[Valor Total Passagem],TbPassagens[A partir do mês],\"<=\" & 20,TbPassagens[Até],\">=\"& 20,TbPassagens[Meta:Atividade],LEFT(B75,FIND(\" \",B75,1)-1))","v":0},{"$f":"SUMIFS(TbPassagens[Valor Total Passagem],TbPassagens[A partir do mês],\"<=\" & 21,TbPassagens[Até],\">=\"& 21,TbPassagens[Meta:Atividade],LEFT(B75,FIND(\" \",B75,1)-1))","v":0},{"$f":"SUMIFS(TbPassagens[Valor Total Passagem],TbPassagens[A partir do mês],\"<=\" & 22,TbPassagens[Até],\">=\"& 22,TbPassagens[Meta:Atividade],LEFT(B75,FIND(\" \",B75,1)-1))","v":0},{"$f":"SUMIFS(TbPassagens[Valor Total Passagem],TbPassagens[A partir do mês],\"<=\" & 23,TbPassagens[Até],\">=\"& 23,TbPassagens[Meta:Atividade],LEFT(B75,FIND(\" \",B75,1)-1))","v":0},{"$f":"SUMIFS(TbPassagens[Valor Total Passagem],TbPassagens[A partir do mês],\"<=\" & 24,TbPassagens[Até],\">=\"& 24,TbPassagens[Meta:Atividade],LEFT(B75,FIND(\" \",B75,1)-1))","v":0},{"$f":"SUMIFS(TbPassagens[Valor Total Passagem],TbPassagens[A partir do mês],\"<=\" & 25,TbPassagens[Até],\">=\"& 25,TbPassagens[Meta:Atividade],LEFT(B75,FIND(\" \",B75,1)-1))","v":0},{"$f":"SUMIFS(TbPassagens[Valor Total Passagem],TbPassagens[A partir do mês],\"<=\" & 26,TbPassagens[Até],\">=\"& 26,TbPassagens[Meta:Atividade],LEFT(B75,FIND(\" \",B75,1)-1))","v":0},{"$f":"SUMIFS(TbPassagens[Valor Total Passagem],TbPassagens[A partir do mês],\"<=\" & 27,TbPassagens[Até],\">=\"& 27,TbPassagens[Meta:Atividade],LEFT(B75,FIND(\" \",B75,1)-1))","v":0},{"$f":"SUMIFS(TbPassagens[Valor Total Passagem],TbPassagens[A partir do mês],\"<=\" & 28,TbPassagens[Até],\">=\"& 28,TbPassagens[Meta:Atividade],LEFT(B75,FIND(\" \",B75,1)-1))","v":0},{"$f":"SUMIFS(TbPassagens[Valor Total Passagem],TbPassagens[A partir do mês],\"<=\" & 29,TbPassagens[Até],\">=\"& 29,TbPassagens[Meta:Atividade],LEFT(B75,FIND(\" \",B75,1)-1))","v":0},{"$f":"SUMIFS(TbPassagens[Valor Total Passagem],TbPassagens[A partir do mês],\"<=\" & 30,TbPassagens[Até],\">=\"& 30,TbPassagens[Meta:Atividade],LEFT(B75,FIND(\" \",B75,1)-1))","v":0},{"$f":"SUMIFS(TbPassagens[Valor Total Passagem],TbPassagens[A partir do mês],\"<=\" & 31,TbPassagens[Até],\">=\"& 31,TbPassagens[Meta:Atividade],LEFT(B75,FIND(\" \",B75,1)-1))","v":0},{"$f":"SUMIFS(TbPassagens[Valor Total Passagem],TbPassagens[A partir do mês],\"<=\" & 32,TbPassagens[Até],\">=\"& 32,TbPassagens[Meta:Atividade],LEFT(B75,FIND(\" \",B75,1)-1))","v":0},{"$f":"SUMIFS(TbPassagens[Valor Total Passagem],TbPassagens[A partir do mês],\"<=\" & 33,TbPassagens[Até],\">=\"& 33,TbPassagens[Meta:Atividade],LEFT(B75,FIND(\" \",B75,1)-1))","v":0},{"$f":"SUMIFS(TbPassagens[Valor Total Passagem],TbPassagens[A partir do mês],\"<=\" & 34,TbPassagens[Até],\">=\"& 34,TbPassagens[Meta:Atividade],LEFT(B75,FIND(\" \",B75,1)-1))","v":0},{"$f":"SUMIFS(TbPassagens[Valor Total Passagem],TbPassagens[A partir do mês],\"<=\" & 35,TbPassagens[Até],\">=\"& 35,TbPassagens[Meta:Atividade],LEFT(B75,FIND(\" \",B75,1)-1))","v":0},{"$f":"SUMIFS(TbPassagens[Valor Total Passagem],TbPassagens[A partir do mês],\"<=\" & 36,TbPassagens[Até],\">=\"& 36,TbPassagens[Meta:Atividade],LEFT(B75,FIND(\" \",B75,1)-1))","v":0},0]
[null,null,"Diárias",{"$f":"SUMIFS(TbPassagens[Valor Total Diária],TbPassagens[A partir do mês],\"<=\" & 1,TbPassagens[Até],\">=\"& 1,TbPassagens[Meta:Atividade],LEFT(B75,FIND(\" \",B75,1)-1))","v":0},{"$f":"SUMIFS(TbPassagens[Valor Total Diária],TbPassagens[A partir do mês],\"<=\" & 2,TbPassagens[Até],\">=\"& 2,TbPassagens[Meta:Atividade],LEFT(B75,FIND(\" \",B75,1)-1))","v":0},{"$f":"SUMIFS(TbPassagens[Valor Total Diária],TbPassagens[A partir do mês],\"<=\" & 3,TbPassagens[Até],\">=\"& 3,TbPassagens[Meta:Atividade],LEFT(B75,FIND(\" \",B75,1)-1))","v":0},{"$f":"SUMIFS(TbPassagens[Valor Total Diária],TbPassagens[A partir do mês],\"<=\" & 4,TbPassagens[Até],\">=\"& 4,TbPassagens[Meta:Atividade],LEFT(B75,FIND(\" \",B75,1)-1))","v":0},{"$f":"SUMIFS(TbPassagens[Valor Total Diária],TbPassagens[A partir do mês],\"<=\" & 5,TbPassagens[Até],\">=\"& 5,TbPassagens[Meta:Atividade],LEFT(B75,FIND(\" \",B75,1)-1))","v":0},{"$f":"SUMIFS(TbPassagens[Valor Total Diária],TbPassagens[A partir do mês],\"<=\" & 6,TbPassagens[Até],\">=\"& 6,TbPassagens[Meta:Atividade],LEFT(B75,FIND(\" \",B75,1)-1))","v":0},{"$f":"SUMIFS(TbPassagens[Valor Total Diária],TbPassagens[A partir do mês],\"<=\" & 7,TbPassagens[Até],\">=\"& 7,TbPassagens[Meta:Atividade],LEFT(B75,FIND(\" \",B75,1)-1))","v":0},{"$f":"SUMIFS(TbPassagens[Valor Total Diária],TbPassagens[A partir do mês],\"<=\" & 8,TbPassagens[Até],\">=\"& 8,TbPassagens[Meta:Atividade],LEFT(B75,FIND(\" \",B75,1)-1))","v":0},{"$f":"SUMIFS(TbPassagens[Valor Total Diária],TbPassagens[A partir do mês],\"<=\" & 9,TbPassagens[Até],\">=\"& 9,TbPassagens[Meta:Atividade],LEFT(B75,FIND(\" \",B75,1)-1))","v":0},{"$f":"SUMIFS(TbPassagens[Valor Total Diária],TbPassagens[A partir do mês],\"<=\" & 10,TbPassagens[Até],\">=\"& 10,TbPassagens[Meta:Atividade],LEFT(B75,FIND(\" \",B75,1)-1))","v":0},{"$f":"SUMIFS(TbPassagens[Valor Total Diária],TbPassagens[A partir do mês],\"<=\" & 11,TbPassagens[Até],\">=\"& 11,TbPassagens[Meta:Atividade],LEFT(B75,FIND(\" \",B75,1)-1))","v":0},{"$f":"SUMIFS(TbPassagens[Valor Total Diária],TbPassagens[A partir do mês],\"<=\" & 12,TbPassagens[Até],\">=\"& 12,TbPassagens[Meta:Atividade],LEFT(B75,FIND(\" \",B75,1)-1))","v":0},{"$f":"SUMIFS(TbPassagens[Valor Total Diária],TbPassagens[A partir do mês],\"<=\" & 13,TbPassagens[Até],\">=\"& 13,TbPassagens[Meta:Atividade],LEFT(B75,FIND(\" \",B75,1)-1))","v":0},{"$f":"SUMIFS(TbPassagens[Valor Total Diária],TbPassagens[A partir do mês],\"<=\" & 14,TbPassagens[Até],\">=\"& 14,TbPassagens[Meta:Atividade],LEFT(B75,FIND(\" \",B75,1)-1))","v":0},{"$f":"SUMIFS(TbPassagens[Valor Total Diária],TbPassagens[A partir do mês],\"<=\" & 15,TbPassagens[Até],\">=\"& 15,TbPassagens[Meta:Atividade],LEFT(B75,FIND(\" \",B75,1)-1))","v":0},{"$f":"SUMIFS(TbPassagens[Valor Total Diária],TbPassagens[A partir do mês],\"<=\" & 16,TbPassagens[Até],\">=\"& 16,TbPassagens[Meta:Atividade],LEFT(B75,FIND(\" \",B75,1)-1))","v":0},{"$f":"SUMIFS(TbPassagens[Valor Total Diária],TbPassagens[A partir do mês],\"<=\" & 17,TbPassagens[Até],\">=\"& 17,TbPassagens[Meta:Atividade],LEFT(B75,FIND(\" \",B75,1)-1))","v":0},{"$f":"SUMIFS(TbPassagens[Valor Total Diária],TbPassagens[A partir do mês],\"<=\" & 18,TbPassagens[Até],\">=\"& 18,TbPassagens[Meta:Atividade],LEFT(B75,FIND(\" \",B75,1)-1))","v":0},{"$f":"SUMIFS(TbPassagens[Valor Total Diária],TbPassagens[A partir do mês],\"<=\" & 19,TbPassagens[Até],\">=\"& 19,TbPassagens[Meta:Atividade],LEFT(B75,FIND(\" \",B75,1)-1))","v":0},{"$f":"SUMIFS(TbPassagens[Valor Total Diária],TbPassagens[A partir do mês],\"<=\" & 20,TbPassagens[Até],\">=\"& 20,TbPassagens[Meta:Atividade],LEFT(B75,FIND(\" \",B75,1)-1))","v":0},{"$f":"SUMIFS(TbPassagens[Valor Total Diária],TbPassagens[A partir do mês],\"<=\" & 21,TbPassagens[Até],\">=\"& 21,TbPassagens[Meta:Atividade],LEFT(B75,FIND(\" \",B75,1)-1))","v":0},{"$f":"SUMIFS(TbPassagens[Valor Total Diária],TbPassagens[A partir do mês],\"<=\" & 22,TbPassagens[Até],\">=\"& 22,TbPassagens[Meta:Atividade],LEFT(B75,FIND(\" \",B75,1)-1))","v":0},{"$f":"SUMIFS(TbPassagens[Valor Total Diária],TbPassagens[A partir do mês],\"<=\" & 23,TbPassagens[Até],\">=\"& 23,TbPassagens[Meta:Atividade],LEFT(B75,FIND(\" \",B75,1)-1))","v":0},{"$f":"SUMIFS(TbPassagens[Valor Total Diária],TbPassagens[A partir do mês],\"<=\" & 24,TbPassagens[Até],\">=\"& 24,TbPassagens[Meta:Atividade],LEFT(B75,FIND(\" \",B75,1)-1))","v":0},{"$f":"SUMIFS(TbPassagens[Valor Total Diária],TbPassagens[A partir do mês],\"<=\" & 25,TbPassagens[Até],\">=\"& 25,TbPassagens[Meta:Atividade],LEFT(B75,FIND(\" \",B75,1)-1))","v":0},{"$f":"SUMIFS(TbPassagens[Valor Total Diária],TbPassagens[A partir do mês],\"<=\" & 26,TbPassagens[Até],\">=\"& 26,TbPassagens[Meta:Atividade],LEFT(B75,FIND(\" \",B75,1)-1))","v":0},{"$f":"SUMIFS(TbPassagens[Valor Total Diária],TbPassagens[A partir do mês],\"<=\" & 27,TbPassagens[Até],\">=\"& 27,TbPassagens[Meta:Atividade],LEFT(B75,FIND(\" \",B75,1)-1))","v":0},{"$f":"SUMIFS(TbPassagens[Valor Total Diária],TbPassagens[A partir do mês],\"<=\" & 28,TbPassagens[Até],\">=\"& 28,TbPassagens[Meta:Atividade],LEFT(B75,FIND(\" \",B75,1)-1))","v":0},{"$f":"SUMIFS(TbPassagens[Valor Total Diária],TbPassagens[A partir do mês],\"<=\" & 29,TbPassagens[Até],\">=\"& 29,TbPassagens[Meta:Atividade],LEFT(B75,FIND(\" \",B75,1)-1))","v":0},{"$f":"SUMIFS(TbPassagens[Valor Total Diária],TbPassagens[A partir do mês],\"<=\" & 30,TbPassagens[Até],\">=\"& 30,TbPassagens[Meta:Atividade],LEFT(B75,FIND(\" \",B75,1)-1))","v":0},{"$f":"SUMIFS(TbPassagens[Valor Total Diária],TbPassagens[A partir do mês],\"<=\" & 31,TbPassagens[Até],\">=\"& 31,TbPassagens[Meta:Atividade],LEFT(B75,FIND(\" \",B75,1)-1))","v":0},{"$f":"SUMIFS(TbPassagens[Valor Total Diária],TbPassagens[A partir do mês],\"<=\" & 32,TbPassagens[Até],\">=\"& 32,TbPassagens[Meta:Atividade],LEFT(B75,FIND(\" \",B75,1)-1))","v":0},{"$f":"SUMIFS(TbPassagens[Valor Total Diária],TbPassagens[A partir do mês],\"<=\" & 33,TbPassagens[Até],\">=\"& 33,TbPassagens[Meta:Atividade],LEFT(B75,FIND(\" \",B75,1)-1))","v":0},{"$f":"SUMIFS(TbPassagens[Valor Total Diária],TbPassagens[A partir do mês],\"<=\" & 34,TbPassagens[Até],\">=\"& 34,TbPassagens[Meta:Atividade],LEFT(B75,FIND(\" \",B75,1)-1))","v":0},{"$f":"SUMIFS(TbPassagens[Valor Total Diária],TbPassagens[A partir do mês],\"<=\" & 35,TbPassagens[Até],\">=\"& 35,TbPassagens[Meta:Atividade],LEFT(B75,FIND(\" \",B75,1)-1))","v":0},{"$f":"SUMIFS(TbPassagens[Valor Total Diária],TbPassagens[A partir do mês],\"<=\" & 36,TbPassagens[Até],\">=\"& 36,TbPassagens[Meta:Atividade],LEFT(B75,FIND(\" \",B75,1)-1))","v":0},0]
[null,null,"Material de Consumo",{"$f":"SUMIFS(TBCompras[Valor Total Item (R$)],TBCompras[Mês do Projeto],\"<=\" & 1,TBCompras[Até],\">=\"& 1,TBCompras[Meta:Atividade],LEFT(B75,FIND(\" \",B75,1)-1),TBCompras[Tipo de Material],\"CONSUMO\")","v":0},{"$f":"SUMIFS(TBCompras[Valor Total Item (R$)],TBCompras[Mês do Projeto],\"<=\" & 2,TBCompras[Até],\">=\"& 2,TBCompras[Meta:Atividade],LEFT(B75,FIND(\" \",B75,1)-1),TBCompras[Tipo de Material],\"CONSUMO\")","v":0},{"$f":"SUMIFS(TBCompras[Valor Total Item (R$)],TBCompras[Mês do Projeto],\"<=\" & 3,TBCompras[Até],\">=\"& 3,TBCompras[Meta:Atividade],LEFT(B75,FIND(\" \",B75,1)-1),TBCompras[Tipo de Material],\"CONSUMO\")","v":0},{"$f":"SUMIFS(TBCompras[Valor Total Item (R$)],TBCompras[Mês do Projeto],\"<=\" & 4,TBCompras[Até],\">=\"& 4,TBCompras[Meta:Atividade],LEFT(B75,FIND(\" \",B75,1)-1),TBCompras[Tipo de Material],\"CONSUMO\")","v":0},{"$f":"SUMIFS(TBCompras[Valor Total Item (R$)],TBCompras[Mês do Projeto],\"<=\" & 5,TBCompras[Até],\">=\"& 5,TBCompras[Meta:Atividade],LEFT(B75,FIND(\" \",B75,1)-1),TBCompras[Tipo de Material],\"CONSUMO\")","v":0},{"$f":"SUMIFS(TBCompras[Valor Total Item (R$)],TBCompras[Mês do Projeto],\"<=\" & 6,TBCompras[Até],\">=\"& 6,TBCompras[Meta:Atividade],LEFT(B75,FIND(\" \",B75,1)-1),TBCompras[Tipo de Material],\"CONSUMO\")","v":0},{"$f":"SUMIFS(TBCompras[Valor Total Item (R$)],TBCompras[Mês do Projeto],\"<=\" & 7,TBCompras[Até],\">=\"& 7,TBCompras[Meta:Atividade],LEFT(B75,FIND(\" \",B75,1)-1),TBCompras[Tipo de Material],\"CONSUMO\")","v":0},{"$f":"SUMIFS(TBCompras[Valor Total Item (R$)],TBCompras[Mês do Projeto],\"<=\" & 8,TBCompras[Até],\">=\"& 8,TBCompras[Meta:Atividade],LEFT(B75,FIND(\" \",B75,1)-1),TBCompras[Tipo de Material],\"CONSUMO\")","v":0},{"$f":"SUMIFS(TBCompras[Valor Total Item (R$)],TBCompras[Mês do Projeto],\"<=\" & 9,TBCompras[Até],\">=\"& 9,TBCompras[Meta:Atividade],LEFT(B75,FIND(\" \",B75,1)-1),TBCompras[Tipo de Material],\"CONSUMO\")","v":0},{"$f":"SUMIFS(TBCompras[Valor Total Item (R$)],TBCompras[Mês do Projeto],\"<=\" & 10,TBCompras[Até],\">=\"& 10,TBCompras[Meta:Atividade],LEFT(B75,FIND(\" \",B75,1)-1),TBCompras[Tipo de Material],\"CONSUMO\")","v":0},{"$f":"SUMIFS(TBCompras[Valor Total Item (R$)],TBCompras[Mês do Projeto],\"<=\" & 11,TBCompras[Até],\">=\"& 11,TBCompras[Meta:Atividade],LEFT(B75,FIND(\" \",B75,1)-1),TBCompras[Tipo de Material],\"CONSUMO\")","v":0},{"$f":"SUMIFS(TBCompras[Valor Total Item (R$)],TBCompras[Mês do Projeto],\"<=\" & 12,TBCompras[Até],\">=\"& 12,TBCompras[Meta:Atividade],LEFT(B75,FIND(\" \",B75,1)-1),TBCompras[Tipo de Material],\"CONSUMO\")","v":0},{"$f":"SUMIFS(TBCompras[Valor Total Item (R$)],TBCompras[Mês do Projeto],\"<=\" & 13,TBCompras[Até],\">=\"& 13,TBCompras[Meta:Atividade],LEFT(B75,FIND(\" \",B75,1)-1),TBCompras[Tipo de Material],\"CONSUMO\")","v":0},{"$f":"SUMIFS(TBCompras[Valor Total Item (R$)],TBCompras[Mês do Projeto],\"<=\" & 14,TBCompras[Até],\">=\"& 14,TBCompras[Meta:Atividade],LEFT(B75,FIND(\" \",B75,1)-1),TBCompras[Tipo de Material],\"CONSUMO\")","v":0},{"$f":"SUMIFS(TBCompras[Valor Total Item (R$)],TBCompras[Mês do Projeto],\"<=\" & 15,TBCompras[Até],\">=\"& 15,TBCompras[Meta:Atividade],LEFT(B75,FIND(\" \",B75,1)-1),TBCompras[Tipo de Material],\"CONSUMO\")","v":0},{"$f":"SUMIFS(TBCompras[Valor Total Item (R$)],TBCompras[Mês do Projeto],\"<=\" & 16,TBCompras[Até],\">=\"& 16,TBCompras[Meta:Atividade],LEFT(B75,FIND(\" \",B75,1)-1),TBCompras[Tipo de Material],\"CONSUMO\")","v":0},{"$f":"SUMIFS(TBCompras[Valor Total Item (R$)],TBCompras[Mês do Projeto],\"<=\" & 17,TBCompras[Até],\">=\"& 17,TBCompras[Meta:Atividade],LEFT(B75,FIND(\" \",B75,1)-1),TBCompras[Tipo de Material],\"CONSUMO\")","v":0},{"$f":"SUMIFS(TBCompras[Valor Total Item (R$)],TBCompras[Mês do Projeto],\"<=\" & 18,TBCompras[Até],\">=\"& 18,TBCompras[Meta:Atividade],LEFT(B75,FIND(\" \",B75,1)-1),TBCompras[Tipo de Material],\"CONSUMO\")","v":0},{"$f":"SUMIFS(TBCompras[Valor Total Item (R$)],TBCompras[Mês do Projeto],\"<=\" & 19,TBCompras[Até],\">=\"& 19,TBCompras[Meta:Atividade],LEFT(B75,FIND(\" \",B75,1)-1),TBCompras[Tipo de Material],\"CONSUMO\")","v":0},{"$f":"SUMIFS(TBCompras[Valor Total Item (R$)],TBCompras[Mês do Projeto],\"<=\" & 20,TBCompras[Até],\">=\"& 20,TBCompras[Meta:Atividade],LEFT(B75,FIND(\" \",B75,1)-1),TBCompras[Tipo de Material],\"CONSUMO\")","v":0},{"$f":"SUMIFS(TBCompras[Valor Total Item (R$)],TBCompras[Mês do Projeto],\"<=\" & 21,TBCompras[Até],\">=\"& 21,TBCompras[Meta:Atividade],LEFT(B75,FIND(\" \",B75,1)-1),TBCompras[Tipo de Material],\"CONSUMO\")","v":0},{"$f":"SUMIFS(TBCompras[Valor Total Item (R$)],TBCompras[Mês do Projeto],\"<=\" & 22,TBCompras[Até],\">=\"& 22,TBCompras[Meta:Atividade],LEFT(B75,FIND(\" \",B75,1)-1),TBCompras[Tipo de Material],\"CONSUMO\")","v":0},{"$f":"SUMIFS(TBCompras[Valor Total Item (R$)],TBCompras[Mês do Projeto],\"<=\" & 23,TBCompras[Até],\">=\"& 23,TBCompras[Meta:Atividade],LEFT(B75,FIND(\" \",B75,1)-1),TBCompras[Tipo de Material],\"CONSUMO\")","v":0},{"$f":"SUMIFS(TBCompras[Valor Total Item (R$)],TBCompras[Mês do Projeto],\"<=\" & 24,TBCompras[Até],\">=\"& 24,TBCompras[Meta:Atividade],LEFT(B75,FIND(\" \",B75,1)-1),TBCompras[Tipo de Material],\"CONSUMO\")","v":0},{"$f":"SUMIFS(TBCompras[Valor Total Item (R$)],TBCompras[Mês do Projeto],\"<=\" & 25,TBCompras[Até],\">=\"& 25,TBCompras[Meta:Atividade],LEFT(B75,FIND(\" \",B75,1)-1),TBCompras[Tipo de Material],\"CONSUMO\")","v":0},{"$f":"SUMIFS(TBCompras[Valor Total Item (R$)],TBCompras[Mês do Projeto],\"<=\" & 26,TBCompras[Até],\">=\"& 26,TBCompras[Meta:Atividade],LEFT(B75,FIND(\" \",B75,1)-1),TBCompras[Tipo de Material],\"CONSUMO\")","v":0},{"$f":"SUMIFS(TBCompras[Valor Total Item (R$)],TBCompras[Mês do Projeto],\"<=\" & 27,TBCompras[Até],\">=\"& 27,TBCompras[Meta:Atividade],LEFT(B75,FIND(\" \",B75,1)-1),TBCompras[Tipo de Material],\"CONSUMO\")","v":0},{"$f":"SUMIFS(TBCompras[Valor Total Item (R$)],TBCompras[Mês do Projeto],\"<=\" & 28,TBCompras[Até],\">=\"& 28,TBCompras[Meta:Atividade],LEFT(B75,FIND(\" \",B75,1)-1),TBCompras[Tipo de Material],\"CONSUMO\")","v":0},{"$f":"SUMIFS(TBCompras[Valor Total Item (R$)],TBCompras[Mês do Projeto],\"<=\" & 29,TBCompras[Até],\">=\"& 29,TBCompras[Meta:Atividade],LEFT(B75,FIND(\" \",B75,1)-1),TBCompras[Tipo de Material],\"CONSUMO\")","v":0},{"$f":"SUMIFS(TBCompras[Valor Total Item (R$)],TBCompras[Mês do Projeto],\"<=\" & 30,TBCompras[Até],\">=\"& 30,TBCompras[Meta:Atividade],LEFT(B75,FIND(\" \",B75,1)-1),TBCompras[Tipo de Material],\"CONSUMO\")","v":0},{"$f":"SUMIFS(TBCompras[Valor Total Item (R$)],TBCompras[Mês do Projeto],\"<=\" & 31,TBCompras[Até],\">=\"& 31,TBCompras[Meta:Atividade],LEFT(B75,FIND(\" \",B75,1)-1),TBCompras[Tipo de Material],\"CONSUMO\")","v":0},{"$f":"SUMIFS(TBCompras[Valor Total Item (R$)],TBCompras[Mês do Projeto],\"<=\" & 32,TBCompras[Até],\">=\"& 32,TBCompras[Meta:Atividade],LEFT(B75,FIND(\" \",B75,1)-1),TBCompras[Tipo de Material],\"CONSUMO\")","v":0},{"$f":"SUMIFS(TBCompras[Valor Total Item (R$)],TBCompras[Mês do Projeto],\"<=\" & 33,TBCompras[Até],\">=\"& 33,TBCompras[Meta:Atividade],LEFT(B75,FIND(\" \",B75,1)-1),TBCompras[Tipo de Material],\"CONSUMO\")","v":0},{"$f":"SUMIFS(TBCompras[Valor Total Item (R$)],TBCompras[Mês do Projeto],\"<=\" & 34,TBCompras[Até],\">=\"& 34,TBCompras[Meta:Atividade],LEFT(B75,FIND(\" \",B75,1)-1),TBCompras[Tipo de Material],\"CONSUMO\")","v":0},{"$f":"SUMIFS(TBCompras[Valor Total Item (R$)],TBCompras[Mês do Projeto],\"<=\" & 35,TBCompras[Até],\">=\"& 35,TBCompras[Meta:Atividade],LEFT(B75,FIND(\" \",B75,1)-1),TBCompras[Tipo de Material],\"CONSUMO\")","v":0},{"$f":"SUMIFS(TBCompras[Valor Total Item (R$)],TBCompras[Mês do Projeto],\"<=\" & 36,TBCompras[Até],\">=\"& 36,TBCompras[Meta:Atividade],LEFT(B75,FIND(\" \",B75,1)-1),TBCompras[Tipo de Material],\"CONSUMO\")","v":0},0]
[null,null,"Equipamentos",{"$f":"SUMIFS(TBCompras[Valor Total Item (R$)],TBCompras[Mês do Projeto],\"<=\" & 1,TBCompras[Até],\">=\"& 1,TBCompras[Meta:Atividade],LEFT(B75,FIND(\" \",B75,1)-1),TBCompras[Tipo de Material],\"EQUIPAMENTO\")","v":0},{"$f":"SUMIFS(TBCompras[Valor Total Item (R$)],TBCompras[Mês do Projeto],\"<=\" & 2,TBCompras[Até],\">=\"& 2,TBCompras[Meta:Atividade],LEFT(B75,FIND(\" \",B75,1)-1),TBCompras[Tipo de Material],\"EQUIPAMENTO\")","v":0},{"$f":"SUMIFS(TBCompras[Valor Total Item (R$)],TBCompras[Mês do Projeto],\"<=\" & 3,TBCompras[Até],\">=\"& 3,TBCompras[Meta:Atividade],LEFT(B75,FIND(\" \",B75,1)-1),TBCompras[Tipo de Material],\"EQUIPAMENTO\")","v":0},{"$f":"SUMIFS(TBCompras[Valor Total Item (R$)],TBCompras[Mês do Projeto],\"<=\" & 4,TBCompras[Até],\">=\"& 4,TBCompras[Meta:Atividade],LEFT(B75,FIND(\" \",B75,1)-1),TBCompras[Tipo de Material],\"EQUIPAMENTO\")","v":0},{"$f":"SUMIFS(TBCompras[Valor Total Item (R$)],TBCompras[Mês do Projeto],\"<=\" & 5,TBCompras[Até],\">=\"& 5,TBCompras[Meta:Atividade],LEFT(B75,FIND(\" \",B75,1)-1),TBCompras[Tipo de Material],\"EQUIPAMENTO\")","v":0},{"$f":"SUMIFS(TBCompras[Valor Total Item (R$)],TBCompras[Mês do Projeto],\"<=\" & 6,TBCompras[Até],\">=\"& 6,TBCompras[Meta:Atividade],LEFT(B75,FIND(\" \",B75,1)-1),TBCompras[Tipo de Material],\"EQUIPAMENTO\")","v":0},{"$f":"SUMIFS(TBCompras[Valor Total Item (R$)],TBCompras[Mês do Projeto],\"<=\" & 7,TBCompras[Até],\">=\"& 7,TBCompras[Meta:Atividade],LEFT(B75,FIND(\" \",B75,1)-1),TBCompras[Tipo de Material],\"EQUIPAMENTO\")","v":0},{"$f":"SUMIFS(TBCompras[Valor Total Item (R$)],TBCompras[Mês do Projeto],\"<=\" & 8,TBCompras[Até],\">=\"& 8,TBCompras[Meta:Atividade],LEFT(B75,FIND(\" \",B75,1)-1),TBCompras[Tipo de Material],\"EQUIPAMENTO\")","v":0},{"$f":"SUMIFS(TBCompras[Valor Total Item (R$)],TBCompras[Mês do Projeto],\"<=\" & 9,TBCompras[Até],\">=\"& 9,TBCompras[Meta:Atividade],LEFT(B75,FIND(\" \",B75,1)-1),TBCompras[Tipo de Material],\"EQUIPAMENTO\")","v":0},{"$f":"SUMIFS(TBCompras[Valor Total Item (R$)],TBCompras[Mês do Projeto],\"<=\" & 10,TBCompras[Até],\">=\"& 10,TBCompras[Meta:Atividade],LEFT(B75,FIND(\" \",B75,1)-1),TBCompras[Tipo de Material],\"EQUIPAMENTO\")","v":0},{"$f":"SUMIFS(TBCompras[Valor Total Item (R$)],TBCompras[Mês do Projeto],\"<=\" & 11,TBCompras[Até],\">=\"& 11,TBCompras[Meta:Atividade],LEFT(B75,FIND(\" \",B75,1)-1),TBCompras[Tipo de Material],\"EQUIPAMENTO\")","v":0},{"$f":"SUMIFS(TBCompras[Valor Total Item (R$)],TBCompras[Mês do Projeto],\"<=\" & 12,TBCompras[Até],\">=\"& 12,TBCompras[Meta:Atividade],LEFT(B75,FIND(\" \",B75,1)-1),TBCompras[Tipo de Material],\"EQUIPAMENTO\")","v":0},{"$f":"SUMIFS(TBCompras[Valor Total Item (R$)],TBCompras[Mês do Projeto],\"<=\" & 13,TBCompras[Até],\">=\"& 13,TBCompras[Meta:Atividade],LEFT(B75,FIND(\" \",B75,1)-1),TBCompras[Tipo de Material],\"EQUIPAMENTO\")","v":0},{"$f":"SUMIFS(TBCompras[Valor Total Item (R$)],TBCompras[Mês do Projeto],\"<=\" & 14,TBCompras[Até],\">=\"& 14,TBCompras[Meta:Atividade],LEFT(B75,FIND(\" \",B75,1)-1),TBCompras[Tipo de Material],\"EQUIPAMENTO\")","v":0},{"$f":"SUMIFS(TBCompras[Valor Total Item (R$)],TBCompras[Mês do Projeto],\"<=\" & 15,TBCompras[Até],\">=\"& 15,TBCompras[Meta:Atividade],LEFT(B75,FIND(\" \",B75,1)-1),TBCompras[Tipo de Material],\"EQUIPAMENTO\")","v":0},{"$f":"SUMIFS(TBCompras[Valor Total Item (R$)],TBCompras[Mês do Projeto],\"<=\" & 16,TBCompras[Até],\">=\"& 16,TBCompras[Meta:Atividade],LEFT(B75,FIND(\" \",B75,1)-1),TBCompras[Tipo de Material],\"EQUIPAMENTO\")","v":0},{"$f":"SUMIFS(TBCompras[Valor Total Item (R$)],TBCompras[Mês do Projeto],\"<=\" & 17,TBCompras[Até],\">=\"& 17,TBCompras[Meta:Atividade],LEFT(B75,FIND(\" \",B75,1)-1),TBCompras[Tipo de Material],\"EQUIPAMENTO\")","v":0},{"$f":"SUMIFS(TBCompras[Valor Total Item (R$)],TBCompras[Mês do Projeto],\"<=\" & 18,TBCompras[Até],\">=\"& 18,TBCompras[Meta:Atividade],LEFT(B75,FIND(\" \",B75,1)-1),TBCompras[Tipo de Material],\"EQUIPAMENTO\")","v":0},{"$f":"SUMIFS(TBCompras[Valor Total Item (R$)],TBCompras[Mês do Projeto],\"<=\" & 19,TBCompras[Até],\">=\"& 19,TBCompras[Meta:Atividade],LEFT(B75,FIND(\" \",B75,1)-1),TBCompras[Tipo de Material],\"EQUIPAMENTO\")","v":0},{"$f":"SUMIFS(TBCompras[Valor Total Item (R$)],TBCompras[Mês do Projeto],\"<=\" & 20,TBCompras[Até],\">=\"& 20,TBCompras[Meta:Atividade],LEFT(B75,FIND(\" \",B75,1)-1),TBCompras[Tipo de Material],\"EQUIPAMENTO\")","v":0},{"$f":"SUMIFS(TBCompras[Valor Total Item (R$)],TBCompras[Mês do Projeto],\"<=\" & 21,TBCompras[Até],\">=\"& 21,TBCompras[Meta:Atividade],LEFT(B75,FIND(\" \",B75,1)-1),TBCompras[Tipo de Material],\"EQUIPAMENTO\")","v":0},{"$f":"SUMIFS(TBCompras[Valor Total Item (R$)],TBCompras[Mês do Projeto],\"<=\" & 22,TBCompras[Até],\">=\"& 22,TBCompras[Meta:Atividade],LEFT(B75,FIND(\" \",B75,1)-1),TBCompras[Tipo de Material],\"EQUIPAMENTO\")","v":0},{"$f":"SUMIFS(TBCompras[Valor Total Item (R$)],TBCompras[Mês do Projeto],\"<=\" & 23,TBCompras[Até],\">=\"& 23,TBCompras[Meta:Atividade],LEFT(B75,FIND(\" \",B75,1)-1),TBCompras[Tipo de Material],\"EQUIPAMENTO\")","v":0},{"$f":"SUMIFS(TBCompras[Valor Total Item (R$)],TBCompras[Mês do Projeto],\"<=\" & 24,TBCompras[Até],\">=\"& 24,TBCompras[Meta:Atividade],LEFT(B75,FIND(\" \",B75,1)-1),TBCompras[Tipo de Material],\"EQUIPAMENTO\")","v":0},{"$f":"SUMIFS(TBCompras[Valor Total Item (R$)],TBCompras[Mês do Projeto],\"<=\" & 25,TBCompras[Até],\">=\"& 25,TBCompras[Meta:Atividade],LEFT(B75,FIND(\" \",B75,1)-1),TBCompras[Tipo de Material],\"EQUIPAMENTO\")","v":0},{"$f":"SUMIFS(TBCompras[Valor Total Item (R$)],TBCompras[Mês do Projeto],\"<=\" & 26,TBCompras[Até],\">=\"& 26,TBCompras[Meta:Atividade],LEFT(B75,FIND(\" \",B75,1)-1),TBCompras[Tipo de Material],\"EQUIPAMENTO\")","v":0},{"$f":"SUMIFS(TBCompras[Valor Total Item (R$)],TBCompras[Mês do Projeto],\"<=\" & 27,TBCompras[Até],\">=\"& 27,TBCompras[Meta:Atividade],LEFT(B75,FIND(\" \",B75,1)-1),TBCompras[Tipo de Material],\"EQUIPAMENTO\")","v":0},{"$f":"SUMIFS(TBCompras[Valor Total Item (R$)],TBCompras[Mês do Projeto],\"<=\" & 28,TBCompras[Até],\">=\"& 28,TBCompras[Meta:Atividade],LEFT(B75,FIND(\" \",B75,1)-1),TBCompras[Tipo de Material],\"EQUIPAMENTO\")","v":0},{"$f":"SUMIFS(TBCompras[Valor Total Item (R$)],TBCompras[Mês do Projeto],\"<=\" & 29,TBCompras[Até],\">=\"& 29,TBCompras[Meta:Atividade],LEFT(B75,FIND(\" \",B75,1)-1),TBCompras[Tipo de Material],\"EQUIPAMENTO\")","v":0},{"$f":"SUMIFS(TBCompras[Valor Total Item (R$)],TBCompras[Mês do Projeto],\"<=\" & 30,TBCompras[Até],\">=\"& 30,TBCompras[Meta:Atividade],LEFT(B75,FIND(\" \",B75,1)-1),TBCompras[Tipo de Material],\"EQUIPAMENTO\")","v":0},{"$f":"SUMIFS(TBCompras[Valor Total Item (R$)],TBCompras[Mês do Projeto],\"<=\" & 31,TBCompras[Até],\">=\"& 31,TBCompras[Meta:Atividade],LEFT(B75,FIND(\" \",B75,1)-1),TBCompras[Tipo de Material],\"EQUIPAMENTO\")","v":0},{"$f":"SUMIFS(TBCompras[Valor Total Item (R$)],TBCompras[Mês do Projeto],\"<=\" & 32,TBCompras[Até],\">=\"& 32,TBCompras[Meta:Atividade],LEFT(B75,FIND(\" \",B75,1)-1),TBCompras[Tipo de Material],\"EQUIPAMENTO\")","v":0},{"$f":"SUMIFS(TBCompras[Valor Total Item (R$)],TBCompras[Mês do Projeto],\"<=\" & 33,TBCompras[Até],\">=\"& 33,TBCompras[Meta:Atividade],LEFT(B75,FIND(\" \",B75,1)-1),TBCompras[Tipo de Material],\"EQUIPAMENTO\")","v":0},{"$f":"SUMIFS(TBCompras[Valor Total Item (R$)],TBCompras[Mês do Projeto],\"<=\" & 34,TBCompras[Até],\">=\"& 34,TBCompras[Meta:Atividade],LEFT(B75,FIND(\" \",B75,1)-1),TBCompras[Tipo de Material],\"EQUIPAMENTO\")","v":0},{"$f":"SUMIFS(TBCompras[Valor Total Item (R$)],TBCompras[Mês do Projeto],\"<=\" & 35,TBCompras[Até],\">=\"& 35,TBCompras[Meta:Atividade],LEFT(B75,FIND(\" \",B75,1)-1),TBCompras[Tipo de Material],\"EQUIPAMENTO\")","v":0},{"$f":"SUMIFS(TBCompras[Valor Total Item (R$)],TBCompras[Mês do Projeto],\"<=\" & 36,TBCompras[Até],\">=\"& 36,TBCompras[Meta:Atividade],LEFT(B75,FIND(\" \",B75,1)-1),TBCompras[Tipo de Material],\"EQUIPAMENTO\")","v":0},0]
[null,null,"Total Atividade 5.2",{"$f":"SUBTOTAL(9,D75:D80)","v":0},0,0,0,0,0,0,0,0,0,0,0,0,0,0,0,0,0,0,0,0,0,0,0,0,0,0,0,0,0,0,0,0,0,0,0,0]
[null,"5.3 - Produção do lote piloto fase I","Pessoa Física",{"$f":"SUMIFS(TbPessoas[Custo Total Mensal],TbPessoas[A partir do mês],\"<=\" & 1,TbPessoas[Até],\">=\"& 1,TbPessoas[Meta:Atividade],LEFT(B82,FIND(\" \",B82,1)-1))","v":0},{"$f":"SUMIFS(TbPessoas[Custo Total Mensal],TbPessoas[A partir do mês],\"<=\" & 2,TbPessoas[Até],\">=\"& 2,TbPessoas[Meta:Atividade],LEFT(B82,FIND(\" \",B82,1)-1))","v":0},{"$f":"SUMIFS(TbPessoas[Custo Total Mensal],TbPessoas[A partir do mês],\"<=\" & 3,TbPessoas[Até],\">=\"& 3,TbPessoas[Meta:Atividade],LEFT(B82,FIND(\" \",B82,1)-1))","v":0},{"$f":"SUMIFS(TbPessoas[Custo Total Mensal],TbPessoas[A partir do mês],\"<=\" & 4,TbPessoas[Até],\">=\"& 4,TbPessoas[Meta:Atividade],LEFT(B82,FIND(\" \",B82,1)-1))","v":0},{"$f":"SUMIFS(TbPessoas[Custo Total Mensal],TbPessoas[A partir do mês],\"<=\" & 5,TbPessoas[Até],\">=\"& 5,TbPessoas[Meta:Atividade],LEFT(B82,FIND(\" \",B82,1)-1))","v":0},{"$f":"SUMIFS(TbPessoas[Custo Total Mensal],TbPessoas[A partir do mês],\"<=\" & 6,TbPessoas[Até],\">=\"& 6,TbPessoas[Meta:Atividade],LEFT(B82,FIND(\" \",B82,1)-1))","v":0},{"$f":"SUMIFS(TbPessoas[Custo Total Mensal],TbPessoas[A partir do mês],\"<=\" & 7,TbPessoas[Até],\">=\"& 7,TbPessoas[Meta:Atividade],LEFT(B82,FIND(\" \",B82,1)-1))","v":0},{"$f":"SUMIFS(TbPessoas[Custo Total Mensal],TbPessoas[A partir do mês],\"<=\" & 8,TbPessoas[Até],\">=\"& 8,TbPessoas[Meta:Atividade],LEFT(B82,FIND(\" \",B82,1)-1))","v":0},{"$f":"SUMIFS(TbPessoas[Custo Total Mensal],TbPessoas[A partir do mês],\"<=\" & 9,TbPessoas[Até],\">=\"& 9,TbPessoas[Meta:Atividade],LEFT(B82,FIND(\" \",B82,1)-1))","v":0},{"$f":"SUMIFS(TbPessoas[Custo Total Mensal],TbPessoas[A partir do mês],\"<=\" & 10,TbPessoas[Até],\">=\"& 10,TbPessoas[Meta:Atividade],LEFT(B82,FIND(\" \",B82,1)-1))","v":0},{"$f":"SUMIFS(TbPessoas[Custo Total Mensal],TbPessoas[A partir do mês],\"<=\" & 11,TbPessoas[Até],\">=\"& 11,TbPessoas[Meta:Atividade],LEFT(B82,FIND(\" \",B82,1)-1))","v":0},{"$f":"SUMIFS(TbPessoas[Custo Total Mensal],TbPessoas[A partir do mês],\"<=\" & 12,TbPessoas[Até],\">=\"& 12,TbPessoas[Meta:Atividade],LEFT(B82,FIND(\" \",B82,1)-1))","v":0},{"$f":"SUMIFS(TbPessoas[Custo Total Mensal],TbPessoas[A partir do mês],\"<=\" & 13,TbPessoas[Até],\">=\"& 13,TbPessoas[Meta:Atividade],LEFT(B82,FIND(\" \",B82,1)-1))","v":0},{"$f":"SUMIFS(TbPessoas[Custo Total Mensal],TbPessoas[A partir do mês],\"<=\" & 14,TbPessoas[Até],\">=\"& 14,TbPessoas[Meta:Atividade],LEFT(B82,FIND(\" \",B82,1)-1))","v":0},{"$f":"SUMIFS(TbPessoas[Custo Total Mensal],TbPessoas[A partir do mês],\"<=\" & 15,TbPessoas[Até],\">=\"& 15,TbPessoas[Meta:Atividade],LEFT(B82,FIND(\" \",B82,1)-1))","v":0},{"$f":"SUMIFS(TbPessoas[Custo Total Mensal],TbPessoas[A partir do mês],\"<=\" & 16,TbPessoas[Até],\">=\"& 16,TbPessoas[Meta:Atividade],LEFT(B82,FIND(\" \",B82,1)-1))","v":0},{"$f":"SUMIFS(TbPessoas[Custo Total Mensal],TbPessoas[A partir do mês],\"<=\" & 17,TbPessoas[Até],\">=\"& 17,TbPessoas[Meta:Atividade],LEFT(B82,FIND(\" \",B82,1)-1))","v":0},{"$f":"SUMIFS(TbPessoas[Custo Total Mensal],TbPessoas[A partir do mês],\"<=\" & 18,TbPessoas[Até],\">=\"& 18,TbPessoas[Meta:Atividade],LEFT(B82,FIND(\" \",B82,1)-1))","v":0},{"$f":"SUMIFS(TbPessoas[Custo Total Mensal],TbPessoas[A partir do mês],\"<=\" & 19,TbPessoas[Até],\">=\"& 19,TbPessoas[Meta:Atividade],LEFT(B82,FIND(\" \",B82,1)-1))","v":0},{"$f":"SUMIFS(TbPessoas[Custo Total Mensal],TbPessoas[A partir do mês],\"<=\" & 20,TbPessoas[Até],\">=\"& 20,TbPessoas[Meta:Atividade],LEFT(B82,FIND(\" \",B82,1)-1))","v":0},{"$f":"SUMIFS(TbPessoas[Custo Total Mensal],TbPessoas[A partir do mês],\"<=\" & 21,TbPessoas[Até],\">=\"& 21,TbPessoas[Meta:Atividade],LEFT(B82,FIND(\" \",B82,1)-1))","v":0},{"$f":"SUMIFS(TbPessoas[Custo Total Mensal],TbPessoas[A partir do mês],\"<=\" & 22,TbPessoas[Até],\">=\"& 22,TbPessoas[Meta:Atividade],LEFT(B82,FIND(\" \",B82,1)-1))","v":0},{"$f":"SUMIFS(TbPessoas[Custo Total Mensal],TbPessoas[A partir do mês],\"<=\" & 23,TbPessoas[Até],\">=\"& 23,TbPessoas[Meta:Atividade],LEFT(B82,FIND(\" \",B82,1)-1))","v":0},{"$f":"SUMIFS(TbPessoas[Custo Total Mensal],TbPessoas[A partir do mês],\"<=\" & 24,TbPessoas[Até],\">=\"& 24,TbPessoas[Meta:Atividade],LEFT(B82,FIND(\" \",B82,1)-1))","v":0},{"$f":"SUMIFS(TbPessoas[Custo Total Mensal],TbPessoas[A partir do mês],\"<=\" & 25,TbPessoas[Até],\">=\"& 25,TbPessoas[Meta:Atividade],LEFT(B82,FIND(\" \",B82,1)-1))","v":0},{"$f":"SUMIFS(TbPessoas[Custo Total Mensal],TbPessoas[A partir do mês],\"<=\" & 26,TbPessoas[Até],\">=\"& 26,TbPessoas[Meta:Atividade],LEFT(B82,FIND(\" \",B82,1)-1))","v":0},{"$f":"SUMIFS(TbPessoas[Custo Total Mensal],TbPessoas[A partir do mês],\"<=\" & 27,TbPessoas[Até],\">=\"& 27,TbPessoas[Meta:Atividade],LEFT(B82,FIND(\" \",B82,1)-1))","v":0},{"$f":"SUMIFS(TbPessoas[Custo Total Mensal],TbPessoas[A partir do mês],\"<=\" & 28,TbPessoas[Até],\">=\"& 28,TbPessoas[Meta:Atividade],LEFT(B82,FIND(\" \",B82,1)-1))","v":0},{"$f":"SUMIFS(TbPessoas[Custo Total Mensal],TbPessoas[A partir do mês],\"<=\" & 29,TbPessoas[Até],\">=\"& 29,TbPessoas[Meta:Atividade],LEFT(B82,FIND(\" \",B82,1)-1))","v":0},{"$f":"SUMIFS(TbPessoas[Custo Total Mensal],TbPessoas[A partir do mês],\"<=\" & 30,TbPessoas[Até],\">=\"& 30,TbPessoas[Meta:Atividade],LEFT(B82,FIND(\" \",B82,1)-1))","v":0},{"$f":"SUMIFS(TbPessoas[Custo Total Mensal],TbPessoas[A partir do mês],\"<=\" & 31,TbPessoas[Até],\">=\"& 31,TbPessoas[Meta:Atividade],LEFT(B82,FIND(\" \",B82,1)-1))","v":0},{"$f":"SUMIFS(TbPessoas[Custo Total Mensal],TbPessoas[A partir do mês],\"<=\" & 32,TbPessoas[Até],\">=\"& 32,TbPessoas[Meta:Atividade],LEFT(B82,FIND(\" \",B82,1)-1))","v":0},{"$f":"SUMIFS(TbPessoas[Custo Total Mensal],TbPessoas[A partir do mês],\"<=\" & 33,TbPessoas[Até],\">=\"& 33,TbPessoas[Meta:Atividade],LEFT(B82,FIND(\" \",B82,1)-1))","v":0},{"$f":"SUMIFS(TbPessoas[Custo Total Mensal],TbPessoas[A partir do mês],\"<=\" & 34,TbPessoas[Até],\">=\"& 34,TbPessoas[Meta:Atividade],LEFT(B82,FIND(\" \",B82,1)-1))","v":0},{"$f":"SUMIFS(TbPessoas[Custo Total Mensal],TbPessoas[A partir do mês],\"<=\" & 35,TbPessoas[Até],\">=\"& 35,TbPessoas[Meta:Atividade],LEFT(B82,FIND(\" \",B82,1)-1))","v":0},{"$f":"SUMIFS(TbPessoas[Custo Total Mensal],TbPessoas[A partir do mês],\"<=\" & 36,TbPessoas[Até],\">=\"& 36,TbPessoas[Meta:Atividade],LEFT(B82,FIND(\" \",B82,1)-1))","v":0},{"$f":"SUM(D82:AM82)","v":0}]
[null,null,"Pessoa Jurídica",{"$f":"SUMIFS(TBCompras[Valor Total Item (R$)],TBCompras[Mês do Projeto],\"<=\" & 1,TBCompras[Até],\">=\"& 1,TBCompras[Meta:Atividade],LEFT(B82,FIND(\" \",B82,1)-1),TBCompras[Tipo de Material],\"SERVIÇO\")","v":0},{"$f":"SUMIFS(TBCompras[Valor Total Item (R$)],TBCompras[Mês do Projeto],\"<=\" & 2,TBCompras[Até],\">=\"& 2,TBCompras[Meta:Atividade],LEFT(B82,FIND(\" \",B82,1)-1),TBCompras[Tipo de Material],\"SERVIÇO\")","v":0},{"$f":"SUMIFS(TBCompras[Valor Total Item (R$)],TBCompras[Mês do Projeto],\"<=\" & 3,TBCompras[Até],\">=\"& 3,TBCompras[Meta:Atividade],LEFT(B82,FIND(\" \",B82,1)-1),TBCompras[Tipo de Material],\"SERVIÇO\")","v":0},{"$f":"SUMIFS(TBCompras[Valor Total Item (R$)],TBCompras[Mês do Projeto],\"<=\" & 4,TBCompras[Até],\">=\"& 4,TBCompras[Meta:Atividade],LEFT(B82,FIND(\" \",B82,1)-1),TBCompras[Tipo de Material],\"SERVIÇO\")","v":0},{"$f":"SUMIFS(TBCompras[Valor Total Item (R$)],TBCompras[Mês do Projeto],\"<=\" & 5,TBCompras[Até],\">=\"& 5,TBCompras[Meta:Atividade],LEFT(B82,FIND(\" \",B82,1)-1),TBCompras[Tipo de Material],\"SERVIÇO\")","v":0},{"$f":"SUMIFS(TBCompras[Valor Total Item (R$)],TBCompras[Mês do Projeto],\"<=\" & 6,TBCompras[Até],\">=\"& 6,TBCompras[Meta:Atividade],LEFT(B82,FIND(\" \",B82,1)-1),TBCompras[Tipo de Material],\"SERVIÇO\")","v":0},{"$f":"SUMIFS(TBCompras[Valor Total Item (R$)],TBCompras[Mês do Projeto],\"<=\" & 7,TBCompras[Até],\">=\"& 7,TBCompras[Meta:Atividade],LEFT(B82,FIND(\" \",B82,1)-1),TBCompras[Tipo de Material],\"SERVIÇO\")","v":0},{"$f":"SUMIFS(TBCompras[Valor Total Item (R$)],TBCompras[Mês do Projeto],\"<=\" & 8,TBCompras[Até],\">=\"& 8,TBCompras[Meta:Atividade],LEFT(B82,FIND(\" \",B82,1)-1),TBCompras[Tipo de Material],\"SERVIÇO\")","v":0},{"$f":"SUMIFS(TBCompras[Valor Total Item (R$)],TBCompras[Mês do Projeto],\"<=\" & 9,TBCompras[Até],\">=\"& 9,TBCompras[Meta:Atividade],LEFT(B82,FIND(\" \",B82,1)-1),TBCompras[Tipo de Material],\"SERVIÇO\")","v":0},{"$f":"SUMIFS(TBCompras[Valor Total Item (R$)],TBCompras[Mês do Projeto],\"<=\" & 10,TBCompras[Até],\">=\"& 10,TBCompras[Meta:Atividade],LEFT(B82,FIND(\" \",B82,1)-1),TBCompras[Tipo de Material],\"SERVIÇO\")","v":0},{"$f":"SUMIFS(TBCompras[Valor Total Item (R$)],TBCompras[Mês do Projeto],\"<=\" & 11,TBCompras[Até],\">=\"& 11,TBCompras[Meta:Atividade],LEFT(B82,FIND(\" \",B82,1)-1),TBCompras[Tipo de Material],\"SERVIÇO\")","v":0},{"$f":"SUMIFS(TBCompras[Valor Total Item (R$)],TBCompras[Mês do Projeto],\"<=\" & 12,TBCompras[Até],\">=\"& 12,TBCompras[Meta:Atividade],LEFT(B82,FIND(\" \",B82,1)-1),TBCompras[Tipo de Material],\"SERVIÇO\")","v":0},{"$f":"SUMIFS(TBCompras[Valor Total Item (R$)],TBCompras[Mês do Projeto],\"<=\" & 13,TBCompras[Até],\">=\"& 13,TBCompras[Meta:Atividade],LEFT(B82,FIND(\" \",B82,1)-1),TBCompras[Tipo de Material],\"SERVIÇO\")","v":0},{"$f":"SUMIFS(TBCompras[Valor Total Item (R$)],TBCompras[Mês do Projeto],\"<=\" & 14,TBCompras[Até],\">=\"& 14,TBCompras[Meta:Atividade],LEFT(B82,FIND(\" \",B82,1)-1),TBCompras[Tipo de Material],\"SERVIÇO\")","v":0},{"$f":"SUMIFS(TBCompras[Valor Total Item (R$)],TBCompras[Mês do Projeto],\"<=\" & 15,TBCompras[Até],\">=\"& 15,TBCompras[Meta:Atividade],LEFT(B82,FIND(\" \",B82,1)-1),TBCompras[Tipo de Material],\"SERVIÇO\")","v":0},{"$f":"SUMIFS(TBCompras[Valor Total Item (R$)],TBCompras[Mês do Projeto],\"<=\" & 16,TBCompras[Até],\">=\"& 16,TBCompras[Meta:Atividade],LEFT(B82,FIND(\" \",B82,1)-1),TBCompras[Tipo de Material],\"SERVIÇO\")","v":0},{"$f":"SUMIFS(TBCompras[Valor Total Item (R$)],TBCompras[Mês do Projeto],\"<=\" & 17,TBCompras[Até],\">=\"& 17,TBCompras[Meta:Atividade],LEFT(B82,FIND(\" \",B82,1)-1),TBCompras[Tipo de Material],\"SERVIÇO\")","v":0},{"$f":"SUMIFS(TBCompras[Valor Total Item (R$)],TBCompras[Mês do Projeto],\"<=\" & 18,TBCompras[Até],\">=\"& 18,TBCompras[Meta:Atividade],LEFT(B82,FIND(\" \",B82,1)-1),TBCompras[Tipo de Material],\"SERVIÇO\")","v":0},{"$f":"SUMIFS(TBCompras[Valor Total Item (R$)],TBCompras[Mês do Projeto],\"<=\" & 19,TBCompras[Até],\">=\"& 19,TBCompras[Meta:Atividade],LEFT(B82,FIND(\" \",B82,1)-1),TBCompras[Tipo de Material],\"SERVIÇO\")","v":0},{"$f":"SUMIFS(TBCompras[Valor Total Item (R$)],TBCompras[Mês do Projeto],\"<=\" & 20,TBCompras[Até],\">=\"& 20,TBCompras[Meta:Atividade],LEFT(B82,FIND(\" \",B82,1)-1),TBCompras[Tipo de Material],\"SERVIÇO\")","v":0},{"$f":"SUMIFS(TBCompras[Valor Total Item (R$)],TBCompras[Mês do Projeto],\"<=\" & 21,TBCompras[Até],\">=\"& 21,TBCompras[Meta:Atividade],LEFT(B82,FIND(\" \",B82,1)-1),TBCompras[Tipo de Material],\"SERVIÇO\")","v":0},{"$f":"SUMIFS(TBCompras[Valor Total Item (R$)],TBCompras[Mês do Projeto],\"<=\" & 22,TBCompras[Até],\">=\"& 22,TBCompras[Meta:Atividade],LEFT(B82,FIND(\" \",B82,1)-1),TBCompras[Tipo de Material],\"SERVIÇO\")","v":0},{"$f":"SUMIFS(TBCompras[Valor Total Item (R$)],TBCompras[Mês do Projeto],\"<=\" & 23,TBCompras[Até],\">=\"& 23,TBCompras[Meta:Atividade],LEFT(B82,FIND(\" \",B82,1)-1),TBCompras[Tipo de Material],\"SERVIÇO\")","v":0},{"$f":"SUMIFS(TBCompras[Valor Total Item (R$)],TBCompras[Mês do Projeto],\"<=\" & 24,TBCompras[Até],\">=\"& 24,TBCompras[Meta:Atividade],LEFT(B82,FIND(\" \",B82,1)-1),TBCompras[Tipo de Material],\"SERVIÇO\")","v":0},{"$f":"SUMIFS(TBCompras[Valor Total Item (R$)],TBCompras[Mês do Projeto],\"<=\" & 25,TBCompras[Até],\">=\"& 25,TBCompras[Meta:Atividade],LEFT(B82,FIND(\" \",B82,1)-1),TBCompras[Tipo de Material],\"SERVIÇO\")","v":0},{"$f":"SUMIFS(TBCompras[Valor Total Item (R$)],TBCompras[Mês do Projeto],\"<=\" & 26,TBCompras[Até],\">=\"& 26,TBCompras[Meta:Atividade],LEFT(B82,FIND(\" \",B82,1)-1),TBCompras[Tipo de Material],\"SERVIÇO\")","v":0},{"$f":"SUMIFS(TBCompras[Valor Total Item (R$)],TBCompras[Mês do Projeto],\"<=\" & 27,TBCompras[Até],\">=\"& 27,TBCompras[Meta:Atividade],LEFT(B82,FIND(\" \",B82,1)-1),TBCompras[Tipo de Material],\"SERVIÇO\")","v":0},{"$f":"SUMIFS(TBCompras[Valor Total Item (R$)],TBCompras[Mês do Projeto],\"<=\" & 28,TBCompras[Até],\">=\"& 28,TBCompras[Meta:Atividade],LEFT(B82,FIND(\" \",B82,1)-1),TBCompras[Tipo de Material],\"SERVIÇO\")","v":0},{"$f":"SUMIFS(TBCompras[Valor Total Item (R$)],TBCompras[Mês do Projeto],\"<=\" & 29,TBCompras[Até],\">=\"& 29,TBCompras[Meta:Atividade],LEFT(B82,FIND(\" \",B82,1)-1),TBCompras[Tipo de Material],\"SERVIÇO\")","v":0},{"$f":"SUMIFS(TBCompras[Valor Total Item (R$)],TBCompras[Mês do Projeto],\"<=\" & 30,TBCompras[Até],\">=\"& 30,TBCompras[Meta:Atividade],LEFT(B82,FIND(\" \",B82,1)-1),TBCompras[Tipo de Material],\"SERVIÇO\")","v":0},{"$f":"SUMIFS(TBCompras[Valor Total Item (R$)],TBCompras[Mês do Projeto],\"<=\" & 31,TBCompras[Até],\">=\"& 31,TBCompras[Meta:Atividade],LEFT(B82,FIND(\" \",B82,1)-1),TBCompras[Tipo de Material],\"SERVIÇO\")","v":0},{"$f":"SUMIFS(TBCompras[Valor Total Item (R$)],TBCompras[Mês do Projeto],\"<=\" & 32,TBCompras[Até],\">=\"& 32,TBCompras[Meta:Atividade],LEFT(B82,FIND(\" \",B82,1)-1),TBCompras[Tipo de Material],\"SERVIÇO\")","v":0},{"$f":"SUMIFS(TBCompras[Valor Total Item (R$)],TBCompras[Mês do Projeto],\"<=\" & 33,TBCompras[Até],\">=\"& 33,TBCompras[Meta:Atividade],LEFT(B82,FIND(\" \",B82,1)-1),TBCompras[Tipo de Material],\"SERVIÇO\")","v":0},{"$f":"SUMIFS(TBCompras[Valor Total Item (R$)],TBCompras[Mês do Projeto],\"<=\" & 34,TBCompras[Até],\">=\"& 34,TBCompras[Meta:Atividade],LEFT(B82,FIND(\" \",B82,1)-1),TBCompras[Tipo de Material],\"SERVIÇO\")","v":0},{"$f":"SUMIFS(TBCompras[Valor Total Item (R$)],TBCompras[Mês do Projeto],\"<=\" & 35,TBCompras[Até],\">=\"& 35,TBCompras[Meta:Atividade],LEFT(B82,FIND(\" \",B82,1)-1),TBCompras[Tipo de Material],\"SERVIÇO\")","v":0},{"$f":"SUMIFS(TBCompras[Valor Total Item (R$)],TBCompras[Mês do Projeto],\"<=\" & 36,TBCompras[Até],\">=\"& 36,TBCompras[Meta:Atividade],LEFT(B82,FIND(\" \",B82,1)-1),TBCompras[Tipo de Material],\"SERVIÇO\")","v":0},0]
[null,null,"Passagens",{"$f":"SUMIFS(TbPassagens[Valor Total Passagem],TbPassagens[A partir do mês],\"<=\" & 1,TbPassagens[Até],\">=\"& 1,TbPassagens[Meta:Atividade],LEFT(B82,FIND(\" \",B82,1)-1))","v":0},{"$f":"SUMIFS(TbPassagens[Valor Total Passagem],TbPassagens[A partir do mês],\"<=\" & 2,TbPassagens[Até],\">=\"& 2,TbPassagens[Meta:Atividade],LEFT(B82,FIND(\" \",B82,1)-1))","v":0},{"$f":"SUMIFS(TbPassagens[Valor Total Passagem],TbPassagens[A partir do mês],\"<=\" & 3,TbPassagens[Até],\">=\"& 3,TbPassagens[Meta:Atividade],LEFT(B82,FIND(\" \",B82,1)-1))","v":0},{"$f":"SUMIFS(TbPassagens[Valor Total Passagem],TbPassagens[A partir do mês],\"<=\" & 4,TbPassagens[Até],\">=\"& 4,TbPassagens[Meta:Atividade],LEFT(B82,FIND(\" \",B82,1)-1))","v":0},{"$f":"SUMIFS(TbPassagens[Valor Total Passagem],TbPassagens[A partir do mês],\"<=\" & 5,TbPassagens[Até],\">=\"& 5,TbPassagens[Meta:Atividade],LEFT(B82,FIND(\" \",B82,1)-1))","v":0},{"$f":"SUMIFS(TbPassagens[Valor Total Passagem],TbPassagens[A partir do mês],\"<=\" & 6,TbPassagens[Até],\">=\"& 6,TbPassagens[Meta:Atividade],LEFT(B82,FIND(\" \",B82,1)-1))","v":0},{"$f":"SUMIFS(TbPassagens[Valor Total Passagem],TbPassagens[A partir do mês],\"<=\" & 7,TbPassagens[Até],\">=\"& 7,TbPassagens[Meta:Atividade],LEFT(B82,FIND(\" \",B82,1)-1))","v":0},{"$f":"SUMIFS(TbPassagens[Valor Total Passagem],TbPassagens[A partir do mês],\"<=\" & 8,TbPassagens[Até],\">=\"& 8,TbPassagens[Meta:Atividade],LEFT(B82,FIND(\" \",B82,1)-1))","v":0},{"$f":"SUMIFS(TbPassagens[Valor Total Passagem],TbPassagens[A partir do mês],\"<=\" & 9,TbPassagens[Até],\">=\"& 9,TbPassagens[Meta:Atividade],LEFT(B82,FIND(\" \",B82,1)-1))","v":0},{"$f":"SUMIFS(TbPassagens[Valor Total Passagem],TbPassagens[A partir do mês],\"<=\" & 10,TbPassagens[Até],\">=\"& 10,TbPassagens[Meta:Atividade],LEFT(B82,FIND(\" \",B82,1)-1))","v":0},{"$f":"SUMIFS(TbPassagens[Valor Total Passagem],TbPassagens[A partir do mês],\"<=\" & 11,TbPassagens[Até],\">=\"& 11,TbPassagens[Meta:Atividade],LEFT(B82,FIND(\" \",B82,1)-1))","v":0},{"$f":"SUMIFS(TbPassagens[Valor Total Passagem],TbPassagens[A partir do mês],\"<=\" & 12,TbPassagens[Até],\">=\"& 12,TbPassagens[Meta:Atividade],LEFT(B82,FIND(\" \",B82,1)-1))","v":0},{"$f":"SUMIFS(TbPassagens[Valor Total Passagem],TbPassagens[A partir do mês],\"<=\" & 13,TbPassagens[Até],\">=\"& 13,TbPassagens[Meta:Atividade],LEFT(B82,FIND(\" \",B82,1)-1))","v":0},{"$f":"SUMIFS(TbPassagens[Valor Total Passagem],TbPassagens[A partir do mês],\"<=\" & 14,TbPassagens[Até],\">=\"& 14,TbPassagens[Meta:Atividade],LEFT(B82,FIND(\" \",B82,1)-1))","v":0},{"$f":"SUMIFS(TbPassagens[Valor Total Passagem],TbPassagens[A partir do mês],\"<=\" & 15,TbPassagens[Até],\">=\"& 15,TbPassagens[Meta:Atividade],LEFT(B82,FIND(\" \",B82,1)-1))","v":0},{"$f":"SUMIFS(TbPassagens[Valor Total Passagem],TbPassagens[A partir do mês],\"<=\" & 16,TbPassagens[Até],\">=\"& 16,TbPassagens[Meta:Atividade],LEFT(B82,FIND(\" \",B82,1)-1))","v":0},{"$f":"SUMIFS(TbPassagens[Valor Total Passagem],TbPassagens[A partir do mês],\"<=\" & 17,TbPassagens[Até],\">=\"& 17,TbPassagens[Meta:Atividade],LEFT(B82,FIND(\" \",B82,1)-1))","v":0},{"$f":"SUMIFS(TbPassagens[Valor Total Passagem],TbPassagens[A partir do mês],\"<=\" & 18,TbPassagens[Até],\">=\"& 18,TbPassagens[Meta:Atividade],LEFT(B82,FIND(\" \",B82,1)-1))","v":0},{"$f":"SUMIFS(TbPassagens[Valor Total Passagem],TbPassagens[A partir do mês],\"<=\" & 19,TbPassagens[Até],\">=\"& 19,TbPassagens[Meta:Atividade],LEFT(B82,FIND(\" \",B82,1)-1))","v":0},{"$f":"SUMIFS(TbPassagens[Valor Total Passagem],TbPassagens[A partir do mês],\"<=\" & 20,TbPassagens[Até],\">=\"& 20,TbPassagens[Meta:Atividade],LEFT(B82,FIND(\" \",B82,1)-1))","v":0},{"$f":"SUMIFS(TbPassagens[Valor Total Passagem],TbPassagens[A partir do mês],\"<=\" & 21,TbPassagens[Até],\">=\"& 21,TbPassagens[Meta:Atividade],LEFT(B82,FIND(\" \",B82,1)-1))","v":0},{"$f":"SUMIFS(TbPassagens[Valor Total Passagem],TbPassagens[A partir do mês],\"<=\" & 22,TbPassagens[Até],\">=\"& 22,TbPassagens[Meta:Atividade],LEFT(B82,FIND(\" \",B82,1)-1))","v":0},{"$f":"SUMIFS(TbPassagens[Valor Total Passagem],TbPassagens[A partir do mês],\"<=\" & 23,TbPassagens[Até],\">=\"& 23,TbPassagens[Meta:Atividade],LEFT(B82,FIND(\" \",B82,1)-1))","v":0},{"$f":"SUMIFS(TbPassagens[Valor Total Passagem],TbPassagens[A partir do mês],\"<=\" & 24,TbPassagens[Até],\">=\"& 24,TbPassagens[Meta:Atividade],LEFT(B82,FIND(\" \",B82,1)-1))","v":0},{"$f":"SUMIFS(TbPassagens[Valor Total Passagem],TbPassagens[A partir do mês],\"<=\" & 25,TbPassagens[Até],\">=\"& 25,TbPassagens[Meta:Atividade],LEFT(B82,FIND(\" \",B82,1)-1))","v":0},{"$f":"SUMIFS(TbPassagens[Valor Total Passagem],TbPassagens[A partir do mês],\"<=\" & 26,TbPassagens[Até],\">=\"& 26,TbPassagens[Meta:Atividade],LEFT(B82,FIND(\" \",B82,1)-1))","v":0},{"$f":"SUMIFS(TbPassagens[Valor Total Passagem],TbPassagens[A partir do mês],\"<=\" & 27,TbPassagens[Até],\">=\"& 27,TbPassagens[Meta:Atividade],LEFT(B82,FIND(\" \",B82,1)-1))","v":0},{"$f":"SUMIFS(TbPassagens[Valor Total Passagem],TbPassagens[A partir do mês],\"<=\" & 28,TbPassagens[Até],\">=\"& 28,TbPassagens[Meta:Atividade],LEFT(B82,FIND(\" \",B82,1)-1))","v":0},{"$f":"SUMIFS(TbPassagens[Valor Total Passagem],TbPassagens[A partir do mês],\"<=\" & 29,TbPassagens[Até],\">=\"& 29,TbPassagens[Meta:Atividade],LEFT(B82,FIND(\" \",B82,1)-1))","v":0},{"$f":"SUMIFS(TbPassagens[Valor Total Passagem],TbPassagens[A partir do mês],\"<=\" & 30,TbPassagens[Até],\">=\"& 30,TbPassagens[Meta:Atividade],LEFT(B82,FIND(\" \",B82,1)-1))","v":0},{"$f":"SUMIFS(TbPassagens[Valor Total Passagem],TbPassagens[A partir do mês],\"<=\" & 31,TbPassagens[Até],\">=\"& 31,TbPassagens[Meta:Atividade],LEFT(B82,FIND(\" \",B82,1)-1))","v":0},{"$f":"SUMIFS(TbPassagens[Valor Total Passagem],TbPassagens[A partir do mês],\"<=\" & 32,TbPassagens[Até],\">=\"& 32,TbPassagens[Meta:Atividade],LEFT(B82,FIND(\" \",B82,1)-1))","v":0},{"$f":"SUMIFS(TbPassagens[Valor Total Passagem],TbPassagens[A partir do mês],\"<=\" & 33,TbPassagens[Até],\">=\"& 33,TbPassagens[Meta:Atividade],LEFT(B82,FIND(\" \",B82,1)-1))","v":0},{"$f":"SUMIFS(TbPassagens[Valor Total Passagem],TbPassagens[A partir do mês],\"<=\" & 34,TbPassagens[Até],\">=\"& 34,TbPassagens[Meta:Atividade],LEFT(B82,FIND(\" \",B82,1)-1))","v":0},{"$f":"SUMIFS(TbPassagens[Valor Total Passagem],TbPassagens[A partir do mês],\"<=\" & 35,TbPassagens[Até],\">=\"& 35,TbPassagens[Meta:Atividade],LEFT(B82,FIND(\" \",B82,1)-1))","v":0},{"$f":"SUMIFS(TbPassagens[Valor Total Passagem],TbPassagens[A partir do mês],\"<=\" & 36,TbPassagens[Até],\">=\"& 36,TbPassagens[Meta:Atividade],LEFT(B82,FIND(\" \",B82,1)-1))","v":0},0]
[null,null,"Diárias",{"$f":"SUMIFS(TbPassagens[Valor Total Diária],TbPassagens[A partir do mês],\"<=\" & 1,TbPassagens[Até],\">=\"& 1,TbPassagens[Meta:Atividade],LEFT(B82,FIND(\" \",B82,1)-1))","v":0},{"$f":"SUMIFS(TbPassagens[Valor Total Diária],TbPassagens[A partir do mês],\"<=\" & 2,TbPassagens[Até],\">=\"& 2,TbPassagens[Meta:Atividade],LEFT(B82,FIND(\" \",B82,1)-1))","v":0},{"$f":"SUMIFS(TbPassagens[Valor Total Diária],TbPassagens[A partir do mês],\"<=\" & 3,TbPassagens[Até],\">=\"& 3,TbPassagens[Meta:Atividade],LEFT(B82,FIND(\" \",B82,1)-1))","v":0},{"$f":"SUMIFS(TbPassagens[Valor Total Diária],TbPassagens[A partir do mês],\"<=\" & 4,TbPassagens[Até],\">=\"& 4,TbPassagens[Meta:Atividade],LEFT(B82,FIND(\" \",B82,1)-1))","v":0},{"$f":"SUMIFS(TbPassagens[Valor Total Diária],TbPassagens[A partir do mês],\"<=\" & 5,TbPassagens[Até],\">=\"& 5,TbPassagens[Meta:Atividade],LEFT(B82,FIND(\" \",B82,1)-1))","v":0},{"$f":"SUMIFS(TbPassagens[Valor Total Diária],TbPassagens[A partir do mês],\"<=\" & 6,TbPassagens[Até],\">=\"& 6,TbPassagens[Meta:Atividade],LEFT(B82,FIND(\" \",B82,1)-1))","v":0},{"$f":"SUMIFS(TbPassagens[Valor Total Diária],TbPassagens[A partir do mês],\"<=\" & 7,TbPassagens[Até],\">=\"& 7,TbPassagens[Meta:Atividade],LEFT(B82,FIND(\" \",B82,1)-1))","v":0},{"$f":"SUMIFS(TbPassagens[Valor Total Diária],TbPassagens[A partir do mês],\"<=\" & 8,TbPassagens[Até],\">=\"& 8,TbPassagens[Meta:Atividade],LEFT(B82,FIND(\" \",B82,1)-1))","v":0},{"$f":"SUMIFS(TbPassagens[Valor Total Diária],TbPassagens[A partir do mês],\"<=\" & 9,TbPassagens[Até],\">=\"& 9,TbPassagens[Meta:Atividade],LEFT(B82,FIND(\" \",B82,1)-1))","v":0},{"$f":"SUMIFS(TbPassagens[Valor Total Diária],TbPassagens[A partir do mês],\"<=\" & 10,TbPassagens[Até],\">=\"& 10,TbPassagens[Meta:Atividade],LEFT(B82,FIND(\" \",B82,1)-1))","v":0},{"$f":"SUMIFS(TbPassagens[Valor Total Diária],TbPassagens[A partir do mês],\"<=\" & 11,TbPassagens[Até],\">=\"& 11,TbPassagens[Meta:Atividade],LEFT(B82,FIND(\" \",B82,1)-1))","v":0},{"$f":"SUMIFS(TbPassagens[Valor Total Diária],TbPassagens[A partir do mês],\"<=\" & 12,TbPassagens[Até],\">=\"& 12,TbPassagens[Meta:Atividade],LEFT(B82,FIND(\" \",B82,1)-1))","v":0},{"$f":"SUMIFS(TbPassagens[Valor Total Diária],TbPassagens[A partir do mês],\"<=\" & 13,TbPassagens[Até],\">=\"& 13,TbPassagens[Meta:Atividade],LEFT(B82,FIND(\" \",B82,1)-1))","v":0},{"$f":"SUMIFS(TbPassagens[Valor Total Diária],TbPassagens[A partir do mês],\"<=\" & 14,TbPassagens[Até],\">=\"& 14,TbPassagens[Meta:Atividade],LEFT(B82,FIND(\" \",B82,1)-1))","v":0},{"$f":"SUMIFS(TbPassagens[Valor Total Diária],TbPassagens[A partir do mês],\"<=\" & 15,TbPassagens[Até],\">=\"& 15,TbPassagens[Meta:Atividade],LEFT(B82,FIND(\" \",B82,1)-1))","v":0},{"$f":"SUMIFS(TbPassagens[Valor Total Diária],TbPassagens[A partir do mês],\"<=\" & 16,TbPassagens[Até],\">=\"& 16,TbPassagens[Meta:Atividade],LEFT(B82,FIND(\" \",B82,1)-1))","v":0},{"$f":"SUMIFS(TbPassagens[Valor Total Diária],TbPassagens[A partir do mês],\"<=\" & 17,TbPassagens[Até],\">=\"& 17,TbPassagens[Meta:Atividade],LEFT(B82,FIND(\" \",B82,1)-1))","v":0},{"$f":"SUMIFS(TbPassagens[Valor Total Diária],TbPassagens[A partir do mês],\"<=\" & 18,TbPassagens[Até],\">=\"& 18,TbPassagens[Meta:Atividade],LEFT(B82,FIND(\" \",B82,1)-1))","v":0},{"$f":"SUMIFS(TbPassagens[Valor Total Diária],TbPassagens[A partir do mês],\"<=\" & 19,TbPassagens[Até],\">=\"& 19,TbPassagens[Meta:Atividade],LEFT(B82,FIND(\" \",B82,1)-1))","v":0},{"$f":"SUMIFS(TbPassagens[Valor Total Diária],TbPassagens[A partir do mês],\"<=\" & 20,TbPassagens[Até],\">=\"& 20,TbPassagens[Meta:Atividade],LEFT(B82,FIND(\" \",B82,1)-1))","v":0},{"$f":"SUMIFS(TbPassagens[Valor Total Diária],TbPassagens[A partir do mês],\"<=\" & 21,TbPassagens[Até],\">=\"& 21,TbPassagens[Meta:Atividade],LEFT(B82,FIND(\" \",B82,1)-1))","v":0},{"$f":"SUMIFS(TbPassagens[Valor Total Diária],TbPassagens[A partir do mês],\"<=\" & 22,TbPassagens[Até],\">=\"& 22,TbPassagens[Meta:Atividade],LEFT(B82,FIND(\" \",B82,1)-1))","v":0},{"$f":"SUMIFS(TbPassagens[Valor Total Diária],TbPassagens[A partir do mês],\"<=\" & 23,TbPassagens[Até],\">=\"& 23,TbPassagens[Meta:Atividade],LEFT(B82,FIND(\" \",B82,1)-1))","v":0},{"$f":"SUMIFS(TbPassagens[Valor Total Diária],TbPassagens[A partir do mês],\"<=\" & 24,TbPassagens[Até],\">=\"& 24,TbPassagens[Meta:Atividade],LEFT(B82,FIND(\" \",B82,1)-1))","v":0},{"$f":"SUMIFS(TbPassagens[Valor Total Diária],TbPassagens[A partir do mês],\"<=\" & 25,TbPassagens[Até],\">=\"& 25,TbPassagens[Meta:Atividade],LEFT(B82,FIND(\" \",B82,1)-1))","v":0},{"$f":"SUMIFS(TbPassagens[Valor Total Diária],TbPassagens[A partir do mês],\"<=\" & 26,TbPassagens[Até],\">=\"& 26,TbPassagens[Meta:Atividade],LEFT(B82,FIND(\" \",B82,1)-1))","v":0},{"$f":"SUMIFS(TbPassagens[Valor Total Diária],TbPassagens[A partir do mês],\"<=\" & 27,TbPassagens[Até],\">=\"& 27,TbPassagens[Meta:Atividade],LEFT(B82,FIND(\" \",B82,1)-1))","v":0},{"$f":"SUMIFS(TbPassagens[Valor Total Diária],TbPassagens[A partir do mês],\"<=\" & 28,TbPassagens[Até],\">=\"& 28,TbPassagens[Meta:Atividade],LEFT(B82,FIND(\" \",B82,1)-1))","v":0},{"$f":"SUMIFS(TbPassagens[Valor Total Diária],TbPassagens[A partir do mês],\"<=\" & 29,TbPassagens[Até],\">=\"& 29,TbPassagens[Meta:Atividade],LEFT(B82,FIND(\" \",B82,1)-1))","v":0},{"$f":"SUMIFS(TbPassagens[Valor Total Diária],TbPassagens[A partir do mês],\"<=\" & 30,TbPassagens[Até],\">=\"& 30,TbPassagens[Meta:Atividade],LEFT(B82,FIND(\" \",B82,1)-1))","v":0},{"$f":"SUMIFS(TbPassagens[Valor Total Diária],TbPassagens[A partir do mês],\"<=\" & 31,TbPassagens[Até],\">=\"& 31,TbPassagens[Meta:Atividade],LEFT(B82,FIND(\" \",B82,1)-1))","v":0},{"$f":"SUMIFS(TbPassagens[Valor Total Diária],TbPassagens[A partir do mês],\"<=\" & 32,TbPassagens[Até],\">=\"& 32,TbPassagens[Meta:Atividade],LEFT(B82,FIND(\" \",B82,1)-1))","v":0},{"$f":"SUMIFS(TbPassagens[Valor Total Diária],TbPassagens[A partir do mês],\"<=\" & 33,TbPassagens[Até],\">=\"& 33,TbPassagens[Meta:Atividade],LEFT(B82,FIND(\" \",B82,1)-1))","v":0},{"$f":"SUMIFS(TbPassagens[Valor Total Diária],TbPassagens[A partir do mês],\"<=\" & 34,TbPassagens[Até],\">=\"& 34,TbPassagens[Meta:Atividade],LEFT(B82,FIND(\" \",B82,1)-1))","v":0},{"$f":"SUMIFS(TbPassagens[Valor Total Diária],TbPassagens[A partir do mês],\"<=\" & 35,TbPassagens[Até],\">=\"& 35,TbPassagens[Meta:Atividade],LEFT(B82,FIND(\" \",B82,1)-1))","v":0},{"$f":"SUMIFS(TbPassagens[Valor Total Diária],TbPassagens[A partir do mês],\"<=\" & 36,TbPassagens[Até],\">=\"& 36,TbPassagens[Meta:Atividade],LEFT(B82,FIND(\" \",B82,1)-1))","v":0},0]
[null,null,"Material de Consumo",{"$f":"SUMIFS(TBCompras[Valor Total Item (R$)],TBCompras[Mês do Projeto],\"<=\" & 1,TBCompras[Até],\">=\"& 1,TBCompras[Meta:Atividade],LEFT(B82,FIND(\" \",B82,1)-1),TBCompras[Tipo de Material],\"CONSUMO\")","v":0},{"$f":"SUMIFS(TBCompras[Valor Total Item (R$)],TBCompras[Mês do Projeto],\"<=\" & 2,TBCompras[Até],\">=\"& 2,TBCompras[Meta:Atividade],LEFT(B82,FIND(\" \",B82,1)-1),TBCompras[Tipo de Material],\"CONSUMO\")","v":0},{"$f":"SUMIFS(TBCompras[Valor Total Item (R$)],TBCompras[Mês do Projeto],\"<=\" & 3,TBCompras[Até],\">=\"& 3,TBCompras[Meta:Atividade],LEFT(B82,FIND(\" \",B82,1)-1),TBCompras[Tipo de Material],\"CONSUMO\")","v":0},{"$f":"SUMIFS(TBCompras[Valor Total Item (R$)],TBCompras[Mês do Projeto],\"<=\" & 4,TBCompras[Até],\">=\"& 4,TBCompras[Meta:Atividade],LEFT(B82,FIND(\" \",B82,1)-1),TBCompras[Tipo de Material],\"CONSUMO\")","v":0},{"$f":"SUMIFS(TBCompras[Valor Total Item (R$)],TBCompras[Mês do Projeto],\"<=\" & 5,TBCompras[Até],\">=\"& 5,TBCompras[Meta:Atividade],LEFT(B82,FIND(\" \",B82,1)-1),TBCompras[Tipo de Material],\"CONSUMO\")","v":0},{"$f":"SUMIFS(TBCompras[Valor Total Item (R$)],TBCompras[Mês do Projeto],\"<=\" & 6,TBCompras[Até],\">=\"& 6,TBCompras[Meta:Atividade],LEFT(B82,FIND(\" \",B82,1)-1),TBCompras[Tipo de Material],\"CONSUMO\")","v":0},{"$f":"SUMIFS(TBCompras[Valor Total Item (R$)],TBCompras[Mês do Projeto],\"<=\" & 7,TBCompras[Até],\">=\"& 7,TBCompras[Meta:Atividade],LEFT(B82,FIND(\" \",B82,1)-1),TBCompras[Tipo de Material],\"CONSUMO\")","v":0},{"$f":"SUMIFS(TBCompras[Valor Total Item (R$)],TBCompras[Mês do Projeto],\"<=\" & 8,TBCompras[Até],\">=\"& 8,TBCompras[Meta:Atividade],LEFT(B82,FIND(\" \",B82,1)-1),TBCompras[Tipo de Material],\"CONSUMO\")","v":0},{"$f":"SUMIFS(TBCompras[Valor Total Item (R$)],TBCompras[Mês do Projeto],\"<=\" & 9,TBCompras[Até],\">=\"& 9,TBCompras[Meta:Atividade],LEFT(B82,FIND(\" \",B82,1)-1),TBCompras[Tipo de Material],\"CONSUMO\")","v":0},{"$f":"SUMIFS(TBCompras[Valor Total Item (R$)],TBCompras[Mês do Projeto],\"<=\" & 10,TBCompras[Até],\">=\"& 10,TBCompras[Meta:Atividade],LEFT(B82,FIND(\" \",B82,1)-1),TBCompras[Tipo de Material],\"CONSUMO\")","v":0},{"$f":"SUMIFS(TBCompras[Valor Total Item (R$)],TBCompras[Mês do Projeto],\"<=\" & 11,TBCompras[Até],\">=\"& 11,TBCompras[Meta:Atividade],LEFT(B82,FIND(\" \",B82,1)-1),TBCompras[Tipo de Material],\"CONSUMO\")","v":0},{"$f":"SUMIFS(TBCompras[Valor Total Item (R$)],TBCompras[Mês do Projeto],\"<=\" & 12,TBCompras[Até],\">=\"& 12,TBCompras[Meta:Atividade],LEFT(B82,FIND(\" \",B82,1)-1),TBCompras[Tipo de Material],\"CONSUMO\")","v":0},{"$f":"SUMIFS(TBCompras[Valor Total Item (R$)],TBCompras[Mês do Projeto],\"<=\" & 13,TBCompras[Até],\">=\"& 13,TBCompras[Meta:Atividade],LEFT(B82,FIND(\" \",B82,1)-1),TBCompras[Tipo de Material],\"CONSUMO\")","v":0},{"$f":"SUMIFS(TBCompras[Valor Total Item (R$)],TBCompras[Mês do Projeto],\"<=\" & 14,TBCompras[Até],\">=\"& 14,TBCompras[Meta:Atividade],LEFT(B82,FIND(\" \",B82,1)-1),TBCompras[Tipo de Material],\"CONSUMO\")","v":0},{"$f":"SUMIFS(TBCompras[Valor Total Item (R$)],TBCompras[Mês do Projeto],\"<=\" & 15,TBCompras[Até],\">=\"& 15,TBCompras[Meta:Atividade],LEFT(B82,FIND(\" \",B82,1)-1),TBCompras[Tipo de Material],\"CONSUMO\")","v":0},{"$f":"SUMIFS(TBCompras[Valor Total Item (R$)],TBCompras[Mês do Projeto],\"<=\" & 16,TBCompras[Até],\">=\"& 16,TBCompras[Meta:Atividade],LEFT(B82,FIND(\" \",B82,1)-1),TBCompras[Tipo de Material],\"CONSUMO\")","v":0},{"$f":"SUMIFS(TBCompras[Valor Total Item (R$)],TBCompras[Mês do Projeto],\"<=\" & 17,TBCompras[Até],\">=\"& 17,TBCompras[Meta:Atividade],LEFT(B82,FIND(\" \",B82,1)-1),TBCompras[Tipo de Material],\"CONSUMO\")","v":0},{"$f":"SUMIFS(TBCompras[Valor Total Item (R$)],TBCompras[Mês do Projeto],\"<=\" & 18,TBCompras[Até],\">=\"& 18,TBCompras[Meta:Atividade],LEFT(B82,FIND(\" \",B82,1)-1),TBCompras[Tipo de Material],\"CONSUMO\")","v":0},{"$f":"SUMIFS(TBCompras[Valor Total Item (R$)],TBCompras[Mês do Projeto],\"<=\" & 19,TBCompras[Até],\">=\"& 19,TBCompras[Meta:Atividade],LEFT(B82,FIND(\" \",B82,1)-1),TBCompras[Tipo de Material],\"CONSUMO\")","v":0},{"$f":"SUMIFS(TBCompras[Valor Total Item (R$)],TBCompras[Mês do Projeto],\"<=\" & 20,TBCompras[Até],\">=\"& 20,TBCompras[Meta:Atividade],LEFT(B82,FIND(\" \",B82,1)-1),TBCompras[Tipo de Material],\"CONSUMO\")","v":0},{"$f":"SUMIFS(TBCompras[Valor Total Item (R$)],TBCompras[Mês do Projeto],\"<=\" & 21,TBCompras[Até],\">=\"& 21,TBCompras[Meta:Atividade],LEFT(B82,FIND(\" \",B82,1)-1),TBCompras[Tipo de Material],\"CONSUMO\")","v":0},{"$f":"SUMIFS(TBCompras[Valor Total Item (R$)],TBCompras[Mês do Projeto],\"<=\" & 22,TBCompras[Até],\">=\"& 22,TBCompras[Meta:Atividade],LEFT(B82,FIND(\" \",B82,1)-1),TBCompras[Tipo de Material],\"CONSUMO\")","v":0},{"$f":"SUMIFS(TBCompras[Valor Total Item (R$)],TBCompras[Mês do Projeto],\"<=\" & 23,TBCompras[Até],\">=\"& 23,TBCompras[Meta:Atividade],LEFT(B82,FIND(\" \",B82,1)-1),TBCompras[Tipo de Material],\"CONSUMO\")","v":0},{"$f":"SUMIFS(TBCompras[Valor Total Item (R$)],TBCompras[Mês do Projeto],\"<=\" & 24,TBCompras[Até],\">=\"& 24,TBCompras[Meta:Atividade],LEFT(B82,FIND(\" \",B82,1)-1),TBCompras[Tipo de Material],\"CONSUMO\")","v":0},{"$f":"SUMIFS(TBCompras[Valor Total Item (R$)],TBCompras[Mês do Projeto],\"<=\" & 25,TBCompras[Até],\">=\"& 25,TBCompras[Meta:Atividade],LEFT(B82,FIND(\" \",B82,1)-1),TBCompras[Tipo de Material],\"CONSUMO\")","v":0},{"$f":"SUMIFS(TBCompras[Valor Total Item (R$)],TBCompras[Mês do Projeto],\"<=\" & 26,TBCompras[Até],\">=\"& 26,TBCompras[Meta:Atividade],LEFT(B82,FIND(\" \",B82,1)-1),TBCompras[Tipo de Material],\"CONSUMO\")","v":0},{"$f":"SUMIFS(TBCompras[Valor Total Item (R$)],TBCompras[Mês do Projeto],\"<=\" & 27,TBCompras[Até],\">=\"& 27,TBCompras[Meta:Atividade],LEFT(B82,FIND(\" \",B82,1)-1),TBCompras[Tipo de Material],\"CONSUMO\")","v":0},{"$f":"SUMIFS(TBCompras[Valor Total Item (R$)],TBCompras[Mês do Projeto],\"<=\" & 28,TBCompras[Até],\">=\"& 28,TBCompras[Meta:Atividade],LEFT(B82,FIND(\" \",B82,1)-1),TBCompras[Tipo de Material],\"CONSUMO\")","v":0},{"$f":"SUMIFS(TBCompras[Valor Total Item (R$)],TBCompras[Mês do Projeto],\"<=\" & 29,TBCompras[Até],\">=\"& 29,TBCompras[Meta:Atividade],LEFT(B82,FIND(\" \",B82,1)-1),TBCompras[Tipo de Material],\"CONSUMO\")","v":0},{"$f":"SUMIFS(TBCompras[Valor Total Item (R$)],TBCompras[Mês do Projeto],\"<=\" & 30,TBCompras[Até],\">=\"& 30,TBCompras[Meta:Atividade],LEFT(B82,FIND(\" \",B82,1)-1),TBCompras[Tipo de Material],\"CONSUMO\")","v":0},{"$f":"SUMIFS(TBCompras[Valor Total Item (R$)],TBCompras[Mês do Projeto],\"<=\" & 31,TBCompras[Até],\">=\"& 31,TBCompras[Meta:Atividade],LEFT(B82,FIND(\" \",B82,1)-1),TBCompras[Tipo de Material],\"CONSUMO\")","v":0},{"$f":"SUMIFS(TBCompras[Valor Total Item (R$)],TBCompras[Mês do Projeto],\"<=\" & 32,TBCompras[Até],\">=\"& 32,TBCompras[Meta:Atividade],LEFT(B82,FIND(\" \",B82,1)-1),TBCompras[Tipo de Material],\"CONSUMO\")","v":0},{"$f":"SUMIFS(TBCompras[Valor Total Item (R$)],TBCompras[Mês do Projeto],\"<=\" & 33,TBCompras[Até],\">=\"& 33,TBCompras[Meta:Atividade],LEFT(B82,FIND(\" \",B82,1)-1),TBCompras[Tipo de Material],\"CONSUMO\")","v":0},{"$f":"SUMIFS(TBCompras[Valor Total Item (R$)],TBCompras[Mês do Projeto],\"<=\" & 34,TBCompras[Até],\">=\"& 34,TBCompras[Meta:Atividade],LEFT(B82,FIND(\" \",B82,1)-1),TBCompras[Tipo de Material],\"CONSUMO\")","v":0},{"$f":"SUMIFS(TBCompras[Valor Total Item (R$)],TBCompras[Mês do Projeto],\"<=\" & 35,TBCompras[Até],\">=\"& 35,TBCompras[Meta:Atividade],LEFT(B82,FIND(\" \",B82,1)-1),TBCompras[Tipo de Material],\"CONSUMO\")","v":0},{"$f":"SUMIFS(TBCompras[Valor Total Item (R$)],TBCompras[Mês do Projeto],\"<=\" & 36,TBCompras[Até],\">=\"& 36,TBCompras[Meta:Atividade],LEFT(B82,FIND(\" \",B82,1)-1),TBCompras[Tipo de Material],\"CONSUMO\")","v":0},0]
[null,null,"Equipamentos",{"$f":"SUMIFS(TBCompras[Valor Total Item (R$)],TBCompras[Mês do Projeto],\"<=\" & 1,TBCompras[Até],\">=\"& 1,TBCompras[Meta:Atividade],LEFT(B82,FIND(\" \",B82,1)-1),TBCompras[Tipo de Material],\"EQUIPAMENTO\")","v":0},{"$f":"SUMIFS(TBCompras[Valor Total Item (R$)],TBCompras[Mês do Projeto],\"<=\" & 2,TBCompras[Até],\">=\"& 2,TBCompras[Meta:Atividade],LEFT(B82,FIND(\" \",B82,1)-1),TBCompras[Tipo de Material],\"EQUIPAMENTO\")","v":0},{"$f":"SUMIFS(TBCompras[Valor Total Item (R$)],TBCompras[Mês do Projeto],\"<=\" & 3,TBCompras[Até],\">=\"& 3,TBCompras[Meta:Atividade],LEFT(B82,FIND(\" \",B82,1)-1),TBCompras[Tipo de Material],\"EQUIPAMENTO\")","v":0},{"$f":"SUMIFS(TBCompras[Valor Total Item (R$)],TBCompras[Mês do Projeto],\"<=\" & 4,TBCompras[Até],\">=\"& 4,TBCompras[Meta:Atividade],LEFT(B82,FIND(\" \",B82,1)-1),TBCompras[Tipo de Material],\"EQUIPAMENTO\")","v":0},{"$f":"SUMIFS(TBCompras[Valor Total Item (R$)],TBCompras[Mês do Projeto],\"<=\" & 5,TBCompras[Até],\">=\"& 5,TBCompras[Meta:Atividade],LEFT(B82,FIND(\" \",B82,1)-1),TBCompras[Tipo de Material],\"EQUIPAMENTO\")","v":0},{"$f":"SUMIFS(TBCompras[Valor Total Item (R$)],TBCompras[Mês do Projeto],\"<=\" & 6,TBCompras[Até],\">=\"& 6,TBCompras[Meta:Atividade],LEFT(B82,FIND(\" \",B82,1)-1),TBCompras[Tipo de Material],\"EQUIPAMENTO\")","v":0},{"$f":"SUMIFS(TBCompras[Valor Total Item (R$)],TBCompras[Mês do Projeto],\"<=\" & 7,TBCompras[Até],\">=\"& 7,TBCompras[Meta:Atividade],LEFT(B82,FIND(\" \",B82,1)-1),TBCompras[Tipo de Material],\"EQUIPAMENTO\")","v":0},{"$f":"SUMIFS(TBCompras[Valor Total Item (R$)],TBCompras[Mês do Projeto],\"<=\" & 8,TBCompras[Até],\">=\"& 8,TBCompras[Meta:Atividade],LEFT(B82,FIND(\" \",B82,1)-1),TBCompras[Tipo de Material],\"EQUIPAMENTO\")","v":0},{"$f":"SUMIFS(TBCompras[Valor Total Item (R$)],TBCompras[Mês do Projeto],\"<=\" & 9,TBCompras[Até],\">=\"& 9,TBCompras[Meta:Atividade],LEFT(B82,FIND(\" \",B82,1)-1),TBCompras[Tipo de Material],\"EQUIPAMENTO\")","v":0},{"$f":"SUMIFS(TBCompras[Valor Total Item (R$)],TBCompras[Mês do Projeto],\"<=\" & 10,TBCompras[Até],\">=\"& 10,TBCompras[Meta:Atividade],LEFT(B82,FIND(\" \",B82,1)-1),TBCompras[Tipo de Material],\"EQUIPAMENTO\")","v":0},{"$f":"SUMIFS(TBCompras[Valor Total Item (R$)],TBCompras[Mês do Projeto],\"<=\" & 11,TBCompras[Até],\">=\"& 11,TBCompras[Meta:Atividade],LEFT(B82,FIND(\" \",B82,1)-1),TBCompras[Tipo de Material],\"EQUIPAMENTO\")","v":0},{"$f":"SUMIFS(TBCompras[Valor Total Item (R$)],TBCompras[Mês do Projeto],\"<=\" & 12,TBCompras[Até],\">=\"& 12,TBCompras[Meta:Atividade],LEFT(B82,FIND(\" \",B82,1)-1),TBCompras[Tipo de Material],\"EQUIPAMENTO\")","v":0},{"$f":"SUMIFS(TBCompras[Valor Total Item (R$)],TBCompras[Mês do Projeto],\"<=\" & 13,TBCompras[Até],\">=\"& 13,TBCompras[Meta:Atividade],LEFT(B82,FIND(\" \",B82,1)-1),TBCompras[Tipo de Material],\"EQUIPAMENTO\")","v":0},{"$f":"SUMIFS(TBCompras[Valor Total Item (R$)],TBCompras[Mês do Projeto],\"<=\" & 14,TBCompras[Até],\">=\"& 14,TBCompras[Meta:Atividade],LEFT(B82,FIND(\" \",B82,1)-1),TBCompras[Tipo de Material],\"EQUIPAMENTO\")","v":0},{"$f":"SUMIFS(TBCompras[Valor Total Item (R$)],TBCompras[Mês do Projeto],\"<=\" & 15,TBCompras[Até],\">=\"& 15,TBCompras[Meta:Atividade],LEFT(B82,FIND(\" \",B82,1)-1),TBCompras[Tipo de Material],\"EQUIPAMENTO\")","v":0},{"$f":"SUMIFS(TBCompras[Valor Total Item (R$)],TBCompras[Mês do Projeto],\"<=\" & 16,TBCompras[Até],\">=\"& 16,TBCompras[Meta:Atividade],LEFT(B82,FIND(\" \",B82,1)-1),TBCompras[Tipo de Material],\"EQUIPAMENTO\")","v":0},{"$f":"SUMIFS(TBCompras[Valor Total Item (R$)],TBCompras[Mês do Projeto],\"<=\" & 17,TBCompras[Até],\">=\"& 17,TBCompras[Meta:Atividade],LEFT(B82,FIND(\" \",B82,1)-1),TBCompras[Tipo de Material],\"EQUIPAMENTO\")","v":0},{"$f":"SUMIFS(TBCompras[Valor Total Item (R$)],TBCompras[Mês do Projeto],\"<=\" & 18,TBCompras[Até],\">=\"& 18,TBCompras[Meta:Atividade],LEFT(B82,FIND(\" \",B82,1)-1),TBCompras[Tipo de Material],\"EQUIPAMENTO\")","v":0},{"$f":"SUMIFS(TBCompras[Valor Total Item (R$)],TBCompras[Mês do Projeto],\"<=\" & 19,TBCompras[Até],\">=\"& 19,TBCompras[Meta:Atividade],LEFT(B82,FIND(\" \",B82,1)-1),TBCompras[Tipo de Material],\"EQUIPAMENTO\")","v":0},{"$f":"SUMIFS(TBCompras[Valor Total Item (R$)],TBCompras[Mês do Projeto],\"<=\" & 20,TBCompras[Até],\">=\"& 20,TBCompras[Meta:Atividade],LEFT(B82,FIND(\" \",B82,1)-1),TBCompras[Tipo de Material],\"EQUIPAMENTO\")","v":0},{"$f":"SUMIFS(TBCompras[Valor Total Item (R$)],TBCompras[Mês do Projeto],\"<=\" & 21,TBCompras[Até],\">=\"& 21,TBCompras[Meta:Atividade],LEFT(B82,FIND(\" \",B82,1)-1),TBCompras[Tipo de Material],\"EQUIPAMENTO\")","v":0},{"$f":"SUMIFS(TBCompras[Valor Total Item (R$)],TBCompras[Mês do Projeto],\"<=\" & 22,TBCompras[Até],\">=\"& 22,TBCompras[Meta:Atividade],LEFT(B82,FIND(\" \",B82,1)-1),TBCompras[Tipo de Material],\"EQUIPAMENTO\")","v":0},{"$f":"SUMIFS(TBCompras[Valor Total Item (R$)],TBCompras[Mês do Projeto],\"<=\" & 23,TBCompras[Até],\">=\"& 23,TBCompras[Meta:Atividade],LEFT(B82,FIND(\" \",B82,1)-1),TBCompras[Tipo de Material],\"EQUIPAMENTO\")","v":0},{"$f":"SUMIFS(TBCompras[Valor Total Item (R$)],TBCompras[Mês do Projeto],\"<=\" & 24,TBCompras[Até],\">=\"& 24,TBCompras[Meta:Atividade],LEFT(B82,FIND(\" \",B82,1)-1),TBCompras[Tipo de Material],\"EQUIPAMENTO\")","v":0},{"$f":"SUMIFS(TBCompras[Valor Total Item (R$)],TBCompras[Mês do Projeto],\"<=\" & 25,TBCompras[Até],\">=\"& 25,TBCompras[Meta:Atividade],LEFT(B82,FIND(\" \",B82,1)-1),TBCompras[Tipo de Material],\"EQUIPAMENTO\")","v":0},{"$f":"SUMIFS(TBCompras[Valor Total Item (R$)],TBCompras[Mês do Projeto],\"<=\" & 26,TBCompras[Até],\">=\"& 26,TBCompras[Meta:Atividade],LEFT(B82,FIND(\" \",B82,1)-1),TBCompras[Tipo de Material],\"EQUIPAMENTO\")","v":0},{"$f":"SUMIFS(TBCompras[Valor Total Item (R$)],TBCompras[Mês do Projeto],\"<=\" & 27,TBCompras[Até],\">=\"& 27,TBCompras[Meta:Atividade],LEFT(B82,FIND(\" \",B82,1)-1),TBCompras[Tipo de Material],\"EQUIPAMENTO\")","v":0},{"$f":"SUMIFS(TBCompras[Valor Total Item (R$)],TBCompras[Mês do Projeto],\"<=\" & 28,TBCompras[Até],\">=\"& 28,TBCompras[Meta:Atividade],LEFT(B82,FIND(\" \",B82,1)-1),TBCompras[Tipo de Material],\"EQUIPAMENTO\")","v":0},{"$f":"SUMIFS(TBCompras[Valor Total Item (R$)],TBCompras[Mês do Projeto],\"<=\" & 29,TBCompras[Até],\">=\"& 29,TBCompras[Meta:Atividade],LEFT(B82,FIND(\" \",B82,1)-1),TBCompras[Tipo de Material],\"EQUIPAMENTO\")","v":0},{"$f":"SUMIFS(TBCompras[Valor Total Item (R$)],TBCompras[Mês do Projeto],\"<=\" & 30,TBCompras[Até],\">=\"& 30,TBCompras[Meta:Atividade],LEFT(B82,FIND(\" \",B82,1)-1),TBCompras[Tipo de Material],\"EQUIPAMENTO\")","v":0},{"$f":"SUMIFS(TBCompras[Valor Total Item (R$)],TBCompras[Mês do Projeto],\"<=\" & 31,TBCompras[Até],\">=\"& 31,TBCompras[Meta:Atividade],LEFT(B82,FIND(\" \",B82,1)-1),TBCompras[Tipo de Material],\"EQUIPAMENTO\")","v":0},{"$f":"SUMIFS(TBCompras[Valor Total Item (R$)],TBCompras[Mês do Projeto],\"<=\" & 32,TBCompras[Até],\">=\"& 32,TBCompras[Meta:Atividade],LEFT(B82,FIND(\" \",B82,1)-1),TBCompras[Tipo de Material],\"EQUIPAMENTO\")","v":0},{"$f":"SUMIFS(TBCompras[Valor Total Item (R$)],TBCompras[Mês do Projeto],\"<=\" & 33,TBCompras[Até],\">=\"& 33,TBCompras[Meta:Atividade],LEFT(B82,FIND(\" \",B82,1)-1),TBCompras[Tipo de Material],\"EQUIPAMENTO\")","v":0},{"$f":"SUMIFS(TBCompras[Valor Total Item (R$)],TBCompras[Mês do Projeto],\"<=\" & 34,TBCompras[Até],\">=\"& 34,TBCompras[Meta:Atividade],LEFT(B82,FIND(\" \",B82,1)-1),TBCompras[Tipo de Material],\"EQUIPAMENTO\")","v":0},{"$f":"SUMIFS(TBCompras[Valor Total Item (R$)],TBCompras[Mês do Projeto],\"<=\" & 35,TBCompras[Até],\">=\"& 35,TBCompras[Meta:Atividade],LEFT(B82,FIND(\" \",B82,1)-1),TBCompras[Tipo de Material],\"EQUIPAMENTO\")","v":0},{"$f":"SUMIFS(TBCompras[Valor Total Item (R$)],TBCompras[Mês do Projeto],\"<=\" & 36,TBCompras[Até],\">=\"& 36,TBCompras[Meta:Atividade],LEFT(B82,FIND(\" \",B82,1)-1),TBCompras[Tipo de Material],\"EQUIPAMENTO\")","v":0},0]
[null,null,"Total Atividade 5.3",{"$f":"SUBTOTAL(9,D82:D87)","v":0},0,0,0,0,0,0,0,0,0,0,0,0,0,0,0,0,0,0,0,0,0,0,0,0,0,0,0,0,0,0,0,0,0,0,0,0]
[null,"5.4 - Controle de qualidade do lote piloto fase I","Pessoa Física",{"$f":"SUMIFS(TbPessoas[Custo Total Mensal],TbPessoas[A partir do mês],\"<=\" & 1,TbPessoas[Até],\">=\"& 1,TbPessoas[Meta:Atividade],LEFT(B89,FIND(\" \",B89,1)-1))","v":0},{"$f":"SUMIFS(TbPessoas[Custo Total Mensal],TbPessoas[A partir do mês],\"<=\" & 2,TbPessoas[Até],\">=\"& 2,TbPessoas[Meta:Atividade],LEFT(B89,FIND(\" \",B89,1)-1))","v":0},{"$f":"SUMIFS(TbPessoas[Custo Total Mensal],TbPessoas[A partir do mês],\"<=\" & 3,TbPessoas[Até],\">=\"& 3,TbPessoas[Meta:Atividade],LEFT(B89,FIND(\" \",B89,1)-1))","v":0},{"$f":"SUMIFS(TbPessoas[Custo Total Mensal],TbPessoas[A partir do mês],\"<=\" & 4,TbPessoas[Até],\">=\"& 4,TbPessoas[Meta:Atividade],LEFT(B89,FIND(\" \",B89,1)-1))","v":0},{"$f":"SUMIFS(TbPessoas[Custo Total Mensal],TbPessoas[A partir do mês],\"<=\" & 5,TbPessoas[Até],\">=\"& 5,TbPessoas[Meta:Atividade],LEFT(B89,FIND(\" \",B89,1)-1))","v":0},{"$f":"SUMIFS(TbPessoas[Custo Total Mensal],TbPessoas[A partir do mês],\"<=\" & 6,TbPessoas[Até],\">=\"& 6,TbPessoas[Meta:Atividade],LEFT(B89,FIND(\" \",B89,1)-1))","v":0},{"$f":"SUMIFS(TbPessoas[Custo Total Mensal],TbPessoas[A partir do mês],\"<=\" & 7,TbPessoas[Até],\">=\"& 7,TbPessoas[Meta:Atividade],LEFT(B89,FIND(\" \",B89,1)-1))","v":0},{"$f":"SUMIFS(TbPessoas[Custo Total Mensal],TbPessoas[A partir do mês],\"<=\" & 8,TbPessoas[Até],\">=\"& 8,TbPessoas[Meta:Atividade],LEFT(B89,FIND(\" \",B89,1)-1))","v":0},{"$f":"SUMIFS(TbPessoas[Custo Total Mensal],TbPessoas[A partir do mês],\"<=\" & 9,TbPessoas[Até],\">=\"& 9,TbPessoas[Meta:Atividade],LEFT(B89,FIND(\" \",B89,1)-1))","v":0},{"$f":"SUMIFS(TbPessoas[Custo Total Mensal],TbPessoas[A partir do mês],\"<=\" & 10,TbPessoas[Até],\">=\"& 10,TbPessoas[Meta:Atividade],LEFT(B89,FIND(\" \",B89,1)-1))","v":0},{"$f":"SUMIFS(TbPessoas[Custo Total Mensal],TbPessoas[A partir do mês],\"<=\" & 11,TbPessoas[Até],\">=\"& 11,TbPessoas[Meta:Atividade],LEFT(B89,FIND(\" \",B89,1)-1))","v":0},{"$f":"SUMIFS(TbPessoas[Custo Total Mensal],TbPessoas[A partir do mês],\"<=\" & 12,TbPessoas[Até],\">=\"& 12,TbPessoas[Meta:Atividade],LEFT(B89,FIND(\" \",B89,1)-1))","v":0},{"$f":"SUMIFS(TbPessoas[Custo Total Mensal],TbPessoas[A partir do mês],\"<=\" & 13,TbPessoas[Até],\">=\"& 13,TbPessoas[Meta:Atividade],LEFT(B89,FIND(\" \",B89,1)-1))","v":0},{"$f":"SUMIFS(TbPessoas[Custo Total Mensal],TbPessoas[A partir do mês],\"<=\" & 14,TbPessoas[Até],\">=\"& 14,TbPessoas[Meta:Atividade],LEFT(B89,FIND(\" \",B89,1)-1))","v":0},{"$f":"SUMIFS(TbPessoas[Custo Total Mensal],TbPessoas[A partir do mês],\"<=\" & 15,TbPessoas[Até],\">=\"& 15,TbPessoas[Meta:Atividade],LEFT(B89,FIND(\" \",B89,1)-1))","v":0},{"$f":"SUMIFS(TbPessoas[Custo Total Mensal],TbPessoas[A partir do mês],\"<=\" & 16,TbPessoas[Até],\">=\"& 16,TbPessoas[Meta:Atividade],LEFT(B89,FIND(\" \",B89,1)-1))","v":0},{"$f":"SUMIFS(TbPessoas[Custo Total Mensal],TbPessoas[A partir do mês],\"<=\" & 17,TbPessoas[Até],\">=\"& 17,TbPessoas[Meta:Atividade],LEFT(B89,FIND(\" \",B89,1)-1))","v":0},{"$f":"SUMIFS(TbPessoas[Custo Total Mensal],TbPessoas[A partir do mês],\"<=\" & 18,TbPessoas[Até],\">=\"& 18,TbPessoas[Meta:Atividade],LEFT(B89,FIND(\" \",B89,1)-1))","v":0},{"$f":"SUMIFS(TbPessoas[Custo Total Mensal],TbPessoas[A partir do mês],\"<=\" & 19,TbPessoas[Até],\">=\"& 19,TbPessoas[Meta:Atividade],LEFT(B89,FIND(\" \",B89,1)-1))","v":0},{"$f":"SUMIFS(TbPessoas[Custo Total Mensal],TbPessoas[A partir do mês],\"<=\" & 20,TbPessoas[Até],\">=\"& 20,TbPessoas[Meta:Atividade],LEFT(B89,FIND(\" \",B89,1)-1))","v":0},{"$f":"SUMIFS(TbPessoas[Custo Total Mensal],TbPessoas[A partir do mês],\"<=\" & 21,TbPessoas[Até],\">=\"& 21,TbPessoas[Meta:Atividade],LEFT(B89,FIND(\" \",B89,1)-1))","v":0},{"$f":"SUMIFS(TbPessoas[Custo Total Mensal],TbPessoas[A partir do mês],\"<=\" & 22,TbPessoas[Até],\">=\"& 22,TbPessoas[Meta:Atividade],LEFT(B89,FIND(\" \",B89,1)-1))","v":0},{"$f":"SUMIFS(TbPessoas[Custo Total Mensal],TbPessoas[A partir do mês],\"<=\" & 23,TbPessoas[Até],\">=\"& 23,TbPessoas[Meta:Atividade],LEFT(B89,FIND(\" \",B89,1)-1))","v":0},{"$f":"SUMIFS(TbPessoas[Custo Total Mensal],TbPessoas[A partir do mês],\"<=\" & 24,TbPessoas[Até],\">=\"& 24,TbPessoas[Meta:Atividade],LEFT(B89,FIND(\" \",B89,1)-1))","v":0},{"$f":"SUMIFS(TbPessoas[Custo Total Mensal],TbPessoas[A partir do mês],\"<=\" & 25,TbPessoas[Até],\">=\"& 25,TbPessoas[Meta:Atividade],LEFT(B89,FIND(\" \",B89,1)-1))","v":0},{"$f":"SUMIFS(TbPessoas[Custo Total Mensal],TbPessoas[A partir do mês],\"<=\" & 26,TbPessoas[Até],\">=\"& 26,TbPessoas[Meta:Atividade],LEFT(B89,FIND(\" \",B89,1)-1))","v":0},{"$f":"SUMIFS(TbPessoas[Custo Total Mensal],TbPessoas[A partir do mês],\"<=\" & 27,TbPessoas[Até],\">=\"& 27,TbPessoas[Meta:Atividade],LEFT(B89,FIND(\" \",B89,1)-1))","v":0},{"$f":"SUMIFS(TbPessoas[Custo Total Mensal],TbPessoas[A partir do mês],\"<=\" & 28,TbPessoas[Até],\">=\"& 28,TbPessoas[Meta:Atividade],LEFT(B89,FIND(\" \",B89,1)-1))","v":0},{"$f":"SUMIFS(TbPessoas[Custo Total Mensal],TbPessoas[A partir do mês],\"<=\" & 29,TbPessoas[Até],\">=\"& 29,TbPessoas[Meta:Atividade],LEFT(B89,FIND(\" \",B89,1)-1))","v":0},{"$f":"SUMIFS(TbPessoas[Custo Total Mensal],TbPessoas[A partir do mês],\"<=\" & 30,TbPessoas[Até],\">=\"& 30,TbPessoas[Meta:Atividade],LEFT(B89,FIND(\" \",B89,1)-1))","v":0},{"$f":"SUMIFS(TbPessoas[Custo Total Mensal],TbPessoas[A partir do mês],\"<=\" & 31,TbPessoas[Até],\">=\"& 31,TbPessoas[Meta:Atividade],LEFT(B89,FIND(\" \",B89,1)-1))","v":0},{"$f":"SUMIFS(TbPessoas[Custo Total Mensal],TbPessoas[A partir do mês],\"<=\" & 32,TbPessoas[Até],\">=\"& 32,TbPessoas[Meta:Atividade],LEFT(B89,FIND(\" \",B89,1)-1))","v":0},{"$f":"SUMIFS(TbPessoas[Custo Total Mensal],TbPessoas[A partir do mês],\"<=\" & 33,TbPessoas[Até],\">=\"& 33,TbPessoas[Meta:Atividade],LEFT(B89,FIND(\" \",B89,1)-1))","v":0},{"$f":"SUMIFS(TbPessoas[Custo Total Mensal],TbPessoas[A partir do mês],\"<=\" & 34,TbPessoas[Até],\">=\"& 34,TbPessoas[Meta:Atividade],LEFT(B89,FIND(\" \",B89,1)-1))","v":0},{"$f":"SUMIFS(TbPessoas[Custo Total Mensal],TbPessoas[A partir do mês],\"<=\" & 35,TbPessoas[Até],\">=\"& 35,TbPessoas[Meta:Atividade],LEFT(B89,FIND(\" \",B89,1)-1))","v":0},{"$f":"SUMIFS(TbPessoas[Custo Total Mensal],TbPessoas[A partir do mês],\"<=\" & 36,TbPessoas[Até],\">=\"& 36,TbPessoas[Meta:Atividade],LEFT(B89,FIND(\" \",B89,1)-1))","v":0},{"$f":"SUM(D89:AM89)","v":0}]
[null,null,"Pessoa Jurídica",{"$f":"SUMIFS(TBCompras[Valor Total Item (R$)],TBCompras[Mês do Projeto],\"<=\" & 1,TBCompras[Até],\">=\"& 1,TBCompras[Meta:Atividade],LEFT(B89,FIND(\" \",B89,1)-1),TBCompras[Tipo de Material],\"SERVIÇO\")","v":0},{"$f":"SUMIFS(TBCompras[Valor Total Item (R$)],TBCompras[Mês do Projeto],\"<=\" & 2,TBCompras[Até],\">=\"& 2,TBCompras[Meta:Atividade],LEFT(B89,FIND(\" \",B89,1)-1),TBCompras[Tipo de Material],\"SERVIÇO\")","v":0},{"$f":"SUMIFS(TBCompras[Valor Total Item (R$)],TBCompras[Mês do Projeto],\"<=\" & 3,TBCompras[Até],\">=\"& 3,TBCompras[Meta:Atividade],LEFT(B89,FIND(\" \",B89,1)-1),TBCompras[Tipo de Material],\"SERVIÇO\")","v":0},{"$f":"SUMIFS(TBCompras[Valor Total Item (R$)],TBCompras[Mês do Projeto],\"<=\" & 4,TBCompras[Até],\">=\"& 4,TBCompras[Meta:Atividade],LEFT(B89,FIND(\" \",B89,1)-1),TBCompras[Tipo de Material],\"SERVIÇO\")","v":0},{"$f":"SUMIFS(TBCompras[Valor Total Item (R$)],TBCompras[Mês do Projeto],\"<=\" & 5,TBCompras[Até],\">=\"& 5,TBCompras[Meta:Atividade],LEFT(B89,FIND(\" \",B89,1)-1),TBCompras[Tipo de Material],\"SERVIÇO\")","v":0},{"$f":"SUMIFS(TBCompras[Valor Total Item (R$)],TBCompras[Mês do Projeto],\"<=\" & 6,TBCompras[Até],\">=\"& 6,TBCompras[Meta:Atividade],LEFT(B89,FIND(\" \",B89,1)-1),TBCompras[Tipo de Material],\"SERVIÇO\")","v":0},{"$f":"SUMIFS(TBCompras[Valor Total Item (R$)],TBCompras[Mês do Projeto],\"<=\" & 7,TBCompras[Até],\">=\"& 7,TBCompras[Meta:Atividade],LEFT(B89,FIND(\" \",B89,1)-1),TBCompras[Tipo de Material],\"SERVIÇO\")","v":0},{"$f":"SUMIFS(TBCompras[Valor Total Item (R$)],TBCompras[Mês do Projeto],\"<=\" & 8,TBCompras[Até],\">=\"& 8,TBCompras[Meta:Atividade],LEFT(B89,FIND(\" \",B89,1)-1),TBCompras[Tipo de Material],\"SERVIÇO\")","v":0},{"$f":"SUMIFS(TBCompras[Valor Total Item (R$)],TBCompras[Mês do Projeto],\"<=\" & 9,TBCompras[Até],\">=\"& 9,TBCompras[Meta:Atividade],LEFT(B89,FIND(\" \",B89,1)-1),TBCompras[Tipo de Material],\"SERVIÇO\")","v":0},{"$f":"SUMIFS(TBCompras[Valor Total Item (R$)],TBCompras[Mês do Projeto],\"<=\" & 10,TBCompras[Até],\">=\"& 10,TBCompras[Meta:Atividade],LEFT(B89,FIND(\" \",B89,1)-1),TBCompras[Tipo de Material],\"SERVIÇO\")","v":0},{"$f":"SUMIFS(TBCompras[Valor Total Item (R$)],TBCompras[Mês do Projeto],\"<=\" & 11,TBCompras[Até],\">=\"& 11,TBCompras[Meta:Atividade],LEFT(B89,FIND(\" \",B89,1)-1),TBCompras[Tipo de Material],\"SERVIÇO\")","v":0},{"$f":"SUMIFS(TBCompras[Valor Total Item (R$)],TBCompras[Mês do Projeto],\"<=\" & 12,TBCompras[Até],\">=\"& 12,TBCompras[Meta:Atividade],LEFT(B89,FIND(\" \",B89,1)-1),TBCompras[Tipo de Material],\"SERVIÇO\")","v":0},{"$f":"SUMIFS(TBCompras[Valor Total Item (R$)],TBCompras[Mês do Projeto],\"<=\" & 13,TBCompras[Até],\">=\"& 13,TBCompras[Meta:Atividade],LEFT(B89,FIND(\" \",B89,1)-1),TBCompras[Tipo de Material],\"SERVIÇO\")","v":0},{"$f":"SUMIFS(TBCompras[Valor Total Item (R$)],TBCompras[Mês do Projeto],\"<=\" & 14,TBCompras[Até],\">=\"& 14,TBCompras[Meta:Atividade],LEFT(B89,FIND(\" \",B89,1)-1),TBCompras[Tipo de Material],\"SERVIÇO\")","v":0},{"$f":"SUMIFS(TBCompras[Valor Total Item (R$)],TBCompras[Mês do Projeto],\"<=\" & 15,TBCompras[Até],\">=\"& 15,TBCompras[Meta:Atividade],LEFT(B89,FIND(\" \",B89,1)-1),TBCompras[Tipo de Material],\"SERVIÇO\")","v":0},{"$f":"SUMIFS(TBCompras[Valor Total Item (R$)],TBCompras[Mês do Projeto],\"<=\" & 16,TBCompras[Até],\">=\"& 16,TBCompras[Meta:Atividade],LEFT(B89,FIND(\" \",B89,1)-1),TBCompras[Tipo de Material],\"SERVIÇO\")","v":0},{"$f":"SUMIFS(TBCompras[Valor Total Item (R$)],TBCompras[Mês do Projeto],\"<=\" & 17,TBCompras[Até],\">=\"& 17,TBCompras[Meta:Atividade],LEFT(B89,FIND(\" \",B89,1)-1),TBCompras[Tipo de Material],\"SERVIÇO\")","v":0},{"$f":"SUMIFS(TBCompras[Valor Total Item (R$)],TBCompras[Mês do Projeto],\"<=\" & 18,TBCompras[Até],\">=\"& 18,TBCompras[Meta:Atividade],LEFT(B89,FIND(\" \",B89,1)-1),TBCompras[Tipo de Material],\"SERVIÇO\")","v":0},{"$f":"SUMIFS(TBCompras[Valor Total Item (R$)],TBCompras[Mês do Projeto],\"<=\" & 19,TBCompras[Até],\">=\"& 19,TBCompras[Meta:Atividade],LEFT(B89,FIND(\" \",B89,1)-1),TBCompras[Tipo de Material],\"SERVIÇO\")","v":0},{"$f":"SUMIFS(TBCompras[Valor Total Item (R$)],TBCompras[Mês do Projeto],\"<=\" & 20,TBCompras[Até],\">=\"& 20,TBCompras[Meta:Atividade],LEFT(B89,FIND(\" \",B89,1)-1),TBCompras[Tipo de Material],\"SERVIÇO\")","v":0},{"$f":"SUMIFS(TBCompras[Valor Total Item (R$)],TBCompras[Mês do Projeto],\"<=\" & 21,TBCompras[Até],\">=\"& 21,TBCompras[Meta:Atividade],LEFT(B89,FIND(\" \",B89,1)-1),TBCompras[Tipo de Material],\"SERVIÇO\")","v":0},{"$f":"SUMIFS(TBCompras[Valor Total Item (R$)],TBCompras[Mês do Projeto],\"<=\" & 22,TBCompras[Até],\">=\"& 22,TBCompras[Meta:Atividade],LEFT(B89,FIND(\" \",B89,1)-1),TBCompras[Tipo de Material],\"SERVIÇO\")","v":0},{"$f":"SUMIFS(TBCompras[Valor Total Item (R$)],TBCompras[Mês do Projeto],\"<=\" & 23,TBCompras[Até],\">=\"& 23,TBCompras[Meta:Atividade],LEFT(B89,FIND(\" \",B89,1)-1),TBCompras[Tipo de Material],\"SERVIÇO\")","v":0},{"$f":"SUMIFS(TBCompras[Valor Total Item (R$)],TBCompras[Mês do Projeto],\"<=\" & 24,TBCompras[Até],\">=\"& 24,TBCompras[Meta:Atividade],LEFT(B89,FIND(\" \",B89,1)-1),TBCompras[Tipo de Material],\"SERVIÇO\")","v":0},{"$f":"SUMIFS(TBCompras[Valor Total Item (R$)],TBCompras[Mês do Projeto],\"<=\" & 25,TBCompras[Até],\">=\"& 25,TBCompras[Meta:Atividade],LEFT(B89,FIND(\" \",B89,1)-1),TBCompras[Tipo de Material],\"SERVIÇO\")","v":0},{"$f":"SUMIFS(TBCompras[Valor Total Item (R$)],TBCompras[Mês do Projeto],\"<=\" & 26,TBCompras[Até],\">=\"& 26,TBCompras[Meta:Atividade],LEFT(B89,FIND(\" \",B89,1)-1),TBCompras[Tipo de Material],\"SERVIÇO\")","v":0},{"$f":"SUMIFS(TBCompras[Valor Total Item (R$)],TBCompras[Mês do Projeto],\"<=\" & 27,TBCompras[Até],\">=\"& 27,TBCompras[Meta:Atividade],LEFT(B89,FIND(\" \",B89,1)-1),TBCompras[Tipo de Material],\"SERVIÇO\")","v":0},{"$f":"SUMIFS(TBCompras[Valor Total Item (R$)],TBCompras[Mês do Projeto],\"<=\" & 28,TBCompras[Até],\">=\"& 28,TBCompras[Meta:Atividade],LEFT(B89,FIND(\" \",B89,1)-1),TBCompras[Tipo de Material],\"SERVIÇO\")","v":0},{"$f":"SUMIFS(TBCompras[Valor Total Item (R$)],TBCompras[Mês do Projeto],\"<=\" & 29,TBCompras[Até],\">=\"& 29,TBCompras[Meta:Atividade],LEFT(B89,FIND(\" \",B89,1)-1),TBCompras[Tipo de Material],\"SERVIÇO\")","v":0},{"$f":"SUMIFS(TBCompras[Valor Total Item (R$)],TBCompras[Mês do Projeto],\"<=\" & 30,TBCompras[Até],\">=\"& 30,TBCompras[Meta:Atividade],LEFT(B89,FIND(\" \",B89,1)-1),TBCompras[Tipo de Material],\"SERVIÇO\")","v":0},{"$f":"SUMIFS(TBCompras[Valor Total Item (R$)],TBCompras[Mês do Projeto],\"<=\" & 31,TBCompras[Até],\">=\"& 31,TBCompras[Meta:Atividade],LEFT(B89,FIND(\" \",B89,1)-1),TBCompras[Tipo de Material],\"SERVIÇO\")","v":0},{"$f":"SUMIFS(TBCompras[Valor Total Item (R$)],TBCompras[Mês do Projeto],\"<=\" & 32,TBCompras[Até],\">=\"& 32,TBCompras[Meta:Atividade],LEFT(B89,FIND(\" \",B89,1)-1),TBCompras[Tipo de Material],\"SERVIÇO\")","v":0},{"$f":"SUMIFS(TBCompras[Valor Total Item (R$)],TBCompras[Mês do Projeto],\"<=\" & 33,TBCompras[Até],\">=\"& 33,TBCompras[Meta:Atividade],LEFT(B89,FIND(\" \",B89,1)-1),TBCompras[Tipo de Material],\"SERVIÇO\")","v":0},{"$f":"SUMIFS(TBCompras[Valor Total Item (R$)],TBCompras[Mês do Projeto],\"<=\" & 34,TBCompras[Até],\">=\"& 34,TBCompras[Meta:Atividade],LEFT(B89,FIND(\" \",B89,1)-1),TBCompras[Tipo de Material],\"SERVIÇO\")","v":0},{"$f":"SUMIFS(TBCompras[Valor Total Item (R$)],TBCompras[Mês do Projeto],\"<=\" & 35,TBCompras[Até],\">=\"& 35,TBCompras[Meta:Atividade],LEFT(B89,FIND(\" \",B89,1)-1),TBCompras[Tipo de Material],\"SERVIÇO\")","v":0},{"$f":"SUMIFS(TBCompras[Valor Total Item (R$)],TBCompras[Mês do Projeto],\"<=\" & 36,TBCompras[Até],\">=\"& 36,TBCompras[Meta:Atividade],LEFT(B89,FIND(\" \",B89,1)-1),TBCompras[Tipo de Material],\"SERVIÇO\")","v":0},0]
[null,null,"Passagens",{"$f":"SUMIFS(TbPassagens[Valor Total Passagem],TbPassagens[A partir do mês],\"<=\" & 1,TbPassagens[Até],\">=\"& 1,TbPassagens[Meta:Atividade],LEFT(B89,FIND(\" \",B89,1)-1))","v":0},{"$f":"SUMIFS(TbPassagens[Valor Total Passagem],TbPassagens[A partir do mês],\"<=\" & 2,TbPassagens[Até],\">=\"& 2,TbPassagens[Meta:Atividade],LEFT(B89,FIND(\" \",B89,1)-1))","v":0},{"$f":"SUMIFS(TbPassagens[Valor Total Passagem],TbPassagens[A partir do mês],\"<=\" & 3,TbPassagens[Até],\">=\"& 3,TbPassagens[Meta:Atividade],LEFT(B89,FIND(\" \",B89,1)-1))","v":0},{"$f":"SUMIFS(TbPassagens[Valor Total Passagem],TbPassagens[A partir do mês],\"<=\" & 4,TbPassagens[Até],\">=\"& 4,TbPassagens[Meta:Atividade],LEFT(B89,FIND(\" \",B89,1)-1))","v":0},{"$f":"SUMIFS(TbPassagens[Valor Total Passagem],TbPassagens[A partir do mês],\"<=\" & 5,TbPassagens[Até],\">=\"& 5,TbPassagens[Meta:Atividade],LEFT(B89,FIND(\" \",B89,1)-1))","v":0},{"$f":"SUMIFS(TbPassagens[Valor Total Passagem],TbPassagens[A partir do mês],\"<=\" & 6,TbPassagens[Até],\">=\"& 6,TbPassagens[Meta:Atividade],LEFT(B89,FIND(\" \",B89,1)-1))","v":0},{"$f":"SUMIFS(TbPassagens[Valor Total Passagem],TbPassagens[A partir do mês],\"<=\" & 7,TbPassagens[Até],\">=\"& 7,TbPassagens[Meta:Atividade],LEFT(B89,FIND(\" \",B89,1)-1))","v":0},{"$f":"SUMIFS(TbPassagens[Valor Total Passagem],TbPassagens[A partir do mês],\"<=\" & 8,TbPassagens[Até],\">=\"& 8,TbPassagens[Meta:Atividade],LEFT(B89,FIND(\" \",B89,1)-1))","v":0},{"$f":"SUMIFS(TbPassagens[Valor Total Passagem],TbPassagens[A partir do mês],\"<=\" & 9,TbPassagens[Até],\">=\"& 9,TbPassagens[Meta:Atividade],LEFT(B89,FIND(\" \",B89,1)-1))","v":0},{"$f":"SUMIFS(TbPassagens[Valor Total Passagem],TbPassagens[A partir do mês],\"<=\" & 10,TbPassagens[Até],\">=\"& 10,TbPassagens[Meta:Atividade],LEFT(B89,FIND(\" \",B89,1)-1))","v":0},{"$f":"SUMIFS(TbPassagens[Valor Total Passagem],TbPassagens[A partir do mês],\"<=\" & 11,TbPassagens[Até],\">=\"& 11,TbPassagens[Meta:Atividade],LEFT(B89,FIND(\" \",B89,1)-1))","v":0},{"$f":"SUMIFS(TbPassagens[Valor Total Passagem],TbPassagens[A partir do mês],\"<=\" & 12,TbPassagens[Até],\">=\"& 12,TbPassagens[Meta:Atividade],LEFT(B89,FIND(\" \",B89,1)-1))","v":0},{"$f":"SUMIFS(TbPassagens[Valor Total Passagem],TbPassagens[A partir do mês],\"<=\" & 13,TbPassagens[Até],\">=\"& 13,TbPassagens[Meta:Atividade],LEFT(B89,FIND(\" \",B89,1)-1))","v":0},{"$f":"SUMIFS(TbPassagens[Valor Total Passagem],TbPassagens[A partir do mês],\"<=\" & 14,TbPassagens[Até],\">=\"& 14,TbPassagens[Meta:Atividade],LEFT(B89,FIND(\" \",B89,1)-1))","v":0},{"$f":"SUMIFS(TbPassagens[Valor Total Passagem],TbPassagens[A partir do mês],\"<=\" & 15,TbPassagens[Até],\">=\"& 15,TbPassagens[Meta:Atividade],LEFT(B89,FIND(\" \",B89,1)-1))","v":0},{"$f":"SUMIFS(TbPassagens[Valor Total Passagem],TbPassagens[A partir do mês],\"<=\" & 16,TbPassagens[Até],\">=\"& 16,TbPassagens[Meta:Atividade],LEFT(B89,FIND(\" \",B89,1)-1))","v":0},{"$f":"SUMIFS(TbPassagens[Valor Total Passagem],TbPassagens[A partir do mês],\"<=\" & 17,TbPassagens[Até],\">=\"& 17,TbPassagens[Meta:Atividade],LEFT(B89,FIND(\" \",B89,1)-1))","v":0},{"$f":"SUMIFS(TbPassagens[Valor Total Passagem],TbPassagens[A partir do mês],\"<=\" & 18,TbPassagens[Até],\">=\"& 18,TbPassagens[Meta:Atividade],LEFT(B89,FIND(\" \",B89,1)-1))","v":0},{"$f":"SUMIFS(TbPassagens[Valor Total Passagem],TbPassagens[A partir do mês],\"<=\" & 19,TbPassagens[Até],\">=\"& 19,TbPassagens[Meta:Atividade],LEFT(B89,FIND(\" \",B89,1)-1))","v":0},{"$f":"SUMIFS(TbPassagens[Valor Total Passagem],TbPassagens[A partir do mês],\"<=\" & 20,TbPassagens[Até],\">=\"& 20,TbPassagens[Meta:Atividade],LEFT(B89,FIND(\" \",B89,1)-1))","v":0},{"$f":"SUMIFS(TbPassagens[Valor Total Passagem],TbPassagens[A partir do mês],\"<=\" & 21,TbPassagens[Até],\">=\"& 21,TbPassagens[Meta:Atividade],LEFT(B89,FIND(\" \",B89,1)-1))","v":0},{"$f":"SUMIFS(TbPassagens[Valor Total Passagem],TbPassagens[A partir do mês],\"<=\" & 22,TbPassagens[Até],\">=\"& 22,TbPassagens[Meta:Atividade],LEFT(B89,FIND(\" \",B89,1)-1))","v":0},{"$f":"SUMIFS(TbPassagens[Valor Total Passagem],TbPassagens[A partir do mês],\"<=\" & 23,TbPassagens[Até],\">=\"& 23,TbPassagens[Meta:Atividade],LEFT(B89,FIND(\" \",B89,1)-1))","v":0},{"$f":"SUMIFS(TbPassagens[Valor Total Passagem],TbPassagens[A partir do mês],\"<=\" & 24,TbPassagens[Até],\">=\"& 24,TbPassagens[Meta:Atividade],LEFT(B89,FIND(\" \",B89,1)-1))","v":0},{"$f":"SUMIFS(TbPassagens[Valor Total Passagem],TbPassagens[A partir do mês],\"<=\" & 25,TbPassagens[Até],\">=\"& 25,TbPassagens[Meta:Atividade],LEFT(B89,FIND(\" \",B89,1)-1))","v":0},{"$f":"SUMIFS(TbPassagens[Valor Total Passagem],TbPassagens[A partir do mês],\"<=\" & 26,TbPassagens[Até],\">=\"& 26,TbPassagens[Meta:Atividade],LEFT(B89,FIND(\" \",B89,1)-1))","v":0},{"$f":"SUMIFS(TbPassagens[Valor Total Passagem],TbPassagens[A partir do mês],\"<=\" & 27,TbPassagens[Até],\">=\"& 27,TbPassagens[Meta:Atividade],LEFT(B89,FIND(\" \",B89,1)-1))","v":0},{"$f":"SUMIFS(TbPassagens[Valor Total Passagem],TbPassagens[A partir do mês],\"<=\" & 28,TbPassagens[Até],\">=\"& 28,TbPassagens[Meta:Atividade],LEFT(B89,FIND(\" \",B89,1)-1))","v":0},{"$f":"SUMIFS(TbPassagens[Valor Total Passagem],TbPassagens[A partir do mês],\"<=\" & 29,TbPassagens[Até],\">=\"& 29,TbPassagens[Meta:Atividade],LEFT(B89,FIND(\" \",B89,1)-1))","v":0},{"$f":"SUMIFS(TbPassagens[Valor Total Passagem],TbPassagens[A partir do mês],\"<=\" & 30,TbPassagens[Até],\">=\"& 30,TbPassagens[Meta:Atividade],LEFT(B89,FIND(\" \",B89,1)-1))","v":0},{"$f":"SUMIFS(TbPassagens[Valor Total Passagem],TbPassagens[A partir do mês],\"<=\" & 31,TbPassagens[Até],\">=\"& 31,TbPassagens[Meta:Atividade],LEFT(B89,FIND(\" \",B89,1)-1))","v":0},{"$f":"SUMIFS(TbPassagens[Valor Total Passagem],TbPassagens[A partir do mês],\"<=\" & 32,TbPassagens[Até],\">=\"& 32,TbPassagens[Meta:Atividade],LEFT(B89,FIND(\" \",B89,1)-1))","v":0},{"$f":"SUMIFS(TbPassagens[Valor Total Passagem],TbPassagens[A partir do mês],\"<=\" & 33,TbPassagens[Até],\">=\"& 33,TbPassagens[Meta:Atividade],LEFT(B89,FIND(\" \",B89,1)-1))","v":0},{"$f":"SUMIFS(TbPassagens[Valor Total Passagem],TbPassagens[A partir do mês],\"<=\" & 34,TbPassagens[Até],\">=\"& 34,TbPassagens[Meta:Atividade],LEFT(B89,FIND(\" \",B89,1)-1))","v":0},{"$f":"SUMIFS(TbPassagens[Valor Total Passagem],TbPassagens[A partir do mês],\"<=\" & 35,TbPassagens[Até],\">=\"& 35,TbPassagens[Meta:Atividade],LEFT(B89,FIND(\" \",B89,1)-1))","v":0},{"$f":"SUMIFS(TbPassagens[Valor Total Passagem],TbPassagens[A partir do mês],\"<=\" & 36,TbPassagens[Até],\">=\"& 36,TbPassagens[Meta:Atividade],LEFT(B89,FIND(\" \",B89,1)-1))","v":0},0]
[null,null,"Diárias",{"$f":"SUMIFS(TbPassagens[Valor Total Diária],TbPassagens[A partir do mês],\"<=\" & 1,TbPassagens[Até],\">=\"& 1,TbPassagens[Meta:Atividade],LEFT(B89,FIND(\" \",B89,1)-1))","v":0},{"$f":"SUMIFS(TbPassagens[Valor Total Diária],TbPassagens[A partir do mês],\"<=\" & 2,TbPassagens[Até],\">=\"& 2,TbPassagens[Meta:Atividade],LEFT(B89,FIND(\" \",B89,1)-1))","v":0},{"$f":"SUMIFS(TbPassagens[Valor Total Diária],TbPassagens[A partir do mês],\"<=\" & 3,TbPassagens[Até],\">=\"& 3,TbPassagens[Meta:Atividade],LEFT(B89,FIND(\" \",B89,1)-1))","v":0},{"$f":"SUMIFS(TbPassagens[Valor Total Diária],TbPassagens[A partir do mês],\"<=\" & 4,TbPassagens[Até],\">=\"& 4,TbPassagens[Meta:Atividade],LEFT(B89,FIND(\" \",B89,1)-1))","v":0},{"$f":"SUMIFS(TbPassagens[Valor Total Diária],TbPassagens[A partir do mês],\"<=\" & 5,TbPassagens[Até],\">=\"& 5,TbPassagens[Meta:Atividade],LEFT(B89,FIND(\" \",B89,1)-1))","v":0},{"$f":"SUMIFS(TbPassagens[Valor Total Diária],TbPassagens[A partir do mês],\"<=\" & 6,TbPassagens[Até],\">=\"& 6,TbPassagens[Meta:Atividade],LEFT(B89,FIND(\" \",B89,1)-1))","v":0},{"$f":"SUMIFS(TbPassagens[Valor Total Diária],TbPassagens[A partir do mês],\"<=\" & 7,TbPassagens[Até],\">=\"& 7,TbPassagens[Meta:Atividade],LEFT(B89,FIND(\" \",B89,1)-1))","v":0},{"$f":"SUMIFS(TbPassagens[Valor Total Diária],TbPassagens[A partir do mês],\"<=\" & 8,TbPassagens[Até],\">=\"& 8,TbPassagens[Meta:Atividade],LEFT(B89,FIND(\" \",B89,1)-1))","v":0},{"$f":"SUMIFS(TbPassagens[Valor Total Diária],TbPassagens[A partir do mês],\"<=\" & 9,TbPassagens[Até],\">=\"& 9,TbPassagens[Meta:Atividade],LEFT(B89,FIND(\" \",B89,1)-1))","v":0},{"$f":"SUMIFS(TbPassagens[Valor Total Diária],TbPassagens[A partir do mês],\"<=\" & 10,TbPassagens[Até],\">=\"& 10,TbPassagens[Meta:Atividade],LEFT(B89,FIND(\" \",B89,1)-1))","v":0},{"$f":"SUMIFS(TbPassagens[Valor Total Diária],TbPassagens[A partir do mês],\"<=\" & 11,TbPassagens[Até],\">=\"& 11,TbPassagens[Meta:Atividade],LEFT(B89,FIND(\" \",B89,1)-1))","v":0},{"$f":"SUMIFS(TbPassagens[Valor Total Diária],TbPassagens[A partir do mês],\"<=\" & 12,TbPassagens[Até],\">=\"& 12,TbPassagens[Meta:Atividade],LEFT(B89,FIND(\" \",B89,1)-1))","v":0},{"$f":"SUMIFS(TbPassagens[Valor Total Diária],TbPassagens[A partir do mês],\"<=\" & 13,TbPassagens[Até],\">=\"& 13,TbPassagens[Meta:Atividade],LEFT(B89,FIND(\" \",B89,1)-1))","v":0},{"$f":"SUMIFS(TbPassagens[Valor Total Diária],TbPassagens[A partir do mês],\"<=\" & 14,TbPassagens[Até],\">=\"& 14,TbPassagens[Meta:Atividade],LEFT(B89,FIND(\" \",B89,1)-1))","v":0},{"$f":"SUMIFS(TbPassagens[Valor Total Diária],TbPassagens[A partir do mês],\"<=\" & 15,TbPassagens[Até],\">=\"& 15,TbPassagens[Meta:Atividade],LEFT(B89,FIND(\" \",B89,1)-1))","v":0},{"$f":"SUMIFS(TbPassagens[Valor Total Diária],TbPassagens[A partir do mês],\"<=\" & 16,TbPassagens[Até],\">=\"& 16,TbPassagens[Meta:Atividade],LEFT(B89,FIND(\" \",B89,1)-1))","v":0},{"$f":"SUMIFS(TbPassagens[Valor Total Diária],TbPassagens[A partir do mês],\"<=\" & 17,TbPassagens[Até],\">=\"& 17,TbPassagens[Meta:Atividade],LEFT(B89,FIND(\" \",B89,1)-1))","v":0},{"$f":"SUMIFS(TbPassagens[Valor Total Diária],TbPassagens[A partir do mês],\"<=\" & 18,TbPassagens[Até],\">=\"& 18,TbPassagens[Meta:Atividade],LEFT(B89,FIND(\" \",B89,1)-1))","v":0},{"$f":"SUMIFS(TbPassagens[Valor Total Diária],TbPassagens[A partir do mês],\"<=\" & 19,TbPassagens[Até],\">=\"& 19,TbPassagens[Meta:Atividade],LEFT(B89,FIND(\" \",B89,1)-1))","v":0},{"$f":"SUMIFS(TbPassagens[Valor Total Diária],TbPassagens[A partir do mês],\"<=\" & 20,TbPassagens[Até],\">=\"& 20,TbPassagens[Meta:Atividade],LEFT(B89,FIND(\" \",B89,1)-1))","v":0},{"$f":"SUMIFS(TbPassagens[Valor Total Diária],TbPassagens[A partir do mês],\"<=\" & 21,TbPassagens[Até],\">=\"& 21,TbPassagens[Meta:Atividade],LEFT(B89,FIND(\" \",B89,1)-1))","v":0},{"$f":"SUMIFS(TbPassagens[Valor Total Diária],TbPassagens[A partir do mês],\"<=\" & 22,TbPassagens[Até],\">=\"& 22,TbPassagens[Meta:Atividade],LEFT(B89,FIND(\" \",B89,1)-1))","v":0},{"$f":"SUMIFS(TbPassagens[Valor Total Diária],TbPassagens[A partir do mês],\"<=\" & 23,TbPassagens[Até],\">=\"& 23,TbPassagens[Meta:Atividade],LEFT(B89,FIND(\" \",B89,1)-1))","v":0},{"$f":"SUMIFS(TbPassagens[Valor Total Diária],TbPassagens[A partir do mês],\"<=\" & 24,TbPassagens[Até],\">=\"& 24,TbPassagens[Meta:Atividade],LEFT(B89,FIND(\" \",B89,1)-1))","v":0},{"$f":"SUMIFS(TbPassagens[Valor Total Diária],TbPassagens[A partir do mês],\"<=\" & 25,TbPassagens[Até],\">=\"& 25,TbPassagens[Meta:Atividade],LEFT(B89,FIND(\" \",B89,1)-1))","v":0},{"$f":"SUMIFS(TbPassagens[Valor Total Diária],TbPassagens[A partir do mês],\"<=\" & 26,TbPassagens[Até],\">=\"& 26,TbPassagens[Meta:Atividade],LEFT(B89,FIND(\" \",B89,1)-1))","v":0},{"$f":"SUMIFS(TbPassagens[Valor Total Diária],TbPassagens[A partir do mês],\"<=\" & 27,TbPassagens[Até],\">=\"& 27,TbPassagens[Meta:Atividade],LEFT(B89,FIND(\" \",B89,1)-1))","v":0},{"$f":"SUMIFS(TbPassagens[Valor Total Diária],TbPassagens[A partir do mês],\"<=\" & 28,TbPassagens[Até],\">=\"& 28,TbPassagens[Meta:Atividade],LEFT(B89,FIND(\" \",B89,1)-1))","v":0},{"$f":"SUMIFS(TbPassagens[Valor Total Diária],TbPassagens[A partir do mês],\"<=\" & 29,TbPassagens[Até],\">=\"& 29,TbPassagens[Meta:Atividade],LEFT(B89,FIND(\" \",B89,1)-1))","v":0},{"$f":"SUMIFS(TbPassagens[Valor Total Diária],TbPassagens[A partir do mês],\"<=\" & 30,TbPassagens[Até],\">=\"& 30,TbPassagens[Meta:Atividade],LEFT(B89,FIND(\" \",B89,1)-1))","v":0},{"$f":"SUMIFS(TbPassagens[Valor Total Diária],TbPassagens[A partir do mês],\"<=\" & 31,TbPassagens[Até],\">=\"& 31,TbPassagens[Meta:Atividade],LEFT(B89,FIND(\" \",B89,1)-1))","v":0},{"$f":"SUMIFS(TbPassagens[Valor Total Diária],TbPassagens[A partir do mês],\"<=\" & 32,TbPassagens[Até],\">=\"& 32,TbPassagens[Meta:Atividade],LEFT(B89,FIND(\" \",B89,1)-1))","v":0},{"$f":"SUMIFS(TbPassagens[Valor Total Diária],TbPassagens[A partir do mês],\"<=\" & 33,TbPassagens[Até],\">=\"& 33,TbPassagens[Meta:Atividade],LEFT(B89,FIND(\" \",B89,1)-1))","v":0},{"$f":"SUMIFS(TbPassagens[Valor Total Diária],TbPassagens[A partir do mês],\"<=\" & 34,TbPassagens[Até],\">=\"& 34,TbPassagens[Meta:Atividade],LEFT(B89,FIND(\" \",B89,1)-1))","v":0},{"$f":"SUMIFS(TbPassagens[Valor Total Diária],TbPassagens[A partir do mês],\"<=\" & 35,TbPassagens[Até],\">=\"& 35,TbPassagens[Meta:Atividade],LEFT(B89,FIND(\" \",B89,1)-1))","v":0},{"$f":"SUMIFS(TbPassagens[Valor Total Diária],TbPassagens[A partir do mês],\"<=\" & 36,TbPassagens[Até],\">=\"& 36,TbPassagens[Meta:Atividade],LEFT(B89,FIND(\" \",B89,1)-1))","v":0},0]
[null,null,"Material de Consumo",{"$f":"SUMIFS(TBCompras[Valor Total Item (R$)],TBCompras[Mês do Projeto],\"<=\" & 1,TBCompras[Até],\">=\"& 1,TBCompras[Meta:Atividade],LEFT(B89,FIND(\" \",B89,1)-1),TBCompras[Tipo de Material],\"CONSUMO\")","v":0},{"$f":"SUMIFS(TBCompras[Valor Total Item (R$)],TBCompras[Mês do Projeto],\"<=\" & 2,TBCompras[Até],\">=\"& 2,TBCompras[Meta:Atividade],LEFT(B89,FIND(\" \",B89,1)-1),TBCompras[Tipo de Material],\"CONSUMO\")","v":0},{"$f":"SUMIFS(TBCompras[Valor Total Item (R$)],TBCompras[Mês do Projeto],\"<=\" & 3,TBCompras[Até],\">=\"& 3,TBCompras[Meta:Atividade],LEFT(B89,FIND(\" \",B89,1)-1),TBCompras[Tipo de Material],\"CONSUMO\")","v":0},{"$f":"SUMIFS(TBCompras[Valor Total Item (R$)],TBCompras[Mês do Projeto],\"<=\" & 4,TBCompras[Até],\">=\"& 4,TBCompras[Meta:Atividade],LEFT(B89,FIND(\" \",B89,1)-1),TBCompras[Tipo de Material],\"CONSUMO\")","v":0},{"$f":"SUMIFS(TBCompras[Valor Total Item (R$)],TBCompras[Mês do Projeto],\"<=\" & 5,TBCompras[Até],\">=\"& 5,TBCompras[Meta:Atividade],LEFT(B89,FIND(\" \",B89,1)-1),TBCompras[Tipo de Material],\"CONSUMO\")","v":0},{"$f":"SUMIFS(TBCompras[Valor Total Item (R$)],TBCompras[Mês do Projeto],\"<=\" & 6,TBCompras[Até],\">=\"& 6,TBCompras[Meta:Atividade],LEFT(B89,FIND(\" \",B89,1)-1),TBCompras[Tipo de Material],\"CONSUMO\")","v":0},{"$f":"SUMIFS(TBCompras[Valor Total Item (R$)],TBCompras[Mês do Projeto],\"<=\" & 7,TBCompras[Até],\">=\"& 7,TBCompras[Meta:Atividade],LEFT(B89,FIND(\" \",B89,1)-1),TBCompras[Tipo de Material],\"CONSUMO\")","v":0},{"$f":"SUMIFS(TBCompras[Valor Total Item (R$)],TBCompras[Mês do Projeto],\"<=\" & 8,TBCompras[Até],\">=\"& 8,TBCompras[Meta:Atividade],LEFT(B89,FIND(\" \",B89,1)-1),TBCompras[Tipo de Material],\"CONSUMO\")","v":0},{"$f":"SUMIFS(TBCompras[Valor Total Item (R$)],TBCompras[Mês do Projeto],\"<=\" & 9,TBCompras[Até],\">=\"& 9,TBCompras[Meta:Atividade],LEFT(B89,FIND(\" \",B89,1)-1),TBCompras[Tipo de Material],\"CONSUMO\")","v":0},{"$f":"SUMIFS(TBCompras[Valor Total Item (R$)],TBCompras[Mês do Projeto],\"<=\" & 10,TBCompras[Até],\">=\"& 10,TBCompras[Meta:Atividade],LEFT(B89,FIND(\" \",B89,1)-1),TBCompras[Tipo de Material],\"CONSUMO\")","v":0},{"$f":"SUMIFS(TBCompras[Valor Total Item (R$)],TBCompras[Mês do Projeto],\"<=\" & 11,TBCompras[Até],\">=\"& 11,TBCompras[Meta:Atividade],LEFT(B89,FIND(\" \",B89,1)-1),TBCompras[Tipo de Material],\"CONSUMO\")","v":0},{"$f":"SUMIFS(TBCompras[Valor Total Item (R$)],TBCompras[Mês do Projeto],\"<=\" & 12,TBCompras[Até],\">=\"& 12,TBCompras[Meta:Atividade],LEFT(B89,FIND(\" \",B89,1)-1),TBCompras[Tipo de Material],\"CONSUMO\")","v":0},{"$f":"SUMIFS(TBCompras[Valor Total Item (R$)],TBCompras[Mês do Projeto],\"<=\" & 13,TBCompras[Até],\">=\"& 13,TBCompras[Meta:Atividade],LEFT(B89,FIND(\" \",B89,1)-1),TBCompras[Tipo de Material],\"CONSUMO\")","v":0},{"$f":"SUMIFS(TBCompras[Valor Total Item (R$)],TBCompras[Mês do Projeto],\"<=\" & 14,TBCompras[Até],\">=\"& 14,TBCompras[Meta:Atividade],LEFT(B89,FIND(\" \",B89,1)-1),TBCompras[Tipo de Material],\"CONSUMO\")","v":0},{"$f":"SUMIFS(TBCompras[Valor Total Item (R$)],TBCompras[Mês do Projeto],\"<=\" & 15,TBCompras[Até],\">=\"& 15,TBCompras[Meta:Atividade],LEFT(B89,FIND(\" \",B89,1)-1),TBCompras[Tipo de Material],\"CONSUMO\")","v":0},{"$f":"SUMIFS(TBCompras[Valor Total Item (R$)],TBCompras[Mês do Projeto],\"<=\" & 16,TBCompras[Até],\">=\"& 16,TBCompras[Meta:Atividade],LEFT(B89,FIND(\" \",B89,1)-1),TBCompras[Tipo de Material],\"CONSUMO\")","v":0},{"$f":"SUMIFS(TBCompras[Valor Total Item (R$)],TBCompras[Mês do Projeto],\"<=\" & 17,TBCompras[Até],\">=\"& 17,TBCompras[Meta:Atividade],LEFT(B89,FIND(\" \",B89,1)-1),TBCompras[Tipo de Material],\"CONSUMO\")","v":0},{"$f":"SUMIFS(TBCompras[Valor Total Item (R$)],TBCompras[Mês do Projeto],\"<=\" & 18,TBCompras[Até],\">=\"& 18,TBCompras[Meta:Atividade],LEFT(B89,FIND(\" \",B89,1)-1),TBCompras[Tipo de Material],\"CONSUMO\")","v":0},{"$f":"SUMIFS(TBCompras[Valor Total Item (R$)],TBCompras[Mês do Projeto],\"<=\" & 19,TBCompras[Até],\">=\"& 19,TBCompras[Meta:Atividade],LEFT(B89,FIND(\" \",B89,1)-1),TBCompras[Tipo de Material],\"CONSUMO\")","v":0},{"$f":"SUMIFS(TBCompras[Valor Total Item (R$)],TBCompras[Mês do Projeto],\"<=\" & 20,TBCompras[Até],\">=\"& 20,TBCompras[Meta:Atividade],LEFT(B89,FIND(\" \",B89,1)-1),TBCompras[Tipo de Material],\"CONSUMO\")","v":0},{"$f":"SUMIFS(TBCompras[Valor Total Item (R$)],TBCompras[Mês do Projeto],\"<=\" & 21,TBCompras[Até],\">=\"& 21,TBCompras[Meta:Atividade],LEFT(B89,FIND(\" \",B89,1)-1),TBCompras[Tipo de Material],\"CONSUMO\")","v":0},{"$f":"SUMIFS(TBCompras[Valor Total Item (R$)],TBCompras[Mês do Projeto],\"<=\" & 22,TBCompras[Até],\">=\"& 22,TBCompras[Meta:Atividade],LEFT(B89,FIND(\" \",B89,1)-1),TBCompras[Tipo de Material],\"CONSUMO\")","v":0},{"$f":"SUMIFS(TBCompras[Valor Total Item (R$)],TBCompras[Mês do Projeto],\"<=\" & 23,TBCompras[Até],\">=\"& 23,TBCompras[Meta:Atividade],LEFT(B89,FIND(\" \",B89,1)-1),TBCompras[Tipo de Material],\"CONSUMO\")","v":0},{"$f":"SUMIFS(TBCompras[Valor Total Item (R$)],TBCompras[Mês do Projeto],\"<=\" & 24,TBCompras[Até],\">=\"& 24,TBCompras[Meta:Atividade],LEFT(B89,FIND(\" \",B89,1)-1),TBCompras[Tipo de Material],\"CONSUMO\")","v":0},{"$f":"SUMIFS(TBCompras[Valor Total Item (R$)],TBCompras[Mês do Projeto],\"<=\" & 25,TBCompras[Até],\">=\"& 25,TBCompras[Meta:Atividade],LEFT(B89,FIND(\" \",B89,1)-1),TBCompras[Tipo de Material],\"CONSUMO\")","v":0},{"$f":"SUMIFS(TBCompras[Valor Total Item (R$)],TBCompras[Mês do Projeto],\"<=\" & 26,TBCompras[Até],\">=\"& 26,TBCompras[Meta:Atividade],LEFT(B89,FIND(\" \",B89,1)-1),TBCompras[Tipo de Material],\"CONSUMO\")","v":0},{"$f":"SUMIFS(TBCompras[Valor Total Item (R$)],TBCompras[Mês do Projeto],\"<=\" & 27,TBCompras[Até],\">=\"& 27,TBCompras[Meta:Atividade],LEFT(B89,FIND(\" \",B89,1)-1),TBCompras[Tipo de Material],\"CONSUMO\")","v":0},{"$f":"SUMIFS(TBCompras[Valor Total Item (R$)],TBCompras[Mês do Projeto],\"<=\" & 28,TBCompras[Até],\">=\"& 28,TBCompras[Meta:Atividade],LEFT(B89,FIND(\" \",B89,1)-1),TBCompras[Tipo de Material],\"CONSUMO\")","v":0},{"$f":"SUMIFS(TBCompras[Valor Total Item (R$)],TBCompras[Mês do Projeto],\"<=\" & 29,TBCompras[Até],\">=\"& 29,TBCompras[Meta:Atividade],LEFT(B89,FIND(\" \",B89,1)-1),TBCompras[Tipo de Material],\"CONSUMO\")","v":0},{"$f":"SUMIFS(TBCompras[Valor Total Item (R$)],TBCompras[Mês do Projeto],\"<=\" & 30,TBCompras[Até],\">=\"& 30,TBCompras[Meta:Atividade],LEFT(B89,FIND(\" \",B89,1)-1),TBCompras[Tipo de Material],\"CONSUMO\")","v":0},{"$f":"SUMIFS(TBCompras[Valor Total Item (R$)],TBCompras[Mês do Projeto],\"<=\" & 31,TBCompras[Até],\">=\"& 31,TBCompras[Meta:Atividade],LEFT(B89,FIND(\" \",B89,1)-1),TBCompras[Tipo de Material],\"CONSUMO\")","v":0},{"$f":"SUMIFS(TBCompras[Valor Total Item (R$)],TBCompras[Mês do Projeto],\"<=\" & 32,TBCompras[Até],\">=\"& 32,TBCompras[Meta:Atividade],LEFT(B89,FIND(\" \",B89,1)-1),TBCompras[Tipo de Material],\"CONSUMO\")","v":0},{"$f":"SUMIFS(TBCompras[Valor Total Item (R$)],TBCompras[Mês do Projeto],\"<=\" & 33,TBCompras[Até],\">=\"& 33,TBCompras[Meta:Atividade],LEFT(B89,FIND(\" \",B89,1)-1),TBCompras[Tipo de Material],\"CONSUMO\")","v":0},{"$f":"SUMIFS(TBCompras[Valor Total Item (R$)],TBCompras[Mês do Projeto],\"<=\" & 34,TBCompras[Até],\">=\"& 34,TBCompras[Meta:Atividade],LEFT(B89,FIND(\" \",B89,1)-1),TBCompras[Tipo de Material],\"CONSUMO\")","v":0},{"$f":"SUMIFS(TBCompras[Valor Total Item (R$)],TBCompras[Mês do Projeto],\"<=\" & 35,TBCompras[Até],\">=\"& 35,TBCompras[Meta:Atividade],LEFT(B89,FIND(\" \",B89,1)-1),TBCompras[Tipo de Material],\"CONSUMO\")","v":0},{"$f":"SUMIFS(TBCompras[Valor Total Item (R$)],TBCompras[Mês do Projeto],\"<=\" & 36,TBCompras[Até],\">=\"& 36,TBCompras[Meta:Atividade],LEFT(B89,FIND(\" \",B89,1)-1),TBCompras[Tipo de Material],\"CONSUMO\")","v":0},0]
[null,null,"Equipamentos",{"$f":"SUMIFS(TBCompras[Valor Total Item (R$)],TBCompras[Mês do Projeto],\"<=\" & 1,TBCompras[Até],\">=\"& 1,TBCompras[Meta:Atividade],LEFT(B89,FIND(\" \",B89,1)-1),TBCompras[Tipo de Material],\"EQUIPAMENTO\")","v":0},{"$f":"SUMIFS(TBCompras[Valor Total Item (R$)],TBCompras[Mês do Projeto],\"<=\" & 2,TBCompras[Até],\">=\"& 2,TBCompras[Meta:Atividade],LEFT(B89,FIND(\" \",B89,1)-1),TBCompras[Tipo de Material],\"EQUIPAMENTO\")","v":0},{"$f":"SUMIFS(TBCompras[Valor Total Item (R$)],TBCompras[Mês do Projeto],\"<=\" & 3,TBCompras[Até],\">=\"& 3,TBCompras[Meta:Atividade],LEFT(B89,FIND(\" \",B89,1)-1),TBCompras[Tipo de Material],\"EQUIPAMENTO\")","v":0},{"$f":"SUMIFS(TBCompras[Valor Total Item (R$)],TBCompras[Mês do Projeto],\"<=\" & 4,TBCompras[Até],\">=\"& 4,TBCompras[Meta:Atividade],LEFT(B89,FIND(\" \",B89,1)-1),TBCompras[Tipo de Material],\"EQUIPAMENTO\")","v":0},{"$f":"SUMIFS(TBCompras[Valor Total Item (R$)],TBCompras[Mês do Projeto],\"<=\" & 5,TBCompras[Até],\">=\"& 5,TBCompras[Meta:Atividade],LEFT(B89,FIND(\" \",B89,1)-1),TBCompras[Tipo de Material],\"EQUIPAMENTO\")","v":0},{"$f":"SUMIFS(TBCompras[Valor Total Item (R$)],TBCompras[Mês do Projeto],\"<=\" & 6,TBCompras[Até],\">=\"& 6,TBCompras[Meta:Atividade],LEFT(B89,FIND(\" \",B89,1)-1),TBCompras[Tipo de Material],\"EQUIPAMENTO\")","v":0},{"$f":"SUMIFS(TBCompras[Valor Total Item (R$)],TBCompras[Mês do Projeto],\"<=\" & 7,TBCompras[Até],\">=\"& 7,TBCompras[Meta:Atividade],LEFT(B89,FIND(\" \",B89,1)-1),TBCompras[Tipo de Material],\"EQUIPAMENTO\")","v":0},{"$f":"SUMIFS(TBCompras[Valor Total Item (R$)],TBCompras[Mês do Projeto],\"<=\" & 8,TBCompras[Até],\">=\"& 8,TBCompras[Meta:Atividade],LEFT(B89,FIND(\" \",B89,1)-1),TBCompras[Tipo de Material],\"EQUIPAMENTO\")","v":0},{"$f":"SUMIFS(TBCompras[Valor Total Item (R$)],TBCompras[Mês do Projeto],\"<=\" & 9,TBCompras[Até],\">=\"& 9,TBCompras[Meta:Atividade],LEFT(B89,FIND(\" \",B89,1)-1),TBCompras[Tipo de Material],\"EQUIPAMENTO\")","v":0},{"$f":"SUMIFS(TBCompras[Valor Total Item (R$)],TBCompras[Mês do Projeto],\"<=\" & 10,TBCompras[Até],\">=\"& 10,TBCompras[Meta:Atividade],LEFT(B89,FIND(\" \",B89,1)-1),TBCompras[Tipo de Material],\"EQUIPAMENTO\")","v":0},{"$f":"SUMIFS(TBCompras[Valor Total Item (R$)],TBCompras[Mês do Projeto],\"<=\" & 11,TBCompras[Até],\">=\"& 11,TBCompras[Meta:Atividade],LEFT(B89,FIND(\" \",B89,1)-1),TBCompras[Tipo de Material],\"EQUIPAMENTO\")","v":0},{"$f":"SUMIFS(TBCompras[Valor Total Item (R$)],TBCompras[Mês do Projeto],\"<=\" & 12,TBCompras[Até],\">=\"& 12,TBCompras[Meta:Atividade],LEFT(B89,FIND(\" \",B89,1)-1),TBCompras[Tipo de Material],\"EQUIPAMENTO\")","v":0},{"$f":"SUMIFS(TBCompras[Valor Total Item (R$)],TBCompras[Mês do Projeto],\"<=\" & 13,TBCompras[Até],\">=\"& 13,TBCompras[Meta:Atividade],LEFT(B89,FIND(\" \",B89,1)-1),TBCompras[Tipo de Material],\"EQUIPAMENTO\")","v":0},{"$f":"SUMIFS(TBCompras[Valor Total Item (R$)],TBCompras[Mês do Projeto],\"<=\" & 14,TBCompras[Até],\">=\"& 14,TBCompras[Meta:Atividade],LEFT(B89,FIND(\" \",B89,1)-1),TBCompras[Tipo de Material],\"EQUIPAMENTO\")","v":0},{"$f":"SUMIFS(TBCompras[Valor Total Item (R$)],TBCompras[Mês do Projeto],\"<=\" & 15,TBCompras[Até],\">=\"& 15,TBCompras[Meta:Atividade],LEFT(B89,FIND(\" \",B89,1)-1),TBCompras[Tipo de Material],\"EQUIPAMENTO\")","v":0},{"$f":"SUMIFS(TBCompras[Valor Total Item (R$)],TBCompras[Mês do Projeto],\"<=\" & 16,TBCompras[Até],\">=\"& 16,TBCompras[Meta:Atividade],LEFT(B89,FIND(\" \",B89,1)-1),TBCompras[Tipo de Material],\"EQUIPAMENTO\")","v":0},{"$f":"SUMIFS(TBCompras[Valor Total Item (R$)],TBCompras[Mês do Projeto],\"<=\" & 17,TBCompras[Até],\">=\"& 17,TBCompras[Meta:Atividade],LEFT(B89,FIND(\" \",B89,1)-1),TBCompras[Tipo de Material],\"EQUIPAMENTO\")","v":0},{"$f":"SUMIFS(TBCompras[Valor Total Item (R$)],TBCompras[Mês do Projeto],\"<=\" & 18,TBCompras[Até],\">=\"& 18,TBCompras[Meta:Atividade],LEFT(B89,FIND(\" \",B89,1)-1),TBCompras[Tipo de Material],\"EQUIPAMENTO\")","v":0},{"$f":"SUMIFS(TBCompras[Valor Total Item (R$)],TBCompras[Mês do Projeto],\"<=\" & 19,TBCompras[Até],\">=\"& 19,TBCompras[Meta:Atividade],LEFT(B89,FIND(\" \",B89,1)-1),TBCompras[Tipo de Material],\"EQUIPAMENTO\")","v":0},{"$f":"SUMIFS(TBCompras[Valor Total Item (R$)],TBCompras[Mês do Projeto],\"<=\" & 20,TBCompras[Até],\">=\"& 20,TBCompras[Meta:Atividade],LEFT(B89,FIND(\" \",B89,1)-1),TBCompras[Tipo de Material],\"EQUIPAMENTO\")","v":0},{"$f":"SUMIFS(TBCompras[Valor Total Item (R$)],TBCompras[Mês do Projeto],\"<=\" & 21,TBCompras[Até],\">=\"& 21,TBCompras[Meta:Atividade],LEFT(B89,FIND(\" \",B89,1)-1),TBCompras[Tipo de Material],\"EQUIPAMENTO\")","v":0},{"$f":"SUMIFS(TBCompras[Valor Total Item (R$)],TBCompras[Mês do Projeto],\"<=\" & 22,TBCompras[Até],\">=\"& 22,TBCompras[Meta:Atividade],LEFT(B89,FIND(\" \",B89,1)-1),TBCompras[Tipo de Material],\"EQUIPAMENTO\")","v":0},{"$f":"SUMIFS(TBCompras[Valor Total Item (R$)],TBCompras[Mês do Projeto],\"<=\" & 23,TBCompras[Até],\">=\"& 23,TBCompras[Meta:Atividade],LEFT(B89,FIND(\" \",B89,1)-1),TBCompras[Tipo de Material],\"EQUIPAMENTO\")","v":0},{"$f":"SUMIFS(TBCompras[Valor Total Item (R$)],TBCompras[Mês do Projeto],\"<=\" & 24,TBCompras[Até],\">=\"& 24,TBCompras[Meta:Atividade],LEFT(B89,FIND(\" \",B89,1)-1),TBCompras[Tipo de Material],\"EQUIPAMENTO\")","v":0},{"$f":"SUMIFS(TBCompras[Valor Total Item (R$)],TBCompras[Mês do Projeto],\"<=\" & 25,TBCompras[Até],\">=\"& 25,TBCompras[Meta:Atividade],LEFT(B89,FIND(\" \",B89,1)-1),TBCompras[Tipo de Material],\"EQUIPAMENTO\")","v":0},{"$f":"SUMIFS(TBCompras[Valor Total Item (R$)],TBCompras[Mês do Projeto],\"<=\" & 26,TBCompras[Até],\">=\"& 26,TBCompras[Meta:Atividade],LEFT(B89,FIND(\" \",B89,1)-1),TBCompras[Tipo de Material],\"EQUIPAMENTO\")","v":0},{"$f":"SUMIFS(TBCompras[Valor Total Item (R$)],TBCompras[Mês do Projeto],\"<=\" & 27,TBCompras[Até],\">=\"& 27,TBCompras[Meta:Atividade],LEFT(B89,FIND(\" \",B89,1)-1),TBCompras[Tipo de Material],\"EQUIPAMENTO\")","v":0},{"$f":"SUMIFS(TBCompras[Valor Total Item (R$)],TBCompras[Mês do Projeto],\"<=\" & 28,TBCompras[Até],\">=\"& 28,TBCompras[Meta:Atividade],LEFT(B89,FIND(\" \",B89,1)-1),TBCompras[Tipo de Material],\"EQUIPAMENTO\")","v":0},{"$f":"SUMIFS(TBCompras[Valor Total Item (R$)],TBCompras[Mês do Projeto],\"<=\" & 29,TBCompras[Até],\">=\"& 29,TBCompras[Meta:Atividade],LEFT(B89,FIND(\" \",B89,1)-1),TBCompras[Tipo de Material],\"EQUIPAMENTO\")","v":0},{"$f":"SUMIFS(TBCompras[Valor Total Item (R$)],TBCompras[Mês do Projeto],\"<=\" & 30,TBCompras[Até],\">=\"& 30,TBCompras[Meta:Atividade],LEFT(B89,FIND(\" \",B89,1)-1),TBCompras[Tipo de Material],\"EQUIPAMENTO\")","v":0},{"$f":"SUMIFS(TBCompras[Valor Total Item (R$)],TBCompras[Mês do Projeto],\"<=\" & 31,TBCompras[Até],\">=\"& 31,TBCompras[Meta:Atividade],LEFT(B89,FIND(\" \",B89,1)-1),TBCompras[Tipo de Material],\"EQUIPAMENTO\")","v":0},{"$f":"SUMIFS(TBCompras[Valor Total Item (R$)],TBCompras[Mês do Projeto],\"<=\" & 32,TBCompras[Até],\">=\"& 32,TBCompras[Meta:Atividade],LEFT(B89,FIND(\" \",B89,1)-1),TBCompras[Tipo de Material],\"EQUIPAMENTO\")","v":0},{"$f":"SUMIFS(TBCompras[Valor Total Item (R$)],TBCompras[Mês do Projeto],\"<=\" & 33,TBCompras[Até],\">=\"& 33,TBCompras[Meta:Atividade],LEFT(B89,FIND(\" \",B89,1)-1),TBCompras[Tipo de Material],\"EQUIPAMENTO\")","v":0},{"$f":"SUMIFS(TBCompras[Valor Total Item (R$)],TBCompras[Mês do Projeto],\"<=\" & 34,TBCompras[Até],\">=\"& 34,TBCompras[Meta:Atividade],LEFT(B89,FIND(\" \",B89,1)-1),TBCompras[Tipo de Material],\"EQUIPAMENTO\")","v":0},{"$f":"SUMIFS(TBCompras[Valor Total Item (R$)],TBCompras[Mês do Projeto],\"<=\" & 35,TBCompras[Até],\">=\"& 35,TBCompras[Meta:Atividade],LEFT(B89,FIND(\" \",B89,1)-1),TBCompras[Tipo de Material],\"EQUIPAMENTO\")","v":0},{"$f":"SUMIFS(TBCompras[Valor Total Item (R$)],TBCompras[Mês do Projeto],\"<=\" & 36,TBCompras[Até],\">=\"& 36,TBCompras[Meta:Atividade],LEFT(B89,FIND(\" \",B89,1)-1),TBCompras[Tipo de Material],\"EQUIPAMENTO\")","v":0},0]
[null,null,"Total Atividade 5.4",{"$f":"SUBTOTAL(9,D89:D94)","v":0},0,0,0,0,0,0,0,0,0,0,0,0,0,0,0,0,0,0,0,0,0,0,0,0,0,0,0,0,0,0,0,0,0,0,0,0]
[null,"Total da Meta 5",null,{"$f":"SUBTOTAL(9,D68:D95)","v":0},0,0,0,0,0,0,0,0,0,0,0,0,0,0,0,0,0,0,0,0,0,0,0,0,0,0,0,0,0,0,0,0,0,0,0,0]
["TOTAL","Desembolso",null,{"$f":"SUMIFS(TbCronograma[Parcela (%)],TbCronograma[Mês do Projeto],1,TbCronograma[Evento],\"Desembolso\") * Valor_do_Projeto","v":0},{"$f":"SUMIFS(TbCronograma[Parcela (%)],TbCronograma[Mês do Projeto],2,TbCronograma[Evento],\"Desembolso\") * Valor_do_Projeto","v":0},{"$f":"SUMIFS(TbCronograma[Parcela (%)],TbCronograma[Mês do Projeto],3,TbCronograma[Evento],\"Desembolso\") * Valor_do_Projeto","v":0},{"$f":"SUMIFS(TbCronograma[Parcela (%)],TbCronograma[Mês do Projeto],4,TbCronograma[Evento],\"Desembolso\") * Valor_do_Projeto","v":0},{"$f":"SUMIFS(TbCronograma[Parcela (%)],TbCronograma[Mês do Projeto],5,TbCronograma[Evento],\"Desembolso\") * Valor_do_Projeto","v":0},{"$f":"SUMIFS(TbCronograma[Parcela (%)],TbCronograma[Mês do Projeto],6,TbCronograma[Evento],\"Desembolso\") * Valor_do_Projeto","v":0},{"$f":"SUMIFS(TbCronograma[Parcela (%)],TbCronograma[Mês do Projeto],7,TbCronograma[Evento],\"Desembolso\") * Valor_do_Projeto","v":0},{"$f":"SUMIFS(TbCronograma[Parcela (%)],TbCronograma[Mês do Projeto],8,TbCronograma[Evento],\"Desembolso\") * Valor_do_Projeto","v":0},{"$f":"SUMIFS(TbCronograma[Parcela (%)],TbCronograma[Mês do Projeto],9,TbCronograma[Evento],\"Desembolso\") * Valor_do_Projeto","v":0},{"$f":"SUMIFS(TbCronograma[Parcela (%)],TbCronograma[Mês do Projeto],10,TbCronograma[Evento],\"Desembolso\") * Valor_do_Projeto","v":0},{"$f":"SUMIFS(TbCronograma[Parcela (%)],TbCronograma[Mês do Projeto],11,TbCronograma[Evento],\"Desembolso\") * Valor_do_Projeto","v":0},{"$f":"SUMIFS(TbCronograma[Parcela (%)],TbCronograma[Mês do Projeto],12,TbCronograma[Evento],\"Desembolso\") * Valor_do_Projeto","v":0},{"$f":"SUMIFS(TbCronograma[Parcela (%)],TbCronograma[Mês do Projeto],13,TbCronograma[Evento],\"Desembolso\") * Valor_do_Projeto","v":0},{"$f":"SUMIFS(TbCronograma[Parcela (%)],TbCronograma[Mês do Projeto],14,TbCronograma[Evento],\"Desembolso\") * Valor_do_Projeto","v":0},{"$f":"SUMIFS(TbCronograma[Parcela (%)],TbCronograma[Mês do Projeto],15,TbCronograma[Evento],\"Desembolso\") * Valor_do_Projeto","v":0},{"$f":"SUMIFS(TbCronograma[Parcela (%)],TbCronograma[Mês do Projeto],16,TbCronograma[Evento],\"Desembolso\") * Valor_do_Projeto","v":0},{"$f":"SUMIFS(TbCronograma[Parcela (%)],TbCronograma[Mês do Projeto],17,TbCronograma[Evento],\"Desembolso\") * Valor_do_Projeto","v":0},{"$f":"SUMIFS(TbCronograma[Parcela (%)],TbCronograma[Mês do Projeto],18,TbCronograma[Evento],\"Desembolso\") * Valor_do_Projeto","v":0},{"$f":"SUMIFS(TbCronograma[Parcela (%)],TbCronograma[Mês do Projeto],19,TbCronograma[Evento],\"Desembolso\") * Valor_do_Projeto","v":0},{"$f":"SUMIFS(TbCronograma[Parcela (%)],TbCronograma[Mês do Projeto],20,TbCronograma[Evento],\"Desembolso\") * Valor_do_Projeto","v":0},{"$f":"SUMIFS(TbCronograma[Parcela (%)],TbCronograma[Mês do Projeto],21,TbCronograma[Evento],\"Desembolso\") * Valor_do_Projeto","v":0},{"$f":"SUMIFS(TbCronograma[Parcela (%)],TbCronograma[Mês do Projeto],22,TbCronograma[Evento],\"Desembolso\") * Valor_do_Projeto","v":0},{"$f":"SUMIFS(TbCronograma[Parcela (%)],TbCronograma[Mês do Projeto],23,TbCronograma[Evento],\"Desembolso\") * Valor_do_Projeto","v":0},{"$f":"SUMIFS(TbCronograma[Parcela (%)],TbCronograma[Mês do Projeto],24,TbCronograma[Evento],\"Desembolso\") * Valor_do_Projeto","v":0},{"$f":"SUMIFS(TbCronograma[Parcela (%)],TbCronograma[Mês do Projeto],25,TbCronograma[Evento],\"Desembolso\") * Valor_do_Projeto","v":0},{"$f":"SUMIFS(TbCronograma[Parcela (%)],TbCronograma[Mês do Projeto],26,TbCronograma[Evento],\"Desembolso\") * Valor_do_Projeto","v":0},{"$f":"SUMIFS(TbCronograma[Parcela (%)],TbCronograma[Mês do Projeto],27,TbCronograma[Evento],\"Desembolso\") * Valor_do_Projeto","v":0},{"$f":"SUMIFS(TbCronograma[Parcela (%)],TbCronograma[Mês do Projeto],28,TbCronograma[Evento],\"Desembolso\") * Valor_do_Projeto","v":0},{"$f":"SUMIFS(TbCronograma[Parcela (%)],TbCronograma[Mês do Projeto],29,TbCronograma[Evento],\"Desembolso\") * Valor_do_Projeto","v":0},{"$f":"SUMIFS(TbCronograma[Parcela (%)],TbCronograma[Mês do Projeto],30,TbCronograma[Evento],\"Desembolso\") * Valor_do_Projeto","v":0},{"$f":"SUMIFS(TbCronograma[Parcela (%)],TbCronograma[Mês do Projeto],31,TbCronograma[Evento],\"Desembolso\") * Valor_do_Projeto","v":0},{"$f":"SUMIFS(TbCronograma[Parcela (%)],TbCronograma[Mês do Projeto],32,TbCronograma[Evento],\"Desembolso\") * Valor_do_Projeto","v":0},{"$f":"SUMIFS(TbCronograma[Parcela (%)],TbCronograma[Mês do Projeto],33,TbCronograma[Evento],\"Desembolso\") * Valor_do_Projeto","v":0},{"$f":"SUMIFS(TbCronograma[Parcela (%)],TbCronograma[Mês do Projeto],34,TbCronograma[Evento],\"Desembolso\") * Valor_do_Projeto","v":0},{"$f":"SUMIFS(TbCronograma[Parcela (%)],TbCronograma[Mês do Projeto],35,TbCronograma[Evento],\"Desembolso\") * Valor_do_Projeto","v":0},{"$f":"SUMIFS(TbCronograma[Parcela (%)],TbCronograma[Mês do Projeto],36,TbCronograma[Evento],\"Desembolso\") * Valor_do_Projeto","v":0},{"$f":"SUM(D97:AM97)","v":0}]
[null,"14-Diárias",null,{"$f":"SUMIF(C8:C96,\"Diárias\",D8:D96) * -1","v":0},{"$f":"SUMIF(C8:C96,\"Diárias\",E8:E96) * -1","v":0},{"$f":"SUMIF(C8:C96,\"Diárias\",F8:F96) * -1","v":0},{"$f":"SUMIF(C8:C96,\"Diárias\",G8:G96) * -1","v":0},{"$f":"SUMIF(C8:C96,\"Diárias\",H8:H96) * -1","v":0},{"$f":"SUMIF(C8:C96,\"Diárias\",I8:I96) * -1","v":0},{"$f":"SUMIF(C8:C96,\"Diárias\",J8:J96) * -1","v":0},{"$f":"SUMIF(C8:C96,\"Diárias\",K8:K96) * -1","v":0},{"$f":"SUMIF(C8:C96,\"Diárias\",L8:L96) * -1","v":0},{"$f":"SUMIF(C8:C96,\"Diárias\",M8:M96) * -1","v":0},{"$f":"SUMIF(C8:C96,\"Diárias\",N8:N96) * -1","v":0},{"$f":"SUMIF(C8:C96,\"Diárias\",O8:O96) * -1","v":0},{"$f":"SUMIF(C8:C96,\"Diárias\",P8:P96) * -1","v":0},{"$f":"SUMIF(C8:C96,\"Diárias\",Q8:Q96) * -1","v":0},{"$f":"SUMIF(C8:C96,\"Diárias\",R8:R96) * -1","v":0},{"$f":"SUMIF(C8:C96,\"Diárias\",S8:S96) * -1","v":0},{"$f":"SUMIF(C8:C96,\"Diárias\",T8:T96) * -1","v":0},{"$f":"SUMIF(C8:C96,\"Diárias\",U8:U96) * -1","v":0},{"$f":"SUMIF(C8:C96,\"Diárias\",V8:V96) * -1","v":0},{"$f":"SUMIF(C8:C96,\"Diárias\",W8:W96) * -1","v":0},{"$f":"SUMIF(C8:C96,\"Diárias\",X8:X96) * -1","v":0},{"$f":"SUMIF(C8:C96,\"Diárias\",Y8:Y96) * -1","v":0},{"$f":"SUMIF(C8:C96,\"Diárias\",Z8:Z96) * -1","v":0},{"$f":"SUMIF(C8:C96,\"Diárias\",AA8:AA96) * -1","v":0},{"$f":"SUMIF(C8:C96,\"Diárias\",AB8:AB96) * -1","v":0},{"$f":"SUMIF(C8:C96,\"Diárias\",AC8:AC96) * -1","v":0},{"$f":"SUMIF(C8:C96,\"Diárias\",AD8:AD96) * -1","v":0},{"$f":"SUMIF(C8:C96,\"Diárias\",AE8:AE96) * -1","v":0},{"$f":"SUMIF(C8:C96,\"Diárias\",AF8:AF96) * -1","v":0},{"$f":"SUMIF(C8:C96,\"Diárias\",AG8:AG96) * -1","v":0},{"$f":"SUMIF(C8:C96,\"Diárias\",AH8:AH96) * -1","v":0},{"$f":"SUMIF(C8:C96,\"Diárias\",AI8:AI96) * -1","v":0},{"$f":"SUMIF(C8:C96,\"Diárias\",AJ8:AJ96) * -1","v":0},{"$f":"SUMIF(C8:C96,\"Diárias\",AK8:AK96) * -1","v":0},{"$f":"SUMIF(C8:C96,\"Diárias\",AL8:AL96) * -1","v":0},{"$f":"SUMIF(C8:C96,\"Diárias\",AM8:AM96) * -1","v":0},0]
[null,"30-Material de Consumo",null,{"$f":"SUMIF(C8:C96,\"Material de Consumo\",D8:D96) * -1","v":0},{"$f":"SUMIF(C8:C96,\"Material de Consumo\",E8:E96) * -1","v":0},{"$f":"SUMIF(C8:C96,\"Material de Consumo\",F8:F96) * -1","v":0},{"$f":"SUMIF(C8:C96,\"Material de Consumo\",G8:G96) * -1","v":0},{"$f":"SUMIF(C8:C96,\"Material de Consumo\",H8:H96) * -1","v":0},{"$f":"SUMIF(C8:C96,\"Material de Consumo\",I8:I96) * -1","v":0},{"$f":"SUMIF(C8:C96,\"Material de Consumo\",J8:J96) * -1","v":0},{"$f":"SUMIF(C8:C96,\"Material de Consumo\",K8:K96) * -1","v":0},{"$f":"SUMIF(C8:C96,\"Material de Consumo\",L8:L96) * -1","v":0},{"$f":"SUMIF(C8:C96,\"Material de Consumo\",M8:M96) * -1","v":0},{"$f":"SUMIF(C8:C96,\"Material de Consumo\",N8:N96) * -1","v":0},{"$f":"SUMIF(C8:C96,\"Material de Consumo\",O8:O96) * -1","v":0},{"$f":"SUMIF(C8:C96,\"Material de Consumo\",P8:P96) * -1","v":0},{"$f":"SUMIF(C8:C96,\"Material de Consumo\",Q8:Q96) * -1","v":0},{"$f":"SUMIF(C8:C96,\"Material de Consumo\",R8:R96) * -1","v":0},{"$f":"SUMIF(C8:C96,\"Material de Consumo\",S8:S96) * -1","v":0},{"$f":"SUMIF(C8:C96,\"Material de Consumo\",T8:T96) * -1","v":0},{"$f":"SUMIF(C8:C96,\"Material de Consumo\",U8:U96) * -1","v":0},{"$f":"SUMIF(C8:C96,\"Material de Consumo\",V8:V96) * -1","v":0},{"$f":"SUMIF(C8:C96,\"Material de Consumo\",W8:W96) * -1","v":0},{"$f":"SUMIF(C8:C96,\"Material de Consumo\",X8:X96) * -1","v":0},{"$f":"SUMIF(C8:C96,\"Material de Consumo\",Y8:Y96) * -1","v":0},{"$f":"SUMIF(C8:C96,\"Material de Consumo\",Z8:Z96) * -1","v":0},{"$f":"SUMIF(C8:C96,\"Material de Consumo\",AA8:AA96) * -1","v":0},{"$f":"SUMIF(C8:C96,\"Material de Consumo\",AB8:AB96) * -1","v":0},{"$f":"SUMIF(C8:C96,\"Material de Consumo\",AC8:AC96) * -1","v":0},{"$f":"SUMIF(C8:C96,\"Material de Consumo\",AD8:AD96) * -1","v":0},{"$f":"SUMIF(C8:C96,\"Material de Consumo\",AE8:AE96) * -1","v":0},{"$f":"SUMIF(C8:C96,\"Material de Consumo\",AF8:AF96) * -1","v":0},{"$f":"SUMIF(C8:C96,\"Material de Consumo\",AG8:AG96) * -1","v":0},{"$f":"SUMIF(C8:C96,\"Material de Consumo\",AH8:AH96) * -1","v":0},{"$f":"SUMIF(C8:C96,\"Material de Consumo\",AI8:AI96) * -1","v":0},{"$f":"SUMIF(C8:C96,\"Material de Consumo\",AJ8:AJ96) * -1","v":0},{"$f":"SUMIF(C8:C96,\"Material de Consumo\",AK8:AK96) * -1","v":0},{"$f":"SUMIF(C8:C96,\"Material de Consumo\",AL8:AL96) * -1","v":0},{"$f":"SUMIF(C8:C96,\"Material de Consumo\",AM8:AM96) * -1","v":0},0]
[null,"33-Passagens",null,{"$f":"SUMIF(C8:C96,\"Passagens\",D8:D96) * -1","v":0},{"$f":"SUMIF(C8:C96,\"Passagens\",E8:E96) * -1","v":0},{"$f":"SUMIF(C8:C96,\"Passagens\",F8:F96) * -1","v":0},{"$f":"SUMIF(C8:C96,\"Passagens\",G8:G96) * -1","v":0},{"$f":"SUMIF(C8:C96,\"Passagens\",H8:H96) * -1","v":0},{"$f":"SUMIF(C8:C96,\"Passagens\",I8:I96) * -1","v":0},{"$f":"SUMIF(C8:C96,\"Passagens\",J8:J96) * -1","v":0},{"$f":"SUMIF(C8:C96,\"Passagens\",K8:K96) * -1","v":0},{"$f":"SUMIF(C8:C96,\"Passagens\",L8:L96) * -1","v":0},{"$f":"SUMIF(C8:C96,\"Passagens\",M8:M96) * -1","v":0},{"$f":"SUMIF(C8:C96,\"Passagens\",N8:N96) * -1","v":0},{"$f":"SUMIF(C8:C96,\"Passagens\",O8:O96) * -1","v":0},{"$f":"SUMIF(C8:C96,\"Passagens\",P8:P96) * -1","v":0},{"$f":"SUMIF(C8:C96,\"Passagens\",Q8:Q96) * -1","v":0},{"$f":"SUMIF(C8:C96,\"Passagens\",R8:R96) * -1","v":0},{"$f":"SUMIF(C8:C96,\"Passagens\",S8:S96) * -1","v":0},{"$f":"SUMIF(C8:C96,\"Passagens\",T8:T96) * -1","v":0},{"$f":"SUMIF(C8:C96,\"Passagens\",U8:U96) * -1","v":0},{"$f":"SUMIF(C8:C96,\"Passagens\",V8:V96) * -1","v":0},{"$f":"SUMIF(C8:C96,\"Passagens\",W8:W96) * -1","v":0},{"$f":"SUMIF(C8:C96,\"Passagens\",X8:X96) * -1","v":0},{"$f":"SUMIF(C8:C96,\"Passagens\",Y8:Y96) * -1","v":0},{"$f":"SUMIF(C8:C96,\"Passagens\",Z8:Z96) * -1","v":0},{"$f":"SUMIF(C8:C96,\"Passagens\",AA8:AA96) * -1","v":0},{"$f":"SUMIF(C8:C96,\"Passagens\",AB8:AB96) * -1","v":0},{"$f":"SUMIF(C8:C96,\"Passagens\",AC8:AC96) * -1","v":0},{"$f":"SUMIF(C8:C96,\"Passagens\",AD8:AD96) * -1","v":0},{"$f":"SUMIF(C8:C96,\"Passagens\",AE8:AE96) * -1","v":0},{"$f":"SUMIF(C8:C96,\"Passagens\",AF8:AF96) * -1","v":0},{"$f":"SUMIF(C8:C96,\"Passagens\",AG8:AG96) * -1","v":0},{"$f":"SUMIF(C8:C96,\"Passagens\",AH8:AH96) * -1","v":0},{"$f":"SUMIF(C8:C96,\"Passagens\",AI8:AI96) * -1","v":0},{"$f":"SUMIF(C8:C96,\"Passagens\",AJ8:AJ96) * -1","v":0},{"$f":"SUMIF(C8:C96,\"Passagens\",AK8:AK96) * -1","v":0},{"$f":"SUMIF(C8:C96,\"Passagens\",AL8:AL96) * -1","v":0},{"$f":"SUMIF(C8:C96,\"Passagens\",AM8:AM96) * -1","v":0},0]
[null,"36-Pessoa Física",null,{"$f":"SUMIF(C8:C96,\"Pessoa Física\",D8:D96) * -1","v":0},{"$f":"SUMIF(C8:C96,\"Pessoa Física\",E8:E96) * -1","v":0},{"$f":"SUMIF(C8:C96,\"Pessoa Física\",F8:F96) * -1","v":0},{"$f":"SUMIF(C8:C96,\"Pessoa Física\",G8:G96) * -1","v":0},{"$f":"SUMIF(C8:C96,\"Pessoa Física\",H8:H96) * -1","v":0},{"$f":"SUMIF(C8:C96,\"Pessoa Física\",I8:I96) * -1","v":0},{"$f":"SUMIF(C8:C96,\"Pessoa Física\",J8:J96) * -1","v":0},{"$f":"SUMIF(C8:C96,\"Pessoa Física\",K8:K96) * -1","v":0},{"$f":"SUMIF(C8:C96,\"Pessoa Física\",L8:L96) * -1","v":0},{"$f":"SUMIF(C8:C96,\"Pessoa Física\",M8:M96) * -1","v":0},{"$f":"SUMIF(C8:C96,\"Pessoa Física\",N8:N96) * -1","v":0},{"$f":"SUMIF(C8:C96,\"Pessoa Física\",O8:O96) * -1","v":0},{"$f":"SUMIF(C8:C96,\"Pessoa Física\",P8:P96) * -1","v":0},{"$f":"SUMIF(C8:C96,\"Pessoa Física\",Q8:Q96) * -1","v":0},{"$f":"SUMIF(C8:C96,\"Pessoa Física\",R8:R96) * -1","v":0},{"$f":"SUMIF(C8:C96,\"Pessoa Física\",S8:S96) * -1","v":0},{"$f":"SUMIF(C8:C96,\"Pessoa Física\",T8:T96) * -1","v":0},{"$f":"SUMIF(C8:C96,\"Pessoa Física\",U8:U96) * -1","v":0},{"$f":"SUMIF(C8:C96,\"Pessoa Física\",V8:V96) * -1","v":0},{"$f":"SUMIF(C8:C96,\"Pessoa Física\",W8:W96) * -1","v":0},{"$f":"SUMIF(C8:C96,\"Pessoa Física\",X8:X96) * -1","v":0},{"$f":"SUMIF(C8:C96,\"Pessoa Física\",Y8:Y96) * -1","v":0},{"$f":"SUMIF(C8:C96,\"Pessoa Física\",Z8:Z96) * -1","v":0},{"$f":"SUMIF(C8:C96,\"Pessoa Física\",AA8:AA96) * -1","v":0},{"$f":"SUMIF(C8:C96,\"Pessoa Física\",AB8:AB96) * -1","v":0},{"$f":"SUMIF(C8:C96,\"Pessoa Física\",AC8:AC96) * -1","v":0},{"$f":"SUMIF(C8:C96,\"Pessoa Física\",AD8:AD96) * -1","v":0},{"$f":"SUMIF(C8:C96,\"Pessoa Física\",AE8:AE96) * -1","v":0},{"$f":"SUMIF(C8:C96,\"Pessoa Física\",AF8:AF96) * -1","v":0},{"$f":"SUMIF(C8:C96,\"Pessoa Física\",AG8:AG96) * -1","v":0},{"$f":"SUMIF(C8:C96,\"Pessoa Física\",AH8:AH96) * -1","v":0},{"$f":"SUMIF(C8:C96,\"Pessoa Física\",AI8:AI96) * -1","v":0},{"$f":"SUMIF(C8:C96,\"Pessoa Física\",AJ8:AJ96) * -1","v":0},{"$f":"SUMIF(C8:C96,\"Pessoa Física\",AK8:AK96) * -1","v":0},{"$f":"SUMIF(C8:C96,\"Pessoa Física\",AL8:AL96) * -1","v":0},{"$f":"SUMIF(C8:C96,\"Pessoa Física\",AM8:AM96) * -1","v":0},0]
[null,"39-Pessoa Jurídica",null,{"$f":"SUMIF(C8:C96,\"Pessoa Jurídica\",D8:D96) * -1","v":0},{"$f":"SUMIF(C8:C96,\"Pessoa Jurídica\",E8:E96) * -1","v":0},{"$f":"SUMIF(C8:C96,\"Pessoa Jurídica\",F8:F96) * -1","v":0},{"$f":"SUMIF(C8:C96,\"Pessoa Jurídica\",G8:G96) * -1","v":0},{"$f":"SUMIF(C8:C96,\"Pessoa Jurídica\",H8:H96) * -1","v":0},{"$f":"SUMIF(C8:C96,\"Pessoa Jurídica\",I8:I96) * -1","v":0},{"$f":"SUMIF(C8:C96,\"Pessoa Jurídica\",J8:J96) * -1","v":0},{"$f":"SUMIF(C8:C96,\"Pessoa Jurídica\",K8:K96) * -1","v":0},{"$f":"SUMIF(C8:C96,\"Pessoa Jurídica\",L8:L96) * -1","v":0},{"$f":"SUMIF(C8:C96,\"Pessoa Jurídica\",M8:M96) * -1","v":0},{"$f":"SUMIF(C8:C96,\"Pessoa Jurídica\",N8:N96) * -1","v":0},{"$f":"SUMIF(C8:C96,\"Pessoa Jurídica\",O8:O96) * -1","v":0},{"$f":"SUMIF(C8:C96,\"Pessoa Jurídica\",P8:P96) * -1","v":0},{"$f":"SUMIF(C8:C96,\"Pessoa Jurídica\",Q8:Q96) * -1","v":0},{"$f":"SUMIF(C8:C96,\"Pessoa Jurídica\",R8:R96) * -1","v":0},{"$f":"SUMIF(C8:C96,\"Pessoa Jurídica\",S8:S96) * -1","v":0},{"$f":"SUMIF(C8:C96,\"Pessoa Jurídica\",T8:T96) * -1","v":0},{"$f":"SUMIF(C8:C96,\"Pessoa Jurídica\",U8:U96) * -1","v":0},{"$f":"SUMIF(C8:C96,\"Pessoa Jurídica\",V8:V96) * -1","v":0},{"$f":"SUMIF(C8:C96,\"Pessoa Jurídica\",W8:W96) * -1","v":0},{"$f":"SUMIF(C8:C96,\"Pessoa Jurídica\",X8:X96) * -1","v":0},{"$f":"SUMIF(C8:C96,\"Pessoa Jurídica\",Y8:Y96) * -1","v":0},{"$f":"SUMIF(C8:C96,\"Pessoa Jurídica\",Z8:Z96) * -1","v":0},{"$f":"SUMIF(C8:C96,\"Pessoa Jurídica\",AA8:AA96) * -1","v":0},{"$f":"SUMIF(C8:C96,\"Pessoa Jurídica\",AB8:AB96) * -1","v":0},{"$f":"SUMIF(C8:C96,\"Pessoa Jurídica\",AC8:AC96) * -1","v":0},{"$f":"SUMIF(C8:C96,\"Pessoa Jurídica\",AD8:AD96) * -1","v":0},{"$f":"SUMIF(C8:C96,\"Pessoa Jurídica\",AE8:AE96) * -1","v":0},{"$f":"SUMIF(C8:C96,\"Pessoa Jurídica\",AF8:AF96) * -1","v":0},{"$f":"SUMIF(C8:C96,\"Pessoa Jurídica\",AG8:AG96) * -1","v":0},{"$f":"SUMIF(C8:C96,\"Pessoa Jurídica\",AH8:AH96) * -1","v":0},{"$f":"SUMIF(C8:C96,\"Pessoa Jurídica\",AI8:AI96) * -1","v":0},{"$f":"SUMIF(C8:C96,\"Pessoa Jurídica\",AJ8:AJ96) * -1","v":0},{"$f":"SUMIF(C8:C96,\"Pessoa Jurídica\",AK8:AK96) * -1","v":0},{"$f":"SUMIF(C8:C96,\"Pessoa Jurídica\",AL8:AL96) * -1","v":0},{"$f":"SUMIF(C8:C96,\"Pessoa Jurídica\",AM8:AM96) * -1","v":0},0]
[null,"Equipamentos",null,{"$f":"SUMIF(C8:C96,\"Equipamentos\",D8:D96) * -1","v":0},{"$f":"SUMIF(C8:C96,\"Equipamentos\",E8:E96) * -1","v":0},{"$f":"SUMIF(C8:C96,\"Equipamentos\",F8:F96) * -1","v":0},{"$f":"SUMIF(C8:C96,\"Equipamentos\",G8:G96) * -1","v":0},{"$f":"SUMIF(C8:C96,\"Equipamentos\",H8:H96) * -1","v":0},{"$f":"SUMIF(C8:C96,\"Equipamentos\",I8:I96) * -1","v":0},{"$f":"SUMIF(C8:C96,\"Equipamentos\",J8:J96) * -1","v":0},{"$f":"SUMIF(C8:C96,\"Equipamentos\",K8:K96) * -1","v":0},{"$f":"SUMIF(C8:C96,\"Equipamentos\",L8:L96) * -1","v":0},{"$f":"SUMIF(C8:C96,\"Equipamentos\",M8:M96) * -1","v":0},{"$f":"SUMIF(C8:C96,\"Equipamentos\",N8:N96) * -1","v":0},{"$f":"SUMIF(C8:C96,\"Equipamentos\",O8:O96) * -1","v":0},{"$f":"SUMIF(C8:C96,\"Equipamentos\",P8:P96) * -1","v":0},{"$f":"SUMIF(C8:C96,\"Equipamentos\",Q8:Q96) * -1","v":0},{"$f":"SUMIF(C8:C96,\"Equipamentos\",R8:R96) * -1","v":0},{"$f":"SUMIF(C8:C96,\"Equipamentos\",S8:S96) * -1","v":0},{"$f":"SUMIF(C8:C96,\"Equipamentos\",T8:T96) * -1","v":0},{"$f":"SUMIF(C8:C96,\"Equipamentos\",U8:U96) * -1","v":0},{"$f":"SUMIF(C8:C96,\"Equipamentos\",V8:V96) * -1","v":0},{"$f":"SUMIF(C8:C96,\"Equipamentos\",W8:W96) * -1","v":0},{"$f":"SUMIF(C8:C96,\"Equipamentos\",X8:X96) * -1","v":0},{"$f":"SUMIF(C8:C96,\"Equipamentos\",Y8:Y96) * -1","v":0},{"$f":"SUMIF(C8:C96,\"Equipamentos\",Z8:Z96) * -1","v":0},{"$f":"SUMIF(C8:C96,\"Equipamentos\",AA8:AA96) * -1","v":0},{"$f":"SUMIF(C8:C96,\"Equipamentos\",AB8:AB96) * -1","v":0},{"$f":"SUMIF(C8:C96,\"Equipamentos\",AC8:AC96) * -1","v":0},{"$f":"SUMIF(C8:C96,\"Equipamentos\",AD8:AD96) * -1","v":0},{"$f":"SUMIF(C8:C96,\"Equipamentos\",AE8:AE96) * -1","v":0},{"$f":"SUMIF(C8:C96,\"Equipamentos\",AF8:AF96) * -1","v":0},{"$f":"SUMIF(C8:C96,\"Equipamentos\",AG8:AG96) * -1","v":0},{"$f":"SUMIF(C8:C96,\"Equipamentos\",AH8:AH96) * -1","v":0},{"$f":"SUMIF(C8:C96,\"Equipamentos\",AI8:AI96) * -1","v":0},{"$f":"SUMIF(C8:C96,\"Equipamentos\",AJ8:AJ96) * -1","v":0},{"$f":"SUMIF(C8:C96,\"Equipamentos\",AK8:AK96) * -1","v":0},{"$f":"SUMIF(C8:C96,\"Equipamentos\",AL8:AL96) * -1","v":0},{"$f":"SUMIF(C8:C96,\"Equipamentos\",AM8:AM96) * -1","v":0},0]
[null,"CUSTO IMPLEMENTAÇÃO PROJETO",null,{"$f":"SUBTOTAL(9,D98:D103)","v":0},0,0,0,0,0,0,0,0,0,0,0,0,0,0,0,0,0,0,0,0,0,0,0,0,0,0,0,0,0,0,0,0,0,0,0,0]
[null,"DOA - Fiotec",null,{"$f":"D97*DOA*-1","v":0},0,0,0,0,0,0,0,0,0,0,0,0,0,0,0,0,0,0,0,0,0,0,0,0,0,0,0,0,0,0,0,0,0,0,0,{"$f":"SUM(D105:AM105)","v":0}]
[null,"Encargos",null,{"$f":"D97 * ISSQN * -1","v":0},0,0,0,0,0,0,0,0,0,0,0,0,0,0,0,0,0,0,0,0,0,0,0,0,0,0,0,0,0,0,0,0,0,0,0,{"$f":"SUM(D106:AM106)","v":0}]
[null,"EVOLUÇÃO DO PROJETO",null,{"$f":"SUBTOTAL(9,D97:D106)","v":0},{"$f":"SUBTOTAL(9,E97:E106) + D107","v":0},0,0,0,0,0,0,0,0,0,0,0,0,0,0,0,0,0,0,0,0,0,0,0,0,0,0,0,0,0,0,0,0,0,0,{"$f":"SUBTOTAL(9,AN97:AN106)","v":0}]
[null,"TOTAL DO PROJETO",null,null,null,null,null,null,null,null,null,null,null,null,null,null,null,null,null,null,null,null,null,null,null,null,null,null,null,null,null,null,null,null,null,null,null,null,null,{"$f":"Valor_do_Projeto","v":12055.367346938776}]

{"sheet":"Pessoas","index":3,"n_rows":14,"n_cols":20,"rows_kept":14,"cut":false,"hidden":false,"merged":[]}
["Pessoas"]
["Sequência:"]
["Descrição:"]
["Meta:Atividade:",""]
["Quantidade"]
["Tipo de Contratação:"]
["A partir do mês:",null,"Descontos:",{"$f":"IF(Pessoas_Tipo_de_Contratacao=\"Estagiário\",0,IF(Pessoas_Tipo_de_Contratacao=\"RPA\",Descontos_Autônomo,IF(Pessoas_Tipo_de_Contratacao=\"Bolsa\",0,Descontos_CLT)))","v":{"$error":"#DIV/0!"}},{"$f":"Pessoas_Remuneracao_Mensal*D7","v":{"$error":"#DIV/0!"}}]
["Meses de Trabalho:",null,"Encargos/Benefícios:",{"$f":"IF(Pessoas_Tipo_de_Contratacao=\"Estagiário\",0,IF(Pessoas_Tipo_de_Contratacao=\"RPA\",P_Encargos_Autônomo,IF(Pessoas_Tipo_de_Contratacao=\"Bolsa\",0,P_Encargos_Benefícios)))","v":{"$error":"#DIV/0!"}},{"$f":"Pessoas_Remuneracao_Mensal*D8","v":{"$error":"#DIV/0!"}}]
["Remuneração Mensal Bruta:",null,"Custo Mensal Bruto:",null,{"$f":"Pessoas_Remuneracao_Mensal*(1+D8)","v":{"$error":"#DIV/0!"}}]
[]
[]
["Sequência","Descrição","Tipo de Contratação","Meses de Trabalho","A partir do mês","Até","Check","Meta:Atividade","Descrição da Meta:Atividade","Períodos de Férias","Quantidade","Remuneração Mensal","Descontos","Valor Líquido Individual Mensal","Valor Bruto Individual Mensal","Encargos/Benefícios Individual Mensal","Custo Total Individual Mensal","Custo Total Mensal","Folha de Pagamento","Custo Total"]
[1,null,null,null,null,null,null,""]
["Total",null,null,null,"1",null,null,null,null,null,{"$f":"SUBTOTAL(109,TbPessoas[Quantidade])","v":0},{"$f":"SUBTOTAL(101,TbPessoas[Remuneração Mensal])","v":{"$error":"#DIV/0!"}},null,null,{"$f":"SUBTOTAL(109,TbPessoas[Valor Bruto Individual Mensal])","v":0},{"$f":"SUBTOTAL(109,TbPessoas[Encargos/Benefícios Individual Mensal])","v":0},{"$f":"SUBTOTAL(109,TbPessoas[Custo Total Individual Mensal])","v":0},null,null,{"$f":"SUBTOTAL(109,TbPessoas[Custo Total])","v":0}]

{"sheet":"Passagens","index":4,"n_rows":20,"n_cols":21,"rows_kept":20,"cut":false,"hidden":false,"merged":[[5,5,5,7],[6,5,6,7],[7,5,7,7],[2,5,2,9],[3,5,3,7],[4,5,4,7]]}
["Passagens"]
["Sequência:"]
["Quantidade de viagens por mês:",null,null,null,null,"Tabela de Referência de Diárias"]
["Tipo de Destino:",null,null,null,null,"ADICIONAL DE DESLOCAMENTO",null,null,"US$",50]
["Trecho de:",null,null,null,null,"A",null,null,"US$",220]
["Trecho Até:",null,null,null,null,"B",null,null,"US$",300]
["Tipo:",null,null,null,null,"C",null,null,"US$",350]
["Modal:",null,null,null,null,"D",null,null,"US$",460]
["Vlr. Total Estimado Passagem (R$):"]
["Qtd. Pessoas:"]
["Qtd. Diárias por pessoa:"]
["Vlr. Unitário Diária (R$):",null,null,null,null,{"$f":"IF(Passagens_Tipo_de_Destino=\"Internacional\",\"Grupo:\",\"\")","v":""},null,"Tabela de referência de diárias internacionais"]
["Mês do projeto:",null,null,null,null,{"$f":"IF(Passagens_Tipo_de_Destino=\"Nacional\",\"\",IF(ISERROR(VLOOKUP(Passagens_Trecho_de,TbPaises[],2,FALSE)),IF(ISERROR(VLOOKUP(Passagens_Trecho_Ate,TbPaises[],2,FALSE)),\"\",VLOOKUP(Passagens_Trecho_Ate,TbPaises[],2,FALSE)),VLOOKUP(Passagens_Trecho_de,TbPaises[],2,FALSE)))","v":""}]
["Até:"]
["Meta:Atividade:",""]
[]
[]
["Sequência","Tipo de Destino","Trecho de","Trecho Até","Tipo","Modal","A partir do mês","Até","Meta:Atividade","Descrição da Meta:Atividade","Quantidade Viagens","Qtd. Diárias","Qtd. Pessoas","Qtd.Processos","Valor Estimado Passagem","Valor Total Passagem","Valor Unitário Diária","Valor Total Diária","Qtd.Diárias Total","Qtd.Viagens Total","TOTAL"]
[1,null,null,null,null,null,null,null,""]
["Total",null,null,null,null,null,null,null,null,null,null,{"$f":"SUBTOTAL(109,TbPassagens[Qtd. Diárias])","v":0},null,null,{"$f":"SUBTOTAL(101,TbPassagens[Valor Estimado Passagem])","v":{"$error":"#DIV/0!"}},null,{"$f":"SUBTOTAL(101,TbPassagens[Valor Unitário Diária])","v":{"$error":"#DIV/0!"}},{"$f":"SUBTOTAL(109,TbPassagens[Valor Total Diária])","v":0},{"$f":"SUBTOTAL(109,TbPassagens[Qtd.Diárias Total])","v":0},{"$f":"SUBTOTAL(109,TbPassagens[Qtd.Viagens Total])","v":0},{"$f":"SUBTOTAL(109,TbPassagens[TOTAL])","v":0}]

{"sheet":"Compras","index":5,"n_rows":18,"n_cols":17,"rows_kept":18,"cut":false,"hidden":false,"merged":[]}
["Compras"]
["Sequência:"]
["Tipo de Material:"]
["Grupo:"]
["Tipo de Compra:"]
["Obra:"]
["Moeda:"]
["Cotação:"]
["Mês do Projeto:"]
["Até"]
["Descrição do Item:"]
["Quantidade:"]
[{"$f":"CONCATENATE(\"Valor Unitário Estimado (\",Compras_Moeda,\"):\")","v":"Valor Unitário Estimado ():"}]
["Meta:Atividade:",""]
[]
["Sequência","Descrição do Item","Grupo","Tipo de Material","Tipo de Compra","Obra","Moeda","Cotação Ref.","Mês do Projeto","Até","Quantidade","Meta:Atividade","Descrição da Meta:Atividade","Valor Estimado Item (Moeda)","Valor Total Item (R$)","Valor Total","Meses"]
[1,null,null,null,null,null,null,null,null,null,null,""]
["Total",null,null,null,null,null,null,null,null,null,null,null,null,null,{"$f":"SUBTOTAL(109,TBCompras[Valor Total Item (R$)])","v":0},{"$f":"SUBTOTAL(109,TBCompras[Valor Total])","v":0},{"$f":"SUBTOTAL(109,TBCompras[Meses])","v":0}]

{"sheet":"Cronograma","index":6,"n_rows":13,"n_cols":5,"rows_kept":13,"cut":false,"hidden":false,"merged":[]}
["Cronograma"]
["Sequência:"]
["Mês do Projeto:"]
["Evento:"]
["Valor da Parcela:"]
[]
["Sequência","Mês do Projeto","Evento","Parcela (%)","Valor"]
[1]
[null,"Total",null,{"$f":"SUBTOTAL(109,TbCronograma[Parcela (%)])","v":0},{"$f":"SUBTOTAL(109,TbCronograma[Valor])","v":0}]
[]
[]
[]
["Células em vermelho: mês indicado está fora da vigência."]

{"sheet":"Resumo DOA","index":7,"n_rows":36,"n_cols":6,"rows_kept":36,"cut":false,"hidden":false,"merged":[[34,0,34,2],[35,0,35,2],[33,3,33,5],[30,0,30,2],[31,0,31,2],[29,3,29,5],[32,0,32,2],[23,0,23,2],[24,0,24,2],[25,0,25,2],[26,0,26,2],[27,0,27,2],[28,0,28,2],[22,0,22,2],[10,0,10,2],[11,0,11,2],[14,0,14,2],[16,0,16,2],[17,0,17,2],[18,0,18,2],[20,0,20,2],[13,3,13,5],[15,3,15,5],[19,3,19,5],[21,3,21,5],[9,0,9,2],[0,1,0,4],[2,3,2,4],[3,2,3,3],[7,0,7,2],[8,0,8,2]]}
["Projeto:",{"$f":"NomeDoProjeto","v":"Preencha com o nome do projeto"}]
["Orçamento sem Impostos:",{"$f":"Orçamento_Total-E2","v":11814.26},"ISSQN:",{"$f":"ISSQN","v":0.02},{"$f":"D3*D2","v":241.10734693877552}]
["Vigência (meses):",{"$f":"TempoDeVigencia","v":1},"Orçamento Total:",{"$f":"Valor_do_Projeto","v":12055.367346938776}]
[null,null,"Custo Total:",null,{"$f":"ROUND(SUM(F8:F36)-Desconto,2)","v":11814.26}]
[null,null,null,{"$f":"IF(Desconto>0,CONCATENATE(\"Incluído desconto de R$ \",TEXT(Desconto,\"#.##0,00\"),\".\"),\"\")","v":""}]
[null,"ORÇAMENTO","CUSTO"]
["FIOTEC",{"$f":"(TotalDOA+TotalEncargos)*-1","v":0},{"$f":"SUM(F8:F13)","v":11814.255514609302},"Qtd.","Valor Unitário","Valor"]
["Contratação de projeto",null,null,1,{"$f":"Sumário!D9","v":11109.088526772974},{"$f":"Sumário!E9","v":11109.088526772974}]
["Recebimento de recursos",null,null,{"$f":"Sumário!B10","v":0},{"$f":"Sumário!D10","v":33.604932866381851},{"$f":"Sumário!E10","v":0}]
["Prestação de informações financeiras/contábeis",null,null,{"$f":"SUM(D14:D36)*2","v":0},{"$f":"Sumário!D11","v":13.285240038337879},{"$f":"Sumário!E11","v":0}]
["Outros produtos/Administração",null,null,{"$f":"B3","v":1},{"$f":"Sumário!D12","v":705.16698783632739},{"$f":"Sumário!E12","v":705.16698783632739}]
["Prestação de contas de projeto",null,null,{"$f":"Sumário!B13","v":0},{"$f":"Sumário!D13","v":14496.196275130831},{"$f":"Sumário!E13","v":0}]
["Riscos",null,null,null,{"$f":"TabRiscos[[#Totals],[Valor do Risco]]","v":0},{"$f":"TabRiscos[[#Totals],[Valor do Risco]]","v":0}]
["14 - Diárias",{"$f":"TotalDiarias*-1","v":0},{"$f":"SUM(F15)","v":0}]
["Pagamento de diária e ajuda de custo",null,null,{"$f":"Sumário!B15","v":0},{"$f":"Sumário!D15","v":81.832575566735713},{"$f":"Sumário!E15","v":0}]
["30 - Material de Consumo",{"$f":"TotalMaterialDeConsumo*-1","v":0},{"$f":"SUM(F17:F19)","v":0}]
["Aquisição de produto no mercado internacional",null,null,{"$f":"Sumário!B17","v":0},{"$f":"Sumário!D17","v":913.99037094307903},{"$f":"Sumário!E17","v":0}]
["Aquisição de produto no mercado nacional",null,null,{"$f":"Sumário!B18","v":0},{"$f":"Sumário!D18","v":467.88221322500431},{"$f":"Sumário!E18","v":0}]
["Pagamento de reembolso de despesas",null,null,{"$f":"Sumário!B19","v":0},{"$f":"Sumário!D19","v":63.482404357618449},{"$f":"Sumário!E19","v":0}]
["33 - Passagens",{"$f":"TotalPassagens*-1","v":0},{"$f":"SUM(F21)","v":0}]
["Aquisição de passagem",null,null,{"$f":"Sumário!B21","v":0},{"$f":"Sumário!D21","v":146.7399431298179},{"$f":"Sumário!E21","v":0}]
["36 - Pessoa Física",{"$f":"TotalPessoaFisica*-1","v":0},{"$f":"SUM(F23:F29)","v":0}]
["Admissão de CLT",null,null,{"$f":"Sumário!B23","v":0},{"$f":"Sumário!D23","v":764.24517257584375},{"$f":"Sumário!E23","v":0}]
["Concessão de férias",null,null,{"$f":"Sumário!B24","v":0},{"$f":"Sumário!D24","v":969.32493902384874},{"$f":"Sumário!E24","v":0}]
["Folha de pagamento",null,null,{"$f":"Sumário!B25","v":0},{"$f":"Sumário!D25","v":107.05898904020538},{"$f":"Sumário!E25","v":0}]
["Desligamento de CLT",null,null,{"$f":"Sumário!B26","v":0},{"$f":"Sumário!D26","v":489.02889803682774},{"$f":"Sumário!E26","v":0}]
["Contratação de autônomo",null,null,{"$f":"Sumário!B27","v":0},{"$f":"Sumário!D27","v":791.98296081302999},{"$f":"Sumário!E27","v":0}]
["Concessão de bolsa",null,null,{"$f":"Sumário!B28","v":0},{"$f":"Sumário!D28","v":282.22413192614329},{"$f":"Sumário!E28","v":0}]
["Pagamento de bolsa",null,null,{"$f":"Sumário!B29","v":0},{"$f":"Sumário!D29","v":19.779112103115352},{"$f":"Sumário!E29","v":0}]
["39 - Pessoa Jurídica",{"$f":"TotalPessoaJuridica*-1","v":0},{"$f":"SUM(F31:F33)","v":0}]
["Aquisição de serviço no mercado internacional",null,null,{"$f":"Sumário!B31","v":0},{"$f":"Sumário!D31","v":1812.8698949518468},{"$f":"Sumário!E31","v":0}]
["Aquisição de serviço no mercado nacional PJ",null,null,{"$f":"Sumário!B32","v":0},{"$f":"Sumário!D32","v":168.20206870309198},{"$f":"Sumário!E32","v":0}]
["Pagamento de reembolso de despesas",null,null,{"$f":"Sumário!B33","v":0},{"$f":"Sumário!D33","v":0},{"$f":"Sumário!E33","v":0}]
["52 - Material Permanente",{"$f":"TotalEquipamentos*-1","v":0},{"$f":"SUM(F35:F36)","v":0}]
["Aquisição de bem",null,null,{"$f":"Sumário!B35","v":0},{"$f":"Sumário!D35","v":686.30687935096807},{"$f":"Sumário!E35","v":0}]
["Doação de bem",null,null,{"$f":"Sumário!B36","v":0},{"$f":"Sumário!D36","v":535.15413584693101},{"$f":"Sumário!E36","v":0}]

{"sheet":"Memória de Cálculo","index":8,"n_rows":9,"n_cols":7,"rows_kept":9,"cut":false,"hidden":false,"merged":[[7,1,7,5],[8,1,8,5],[1,0,1,6],[5,1,5,5],[6,1,6,5]]}
["                                               Memória de Cálculo"]
[{"$f":"CONCATENATE(\"Projeto: \",NomeDoProjeto)","v":"Projeto: Preencha com o nome do projeto"}]
[]
[]
[]
[null,"Custo de Implementação do Projeto",null,null,null,null,0]
[null,"DOA",null,null,null,null,11814.255514609302]
[null,"ISS",null,null,null,null,241.10725540018984]
[null,"Valor Total do Projeto",null,null,null,null,12055.362770009491]

{"sheet":"Complexidade","index":9,"n_rows":58,"n_cols":14,"rows_kept":58,"cut":false,"hidden":true,"merged":[[54,0,54,2],[55,0,55,3],[56,0,56,3],[57,0,57,3],[49,0,49,2],[0,3,0,4],[0,5,0,6],[0,7,0,8],[2,0,2,2],[5,0,5,2],[40,0,40,2],[9,0,9,2],[16,0,16,2],[23,0,23,2],[31,0,31,2],[35,0,35,2]]}
["DOA",null,null,"Iniciação",null,"Execução",null,"Prestação de Contas"]
[{"$f":"'Resumo DOA'!E4/Orçamento_Sem_Impostos","v":1},"Incidência Corrigida","Incidência","Peso","Esforço","Peso","Esforço","Peso","Esforço","Comentários"]
["Categoria",null,null,{"$f":"IF(AF_MULTIPLOS=\"NÃO\",MAX(D4:D5),SUM(D4:D5))","v":2},{"$f":"SUM(E4:E5)","v":1.75},{"$f":"IF(AF_MULTIPLOS=\"NÃO\",MAX(F4:F5),SUM(F4:F5))","v":2.2730000000000001},{"$f":"SUM(G4:G5)","v":1.923},{"$f":"IF(AF_MULTIPLOS=\"NÃO\",MAX(H4:H5),SUM(H4:H5))","v":2.25},{"$f":"SUM(I4:I5)","v":2.25}]
["Nacional",{"$f":"IF(OR(B11=\"SIM\",B12=\"SIM\",B13=\"SIM\",B15=\"SIM\"),\"SIM\",C4)","v":"SIM"},"SIM",1.75,{"$f":"IF(B4=\"SIM\",D4,0)","v":1.75},1.923,{"$f":"IF(B4=\"SIM\",F4,0)","v":1.923},2.25,{"$f":"IF(B4=\"SIM\",H4,0)","v":2.25}]
["Internacional",{"$f":"IF(B14=\"SIM\",\"SIM\",C5)","v":"NÃO"},"NÃO",2,{"$f":"IF(B5=\"SIM\",D5,0)","v":0},2.2730000000000001,{"$f":"IF(B5=\"SIM\",F5,0)","v":0},2,{"$f":"IF(B5=\"SIM\",H5,0)","v":0},null,null,"Consistência","Descrição","Check"]
["Tipo de Financiador",null,null,{"$f":"IF(AF_MULTIPLOS=\"NÃO\",MAX(D7:D9),SUM(D7:D9))","v":2.25},{"$f":"SUM(E7:E9)","v":2.25},{"$f":"IF(AF_MULTIPLOS=\"NÃO\",MAX(F7:F9),SUM(F7:F9))","v":2.12},{"$f":"SUM(G7:G9)","v":1.917},{"$f":"IF(AF_MULTIPLOS=\"NÃO\",MAX(H7:H9),SUM(H7:H9))","v":2.25},{"$f":"SUM(I7:I9)","v":2},null,null,1,"Ausência de categoria do projeto",{"$f":"IF(SUM(G4:G5)=0,\"Erro\",\"OK\")","v":"OK"}]
["Público",{"$f":"IF(OR(B11=\"SIM\",B12=\"SIM\",B13=\"SIM\",B14=\"SIM\"),\"SIM\",C7)","v":"SIM"},"SIM",2.25,{"$f":"IF(B7=\"SIM\",D7,0)","v":2.25},1.917,{"$f":"IF(B7=\"SIM\",F7,0)","v":1.917},2,{"$f":"IF(B7=\"SIM\",H7,0)","v":2},null,null,2,"Ambiguidade de categoria do projeto",{"$f":"IF(OR(N6=\"Erro\",AND(AF_MULTIPLOS=\"NÃO\",COUNTIF(B4:B5,\"SIM\")>1)),\"Erro\",\"OK\")","v":"OK"}]
["Privado",{"$f":"C8","v":"NÃO"},"NÃO",1.5,0,2.12,{"$f":"IF(B8=\"SIM\",F8,0)","v":0},2.25,0,null,null,3,"Ausência de tipo de financiador",{"$f":"IF(SUM(G7:G9)=0,\"Erro\",\"OK\")","v":"OK"}]
["Economia Mista",{"$f":"IF(B15=\"SIM\",\"SIM\",C9)","v":"NÃO"},"NÃO",1,0,1,{"$f":"IF(B9=\"SIM\",F9,0)","v":0},1,0,null,null,4,"Ambiguidade de tipo de financiador",{"$f":"IF(OR(N8=\"Erro\",AND(AF_MULTIPLOS=\"NÃO\",COUNTIF(B7:B9,\"SIM\")>1)),\"Erro\",\"OK\")","v":"OK"}]
["Agente Financiador",null,null,{"$f":"IF(AF_MULTIPLOS=\"NÃO\",MAX(D11:D16),SUM(D11:D16))","v":3},{"$f":"SUM(E11:E16)","v":2},{"$f":"IF(AF_MULTIPLOS=\"NÃO\",MAX(F11:F16),SUM(F11:F16))","v":2.875},{"$f":"SUM(G11:G16)","v":1.6539999999999999},{"$f":"IF(AF_MULTIPLOS=\"NÃO\",MAX(H11:H16),SUM(H11:H16))","v":2.6669999999999998},{"$f":"SUM(I11:I16)","v":1.5},null,null,6,"Ausência de agente financiador",{"$f":"IF(SUM(G11:G16)=0,\"Erro\",\"OK\")","v":"OK"}]
["Fiocruz",{"$f":"C11","v":"SIM"},"SIM",2,{"$f":"IF(B11=\"SIM\",D11,0)","v":2},1.6539999999999999,{"$f":"IF(B11=\"SIM\",F11,0)","v":1.6539999999999999},1.5,{"$f":"IF(B11=\"SIM\",H11,0)","v":1.5},null,null,7,"Ambiguidade de agente financiador",{"$f":"IF(OR(N10=\"Erro\",AND(AF_MULTIPLOS=\"NÃO\",COUNTIF(B11:B16,\"SIM\")>1)),\"Erro\",\"OK\")","v":"OK"}]
["FINEP","NÃO","NÃO",3,0,2.875,0,2.5,0,null,null,8,"Ausência de classificação de projeto",{"$f":"IF(SUM(G18:G23)=0,\"Erro\",\"OK\")","v":"OK"}]
["BNDES","NÃO","NÃO",3,0,2.556,0,2.5,0]
["OPAS","NÃO","NÃO",2.6669999999999998,0,2.3889999999999998,0,2.25,0]
["Petrobrás",{"$f":"C15","v":"NÃO"},"NÃO",3,0,2.875,0,2.6669999999999998,0]
["Outros","NÃO","NÃO",1.5,0,2.1,0,2,0]
["Classificação",null,null,{"$f":"SUM(D18:D23)","v":12},8.5,11.260999999999999,7.6820000000000004,10.417,7.25]
["Ensino",{"$f":"C18","v":"SIM"},"SIM",1.75,{"$f":"IF(B18=\"SIM\",D18,0)","v":1.75},1.6819999999999999,{"$f":"IF(B18=\"SIM\",F18,0)","v":1.6819999999999999},1.5,{"$f":"IF(B18=\"SIM\",H18,0)","v":1.5}]
["Pesquisa","SIM","SIM",2.25,2.25,2.0339999999999998,2.0339999999999998,2,2]
["Extensão","NÃO","NÃO",1.5,0,1.7689999999999999,0,1.5,0]
["Desenvolvimento Institucional","NÃO","NÃO",2,0,1.81,0,1.667,0]
["Desenvolvimento Científico e Tecnológica","SIM","SIM",2,2,2.0910000000000002,2.0910000000000002,1.75,1.75]
["Estímulo à Inovação","SIM","SIM",2.5,2.5,1.875,1.875,2,2]
["Recursos",null,null,{"$f":"SUM(D25:D31)","v":13},4,13.863,4.0549999999999997,17,4.25]
["Projeto de arrecadação",{"$f":"C25","v":"NÃO"},"NÃO",1.25,{"$f":"IF(B25=\"SIM\",D25,0)","v":0},1.7330000000000001,{"$f":"IF(B25=\"SIM\",F25,0)","v":0},2.3330000000000002,{"$f":"IF(B25=\"SIM\",H25,0)","v":0}]
["Agentes financiadores múltiplos","NÃO","NÃO",2,0,2.714,0,2.6669999999999998,0]
["Custo Operacional embutido","NÃO","NÃO",2.25,0,2.048,0,2.25,0]
["Custo Operacional explicito com documentação comprobatória",{"$f":"C28","v":"NÃO"},"NÃO",1,0,1,0,3,0]
["Remanejamento com autorização prévia","SIM","SIM",2,2,1.9259999999999999,1.9259999999999999,2,2]
["Comprovação de contrapartida financeira e não financeira","NÃO","NÃO",2.5,0,2.3130000000000002,0,2.5,0]
["Conta Exclusiva","SIM","SIM",2,2,2.129,2.129,2.25,2.25]
["Aquisições",null,null,{"$f":"SUM(D33:D35)","v":6.25},2,6.5950000000000006,2,5.75,2]
["Lei 8666/90",{"$f":"IF(B12=\"SIM\",\"SIM\",\"NÃO\")","v":"NÃO"},"NÃO",2.25,{"$f":"IF(B33=\"SIM\",D33,0)","v":0},2.0950000000000002,{"$f":"IF(B33=\"SIM\",F33,0)","v":0},1.75,{"$f":"IF(B33=\"SIM\",H33,0)","v":0}]
["Cartão Pesquisa",{"$f":"C34","v":"NÃO"},"NÃO",2,0,2.5,{"$f":"IF(B34=\"SIM\",F34,0)","v":0},2,0]
["Linhas telefônicas","SIM","SIM",2,2,2,{"$f":"IF(B35=\"SIM\",F35,0)","v":2},2,2]
["Operações",null,null,{"$f":"SUM(D37:D40)","v":8.4169999999999998},3.9169999999999998,7.9,4.4790000000000001,9.75,5]
["Coordenadores múltiplos (subprojetos)",{"$f":"C37","v":"SIM"},"SIM",1.667,{"$f":"IF(B37=\"SIM\",D37,0)","v":1.667},2.3639999999999999,{"$f":"IF(B37=\"SIM\",F37,0)","v":2.3639999999999999},2.75,{"$f":"IF(B37=\"SIM\",H37,0)","v":2.75}]
["Construção de processos específicos (formulários, sistemas, etc.)","NÃO","NÃO",2.5,0,2.4209999999999998,0,2.75,0]
["Agente financiador com sistema específico",{"$f":"IF(B15=\"SIM\",\"SIM\",C39)","v":"NÃO"},"NÃO",2,0,1,0,2,0]
["Equipe executora em outros estados (fora RJ e DF)","SIM","SIM",2.25,2.25,2.1150000000000002,2.1150000000000002,2.25,2.25]
["Iniciação",null,null,{"$f":"SUM(D42:D49)","v":17},8,8,3,9,3]
["Negociação de garantia contratual",{"$f":"C42","v":"NÃO"},"NÃO",2,{"$f":"IF(B42=\"SIM\",D42,0)","v":0},1,{"$f":"IF(B42=\"SIM\",F42,0)","v":0},2,{"$f":"IF(B42=\"SIM\",H42,0)","v":0}]
["Documentação suplementar para habilitação","NÃO","NÃO",1,0,1,0,1,0]
["Modelos diferentes para apresentação de proposta","NÃO","NÃO",1,0,1,0,1,0]
["Projeto de edital",{"$f":"C45","v":"NÃO"},"NÃO",3,0,1,0,1,0]
["Necessidade de integração com outras áreas da Fiotec",{"$f":"C46","v":"SIM"},"SIM",2,2,1,1,1,1]
["Necessidade de participação direta na (re)negociação do projeto",{"$f":"C47","v":"SIM"},"SIM",3,3,1,1,1,1]
["Necessidade de submissão e aprovação dos orgãos reguladores",{"$f":"C48","v":"NÃO"},"NÃO",2,0,1,0,1,0]
["Várias instâncias de aprovação","SIM","SIM",3,3,1,1,1,1]
["Prestação de Contas",null,null,{"$f":"SUM(D51:D54)","v":4},1,4,1,8,2]
["Parcela reembolso",{"$f":"C51","v":"NÃO"},"NÃO",1,{"$f":"IF(B51=\"SIM\",D51,0)","v":0},1,{"$f":"IF(B51=\"SIM\",F51,0)","v":0},2,{"$f":"IF(B51=\"SIM\",H51,0)","v":0}]
["Prestação de Contas sem formulário definido","NÃO","NÃO",1,0,1,{"$f":"IF(B52=\"SIM\",F52,0)","v":0},1,0]
["Prestação de Contas diferenciada - Biomanguinhos","SIM","SIM",1,1,1,{"$f":"IF(B53=\"SIM\",F53,0)","v":1},2,2]
["Prestação de Contas com envio de documentação comprobatória",{"$f":"C54","v":"NÃO"},"NÃO",1,0,1,{"$f":"IF(B54=\"SIM\",F54,0)","v":0},3,0]
["TOTAL",null,null,{"$f":"D3+D6+D10+D17+D24+D32+D36","v":46.917000000000002},{"$f":"E3+E6+E10+E17+E24+E32+E36","v":24.417000000000002},{"$f":"F3+F6+F10+F17+F24+F32+F36","v":46.886999999999993},{"$f":"G3+G6+G10+G17+G24+G32+G36","v":23.71},{"$f":"H3+H6+H10+H17+H24+H32+H36","v":50.084000000000003},{"$f":"SUM(I4:I54)","v":56.25}]
["Índice",null,null,null,{"$f":"E55/D55","v":0.52042969499328606},null,{"$f":"G55/F55","v":0.50568387826049876},null,{"$f":"I55/H55","v":1.1231131698746106}]
["Índice Mínimo",null,null,null,0.25,null,0,null,0]
["Índice Final",null,null,null,{"$f":"E57+((1-E57)*E56)","v":0.64032227124496455},null,{"$f":"G57+((1-G57)*G56)","v":0.50568387826049876},null,{"$f":"I57+((1-I57)*I56)","v":1.1231131698746106}]

{"sheet":"Riscos","index":10,"n_rows":3,"n_cols":7,"rows_kept":3,"cut":false,"hidden":true,"merged":[]}
["Risco","Quantidade","Valor Unitário","Valor Total","%Prob. Risco","%Impacto","Valor do Risco"]
["Processos Trabalhistas - CLT"]
["Total",null,null,null,null,null,{"$f":"SUBTOTAL(109,TabRiscos[Valor do Risco])","v":0}]

{"sheet":"DOA 2018","index":11,"n_rows":22,"n_cols":4,"rows_kept":22,"cut":false,"hidden":true,"merged":[]}
["DOA 2018","Custo Total","Qtd. Máx.\n2015/2016/2017","Custo Unitário"]
["Admissão de CLT",1860172.7500496036,2434,{"$f":"B2/C2","v":764.24517257584375}]
["Aquisição de bem",1581937.3569039814,2305,{"$f":"B3/C3","v":686.30687935096807}]
["Aquisição de passagem",1614873.0741436461,11005,146.7399431298179]
["Aquisição de produto no mercado internacional",1710989.974405444,1872,913.99037094307903]
["Aquisição de produto no mercado nacional",5097108.8308731969,10894,467.88221322500431]
["Aquisição de serviço no mercado internacional",1462986.0052261404,807,1812.8698949518468]
["Aquisição de serviço no mercado nacional PJ",3833493.3478121692,22791,168.20206870309198]
["Concessão de bolsa",3426200.9615833797,12140,282.22413192614329]
["Concessão de férias",723116.40451179119,746,969.32493902384874]
["Contratação de autônomo",1085016.656313851,1370,791.98296081302999]
["Contratação de projeto",2723826.6995028756,157,17349.214646515131]
["Desligamento de CLT",1054346.3041674006,2156,489.02889803682774]
["Doação de bem",693559.76005762257,1296,535.15413584693101]
["Folha de pagamento",1378277.424903604,12874,107.05898904020538]
["Outros produtos/Administração",8340395.9184089545,5981,1394.4818455791597]
["Pagamento de bolsa",1420041.3534431667,71795,19.779112103115352]
["Pagamento de diária e ajuda de custo",1687224.043034957,20618,81.832575566735713]
["Pagamento de reembolso de despesas",982453.68983850314,15476,63.482404357618449]
["Prestação de contas de projeto",3678539.3041678397,285,12907.15545322049]
["Prestação de informações financeiras/contábeis",3667231.0897027114,276038,13.285240038337879]
["Recebimento de recursos",1774038.0109491644,52791,33.604932866381851]

{"sheet":"Sumário","index":12,"n_rows":38,"n_cols":7,"rows_kept":38,"cut":false,"hidden":true,"merged":[[3,5,3,7]]}
[null,null,{"$f":"CONCATENATE(\"NOME DO PROJETO: \",NomeDoProjeto)","v":"NOME DO PROJETO: Preencha com o nome do projeto"}]
[null,null,{"$f":"CONCATENATE(\"VIGÊNCIA (MESES): \",TempoDeVigencia)","v":"VIGÊNCIA (MESES): 1"}]
[null,null,{"$f":"CONCATENATE(\"NÚMERO DO PROCESSO: \",NumeroDoProcesso)","v":"NÚMERO DO PROCESSO: Preencha com o número do processo"}]
[null,null,"CÓDIGO DO PROJETO:"]
[]
["PLANILHA DE CUSTOS - SUMÁRIO DO PROJETO"]
[]
["ATIVIDADES ADMINISTRATIVAS"]
["Contratação de projeto",1,{"$f":"Custo_ContratacaoProjeto","v":17349.214646515131},{"$f":"C9*IC_Iniciacao","v":11109.088526772974},{"$f":"D9*B9","v":11109.088526772974}]
["Recebimento de recursos",{"$f":"COUNTIF(TbCronograma[Evento],\"Desembolso\")","v":0},{"$f":"Custo_RecebimentoRecursos","v":33.604932866381851},{"$f":"C10","v":33.604932866381851},{"$f":"D10*B10","v":0}]
["Prestação de informações financeiras/contábeis",{"$f":"SUM(B14:B36)","v":0},{"$f":"Custo_PrestacaoInformacoesFinanCont","v":13.285240038337879},13.285240038337879,0]
["Administração",{"$f":"TempoDeVigencia","v":1},{"$f":"Custo_Outros","v":1394.4818455791597},{"$f":"C12*IC_Execucao","v":705.16698783632739},705.16698783632739]
["Prestação de contas de projeto",{"$f":"COUNTIF(TbCronograma[Evento],\"Prestação de Contas Parcial\")+COUNTIF(TbCronograma[Evento],\"Prestação de Contas Final\")","v":0},{"$f":"Custo_PrestacaoDeContas","v":12907.15545322049},{"$f":"C13*IC_PrestacaoDeContas","v":14496.196275130831},0]
["DIÁRIAS",null,null,0,0]
["Pagamento de diária e ajuda de custo",{"$f":"SUM(TbPassagens[Qtd.Processos])","v":0},{"$f":"Custo_PagamentoDiaria","v":81.832575566735713},81.832575566735713,0]
["MATERIAL DE CONSUMO",null,null,0,0]
["Aquisição de produto no mercado internacional",{"$f":"SUMIFS(TBCompras[Meses],  TBCompras[Tipo de Material],\"CONSUMO\",TBCompras[Tipo de Compra],\"Internacional\",TBCompras[Obra],\"NÃO\")","v":0},{"$f":"Custo_AquisicaoProdutoInternacional","v":913.99037094307903},913.99037094307903,0]
["Aquisição de produto no mercado nacional",{"$f":"SUMIFS(TBCompras[Meses],   TBCompras[Tipo de Material],\"CONSUMO\",TBCompras[Tipo de Compra],\"Nacional\",TBCompras[Obra],\"NÃO\")","v":0},{"$f":"Custo_AquisicaoProdutoNacional","v":467.88221322500431},467.88221322500431,0]
["Pagamento de reembolso de despesas",null,{"$f":"Custo_PagamentoReembolso","v":63.482404357618449},63.482404357618449,0]
["PASSAGENS",null,null,0,0]
["Aquisição de passagem",{"$f":"SUM(TbPassagens[Qtd.Viagens Total])","v":0},{"$f":"Custo_AquisicaoPassagem","v":146.7399431298179},146.7399431298179,0]
["PESSOA FÍSICA",null,null,0,0]
["Admissão de CLT",{"$f":"SUMIF(TbPessoas[Tipo de Contratação],\"CLT\",TbPessoas[Quantidade])","v":0},{"$f":"Custo_AdmissaoCLT","v":764.24517257584375},764.24517257584375,0]
["Concessão de férias",{"$f":"SUM(TbPessoas[Períodos de Férias])","v":0},{"$f":"Custo_ConcessaoFerias","v":969.32493902384874},969.32493902384874,0]
["Folha de pagamento",{"$f":"SUMIF(TbPessoas[Tipo de Contratação],\"CLT\",TbPessoas[Folha de Pagamento])","v":0},{"$f":"Custo_FolhaPagamento","v":107.05898904020538},107.05898904020538,0]
["Desligamento de CLT",{"$f":"SUMIF(TbPessoas[Tipo de Contratação],\"CLT\",TbPessoas[Quantidade])","v":0},{"$f":"Custo_DesligamentoCLT","v":489.02889803682774},489.02889803682774,0]
["Contratação de autônomo",{"$f":"SUMIF(TbPessoas[Tipo de Contratação],\"RPA\",TbPessoas[Folha de Pagamento])","v":0},{"$f":"Custo_ContratacaoAutonomo","v":791.98296081302999},791.98296081302999,0]
["Concessão de bolsa",{"$f":"SUMIF(TbPessoas[Tipo de Contratação],\"Bolsa\",TbPessoas[Quantidade])","v":0},{"$f":"Custo_ConcessaoBolsa","v":282.22413192614329},282.22413192614329,0]
["Pagamento de bolsa",{"$f":"SUMIF(TbPessoas[Tipo de Contratação],\"Bolsa\",TbPessoas[Folha de Pagamento])","v":0},{"$f":"Custo_PagamentoBolsa","v":19.779112103115352},19.779112103115352,0]
["PESSOA JURÍDICA",null,null,0,0]
["Aquisição de serviço no mercado internacional",{"$f":"SUMIFS(TBCompras[Meses],   TBCompras[Tipo de Material],\"SERVIÇO\",TBCompras[Tipo de Compra],\"Internacional\",TBCompras[Obra],\"NÃO\")","v":0},{"$f":"Custo_AquisicaoServicoInternacional","v":1812.8698949518468},1812.8698949518468,0]
["Aquisição de serviço no mercado nacional PJ",{"$f":"SUMIFS(TBCompras[Meses],   TBCompras[Tipo de Material],\"SERVIÇO\",TBCompras[Tipo de Compra],\"nacional\",TBCompras[Obra],\"NÃO\")","v":0},{"$f":"Custo_AquisicaoServicoNacional","v":168.20206870309198},168.20206870309198,0]
["Pagamento de reembolso de despesas",null,null,0,0]
["MATERIAL PERMANENTE",null,null,0,0]
["Aquisição de bem",{"$f":"SUMIFS(TBCompras[Meses],   TBCompras[Tipo de Material],\"EQUIPAMENTO\",TBCompras[Obra],\"NÃO\")","v":0},{"$f":"Custo_AquisicaoBem","v":686.30687935096807},686.30687935096807,0]
["Doação de bem",{"$f":"B35","v":0},{"$f":"Custo_DoacaoBem","v":535.15413584693101},535.15413584693101,0]
[null,null,null,{"$f":"IF(Valor_do_Projeto=0,0,(Sumário!E37+G37)/Valor_do_Projeto)","v":0.98},{"$f":"ROUND(SUM(E9:E36)-E38,2)","v":11814.26},"Risco:",{"$f":"TabRiscos[[#Totals],[Valor do Risco]]","v":0}]
[null,null,null,"Desconto:"]

{"sheet":"Parametrização","index":13,"n_rows":6,"n_cols":2,"rows_kept":6,"cut":false,"hidden":true,"merged":[]}
["Informação","Conteúdo"]
["% Encargos/Benefícios",{"$f":"'Custo CLT'!F53","v":{"$error":"#DIV/0!"}}]
["% Encargos Autônomo",{"$f":"'Custo RPA'!F12","v":{"$error":"#DIV/0!"}}]
["% ISSQN",0.02]
["% Descontos CLT",{"$f":"'Custo CLT'!F54","v":{"$error":"#DIV/0!"}}]
["% Descontos Autônomo",{"$f":"'Custo RPA'!F13","v":{"$error":"#DIV/0!"}}]

{"sheet":"MateriaisEServiços","index":14,"n_rows":22,"n_cols":13,"rows_kept":22,"cut":false,"hidden":true,"merged":[]}
[null,null,null,{"$f":"COUNTA(D3:D7000)","v":3},null,null,"EQUIPAMENTO",null,null,"CONSUMO",null,null,"SERVIÇO"]
["Grupo","Categoria",null,"CATEGORIA",null,null,"ELETRODOMÉSTICOS",null,null,"ALIMENTAÇÃO",null,null,"LICENÇAS DE SOFTWARE"]
["ALIMENTAÇÃO","CONSUMO",null,"EQUIPAMENTO",null,null,"EQUIPAMENTOS DE INFORMÁTICA",null,null,"ANIMAIS VIVOS PARA PESQUISA",null,null,"PREVENÇÃO E SEGURANÇA"]
["ANIMAIS VIVOS PARA PESQUISA","CONSUMO",null,"CONSUMO",null,null,"EQUIPAMENTOS ELETRÔNICOS",null,null,"JARDINAGEM",null,null,"SERVIÇOS DIVERSOS"]
["ELETRODOMÉSTICOS","EQUIPAMENTOS",null,"SERVIÇO",null,null,"EQUIPAMENTOS PARA LABORATÓRIO",null,null,"MATERIAIS DE ESCRITÓRIO"]
["EQUIPAMENTOS DE INFORMÁTICA","EQUIPAMENTOS",null,null,null,null,"MOBILIÁRIOS",null,null,"MATERIAIS DE LIMPEZA E CONSERVAÇÃO"]
["EQUIPAMENTOS ELETRÔNICOS","EQUIPAMENTOS",null,null,null,null,null,null,null,"MATERIAIS HOSPITALARES"]
["EQUIPAMENTOS PARA LABORATÓRIO","EQUIPAMENTOS",null,null,null,null,null,null,null,"MATERIAIS LABORATÓRIO"]
["JARDINAGEM","CONSUMO",null,null,null,null,null,null,null,"MATERIAIS ODONTOLÓGICOS"]
["LICENÇAS DE SOFTWARE","SERVIÇO",null,null,null,null,null,null,null,"MATERIAS DE MANUTENÇÃO PREDIAL"]
["MATERIAIS DE ESCRITÓRIO","CONSUMO",null,null,null,null,null,null,null,"MEDICAMENTOS"]
["MATERIAIS DE LIMPEZA E CONSERVAÇÃO","CONSUMO",null,null,null,null,null,null,null,"SUPRIMENTOS DE INFORMÁTICA"]
["MATERIAIS HOSPITALARES","CONSUMO",null,null,null,null,null,null,null,"TELEFONIA"]
["MATERIAIS LABORATÓRIO","CONSUMO"]
["MATERIAIS ODONTOLÓGICOS","CONSUMO"]
["MATERIAS DE MANUTENÇÃO PREDIAL","CONSUMO"]
["MEDICAMENTOS","CONSUMO"]
["MOBILIÁRIOS","EQUIPAMENTOS"]
["PREVENÇÃO E SEGURANÇA","SERVIÇO"]
["SERVIÇOS DIVERSOS","SERVIÇO"]
["SUPRIMENTOS DE INFORMÁTICA","CONSUMO"]
["TELEFONIA","CONSUMO"]

{"sheet":"Custo CLT","index":15,"n_rows":54,"n_cols":11,"rows_kept":54,"cut":false,"hidden":true,"merged":[[53,0,53,4],[51,1,51,3],[43,0,43,5],[44,1,44,3],[45,1,45,3],[52,0,52,4],[46,1,46,3],[47,1,47,3],[48,1,48,3],[49,1,49,3],[50,1,50,3],[39,1,39,3],[40,1,40,3],[41,1,41,3],[42,1,42,3],[33,1,33,3],[34,1,34,3],[35,1,35,3],[36,1,36,3],[37,0,37,5],[38,1,38,3],[32,1,32,3],[21,1,21,3],[22,1,22,3],[23,1,23,3],[24,1,24,3],[25,0,25,5],[26,1,26,3],[27,1,27,3],[28,1,28,3],[29,1,29,3],[30,1,30,3],[31,1,31,3],[20,1,20,3],[9,1,9,3],[10,1,10,3],[11,1,11,3],[12,1,12,3],[13,1,13,3],[14,0,14,7],[15,1,15,3],[16,1,16,3],[17,1,17,3],[18,1,18,3],[19,1,19,3],[4,1,4,3],[5,1,5,3],[6,1,6,3],[7,1,7,3],[8,1,8,3],[0,0,0,5],[3,7,3,8],[3,9,3,10],[2,7,2,10],[0,6,1,10],[1,0,1,3],[1,4,1,5],[2,0,2,3],[2,4,2,5],[3,0,3,5]]}
["PLANILHA DE CUSTO COM PESSOAL - VÍNCULO CELETISTA"]
["Salário Normativo da Categoria Profissional:",null,null,null,1194]
["Substituição em caso de Ausências?",null,null,null,"SEM Substituição",null,null,"Descontos"]
["COMPOSIÇÃO DA REMUNERAÇÃO",null,null,null,null,null,null,"INSS",null,"IRRF"]
[null," Composição da Remuneração",null,null,"Cômputo","%/Quant. Mensal","Valor (R$)","Base","Valor","Base","Valor"]
["A","Salário Base ",null,null,"Obrigatório",1,{"$f":"Pessoas_Remuneracao_Mensal","v":0},{"$f":"MIN(SalárioBase,INSSIR!B5)","v":0},{"$f":"SalárioBase*((AND(H6>=INSSIR!A3,H6<=INSSIR!B3)*INSSIR!C3)+(AND(H6>=INSSIR!A4,H6<=INSSIR!B4)*INSSIR!C4)+(AND(H6>=INSSIR!A5,H6<=INSSIR!B5)*INSSIR!C5))","v":0},{"$f":"SalárioBase-I6","v":0},{"$f":"(J6*((AND(J6>=INSSIR!A9,J6<=INSSIR!B9)*INSSIR!C9)+(AND(J6>=INSSIR!A10,J6<=INSSIR!B10)*INSSIR!C10)+(AND(J6>=INSSIR!A11,J6<=INSSIR!B11)*INSSIR!C11)+(AND(J6>=INSSIR!A12,J6<=INSSIR!B12)*INSSIR!C12)+(AND(J6>=INSSIR!A13,J6<=INSSIR!B13)*INSSIR!C13)))-(((AND(J6>=INSSIR!A9,J6<=INSSIR!B9)*INSSIR!D9)+(AND(J6>=INSSIR!A10,J6<=INSSIR!B10)*INSSIR!D10)+(AND(J6>=INSSIR!A11,J6<=INSSIR!B11)*INSSIR!C11)+(AND(J6>=INSSIR!A12,J6<=INSSIR!B12)*INSSIR!D12)+(AND(J6>=INSSIR!A13,J6<=INSSIR!B13)*INSSIR!D13)))","v":0}]
["B","Adicional  de periculosidade",null,null,"NÃO",0.3,{"$f":"IF($E$7=\"Sim\",G6*$F$7,0)","v":0}]
["C","Adicional  de insalubridade ",null,null,"NÃO",0.2,{"$f":"IF($E$8=\"Sim\",SalárioBase*$F$8,0)","v":0}]
["D","Adicional Noturno",null,null,"NÃO",null,{"$f":"IF($E$9=\"Sim\",((SUM(G6:G8)*30%*1.1429)/SalárioBase*$F$9),0)","v":0}]
["E","Repouso sobre Adicional Noturno/HE",null,null,"NÃO",null,{"$f":"IF($E$10=\"Sim\",((G9+G11)/6),0)","v":0}]
["F","Adicional de Hora Extra",null,null,"NÃO",null,{"$f":"IF($E$11=\"Sim\",(SUM(G6:G9)/SalárioBase*$F$11*1.5),0)","v":0}]
["G","Gratificação",null,null,"NÃO",null,0]
["H","Outros (dissídio, etc.)",null,null,"SIM",0.01,{"$f":"SalárioBase*F13","v":0}]
[null,"Total da Remuneração",null,null,null,null,{"$f":"SUM(G6:G13)","v":0}]
["BENEFÍCIOS  E INSUMOS MENSAIS"]
[null,"Benefícios e Insumos",null,null,"Cômputo","Valor Unitário/Diário","Valor (R$)","Coparticipação"]
["A","Vale Transporte",null,null,"Obrigatório",3.95,{"$f":"MAX($F$17*4*22-(G6*6%),0)","v":347.6},2]
["B","Auxílio Alimentação",null,null,"NÃO",null,{"$f":"IF($E$18=\"Sim\",$F$18*22-2,0)","v":0}]
["C","Auxílio Refeição",null,null,"SIM",24,{"$f":"IF($E$19=\"Sim\",$F$19*22-2,0)","v":526},2]
["D","Seguro de Vida",null,null,"NÃO",null,{"$f":"IF($E$20=\"Sim\",(G6*24/1000*0.3089)+0.01,0)","v":0}]
["E","Assistência Médica/Odontológica",null,null,"SIM",null,281.5,2]
["F","Auxílio Creche",null,null,"CCT",{"$f":"E2*10%","v":119.4},{"$f":"F22","v":119.4},2]
["G","Exame Médico (Adm/Periódico/Dem)",null,null,"Obrigatório",{"$f":"(15+((3*20.38)/12))","v":20.094999999999999},{"$f":"F23","v":20.094999999999999}]
["H","Outros (especificar)",null,null,"NÃO"]
[null,"Total de Benefícios e Insumos",null,null,null,null,{"$f":"SUM(G17:G24)","v":1294.595},{"$f":"SUM(H17:H24)","v":8}]
["ENCARGOS SOCIAIS E TRABALHISTAS"]
[null,"ENCARGOS SOCIAIS E TRABALHISTAS",null,null,"Cômputo","%","Valor (R$)"]
["A","INSS ",null,null,"Obrigatório",0.2,{"$f":"$F$28*G14","v":0}]
["B","SESI ou SESC",null,null,"Obrigatório",1.4999999999999999E-2,{"$f":"$F$29*G14","v":0}]
["C","SENAI ou SENAC",null,null,"Obrigatório",0,{"$f":"$F$30*G14","v":0}]
["D","INCRA",null,null,"Obrigatório",2E-3,{"$f":"$F$31*G14","v":0}]
["E","Salário Educação",null,null,"Obrigatório",2.5000000000000001E-2,{"$f":"$F$32*G14","v":0}]
["F","FGTS",null,null,"Obrigatório",0.08,{"$f":"$F$33*G14","v":0}]
["G","Seguro acidente de trabalho SAT/INSS",null,null,"Obrigatório",{"$f":"(2*0.809)/100","v":1.618E-2},{"$f":"$F$34*G14","v":0}]
["H","Sebrae",null,null,"Obrigatório",3.0000000000000001E-3,{"$f":"$F$35*G14","v":0}]
["I","Pis sobre folha de pagamento (art.13 da Medida Provisória 2.158-35 de 24 de agosto de 2001.)",null,null,"Obrigatório",0.01,{"$f":"$F$36*G14","v":0}]
[null,"Total de Encargos Sociais e Trabalhistas",null,null,null,{"$f":"SUM(F28:F36)","v":0.35118000000000005},{"$f":"SUM(G28:G36)","v":0}]
["13º SALÁRIO E ADICIONAL DE FÉRIAS"]
[null,"13º SALÁRIO E ADICIONAL DE FÉRIAS",null,null,"Cômputo","%","Valor (R$)"]
["A","13º Salário",null,null,"Obrigatório",{"$f":"1/12","v":8.3333333333333329E-2},{"$f":"$F$40*G14","v":0}]
["B","Adicional de Férias (1/3) + Férias Proporcionais e Indenizadas",null,null,"Obrigatório",{"$f":"(1/3/12)+(5/56)","v":0.11706349206349206},{"$f":"$F$41*G14","v":0}]
["C","Incidência de Encargos sobre 13º Salário e Adicional de Férias (1/3) e Férias Proporcionais e Indenizadas",null,null,"Obrigatório",{"$f":"((F40*F37)+(1/12/3*F37)+(5/56*F36))","v":3.9912857142857146E-2},{"$f":"$F$42*G14","v":0}]
[null,"Total 13º Salário e Adicional de Férias",null,null,null,{"$f":"SUM(F40:F42)","v":0.24030968253968255},{"$f":"SUM(G40:G42)","v":0}]
["PROVISÃO PARA RESCISÃO"]
[null,"PROVISÃO PARA RESCISÃO",null,null,"Cômputo","%","Valor (R$)"]
["A","Aviso Prévio Indenizado + Aviso Prévio - Lei 12.506",null,null,"Obrigatório",{"$f":"(1/12)*42.31%+((1/30*3)/12)+(((1/30*3)/12*$F$40)+((1/30*3)/12*$F$41))","v":4.5261640211640211E-2},{"$f":"$F$46*G14","v":0}]
["B","Incidência do FGTS sobre o aviso prévio Indenizado",null,null,"Obrigatório",{"$f":"F46*(8%)","v":3.6209312169312169E-3},{"$f":"$F$47*G14","v":0}]
["C","Multa do FGTS sobre o Aviso Prévio Indenizado e Remuneração",null,null,"Obrigatório",{"$f":"(8%*50%*0.9*(1+5/56+5/56+1/3*5/56))+(8%*50%*((1/30*3)/12)+(((1/30*3)/12*$F$40)+((1/30*3)/12*$F$41)))","v":4.5503306878306879E-2},{"$f":"$F$48*(G14)","v":0}]
["D","Aviso prévio trabalhado",null,null,{"$f":"IF($E$3=\"COM Substituição\",\"SIM\",\"NÃO\")","v":"NÃO"},{"$f":"IF(E49=\"Sim\",((100/30*7/12)/100),0)","v":0},{"$f":"$F$49*G14","v":0}]
["E","Incidência de Encargos sobre Aviso Prévio Trabalhado",null,null,{"$f":"IF($E$3=\"COM Substituição\",\"SIM\",\"NÃO\")","v":"NÃO"},{"$f":"F49*$F$37","v":0},{"$f":"$F$50*G14","v":0}]
["F","Multa do FGTS do Aviso Prévio Trabalhado sobre a Remuneração",null,null,"NÃO",{"$f":"F49*(8%*50%)","v":0},{"$f":"$F$51*G14","v":0}]
[null,"Total Provisão para Rescisão",null,null,null,{"$f":"SUM(F46:F51)","v":9.4385878306878307E-2},{"$f":"SUM(G46:G51)","v":0}]
["CUSTO TOTAL",null,null,null,null,{"$f":"(G53-SalárioBase)/SalárioBase","v":{"$error":"#DIV/0!"}},{"$f":"G43+G37+G25+G14","v":1294.595}]
["DESCONTO TOTAL",null,null,null,null,{"$f":"G54/SalárioBase","v":{"$error":"#DIV/0!"}},{"$f":"H25+I6+K6","v":8}]

{"sheet":"Custo RPA","index":16,"n_rows":13,"n_cols":11,"rows_kept":13,"cut":false,"hidden":true,"merged":[[2,7,2,8],[2,9,2,10],[3,1,3,3],[4,1,4,3],[0,6,0,10],[1,7,1,10],[11,0,11,4],[12,0,12,4],[0,0,1,5],[9,1,9,3],[10,1,10,3],[6,0,6,5],[7,1,7,3],[8,1,8,3],[5,1,5,3],[2,0,2,5]]}
["PLANILHA DE CUSTO COM PESSOAL - VÍNCULO RPA"]
[null,null,null,null,null,null,null,"Descontos"]
["COMPOSIÇÃO DA REMUNERAÇÃO",null,null,null,null,null,null,"INSS",null,"IRRF"]
[null," Composição da Remuneração",null,null,"Cômputo","%/Quant. Mensal","Valor (R$)","Base","Valor","Base","Valor"]
["A","Remuneração",null,null,"Obrigatório",1,{"$f":"Pessoas_Remuneracao_Mensal","v":0},{"$f":"SalárioBase","v":0},{"$f":"SalárioBase*11%","v":0},{"$f":"SalárioBase-I5","v":0},{"$f":"(J5*((AND(J5>=INSSIR!A9,J5<=INSSIR!B9)*INSSIR!C9)+(AND(J5>=INSSIR!A10,J5<=INSSIR!B10)*INSSIR!C10)+(AND(J5>=INSSIR!A11,J5<=INSSIR!B11)*INSSIR!C11)+(AND(J5>=INSSIR!A12,J5<=INSSIR!B12)*INSSIR!C12)+(AND(J5>=INSSIR!A13,J5<=INSSIR!B13)*INSSIR!C13)))-(((AND(J5>=INSSIR!A9,J5<=INSSIR!B9)*INSSIR!D9)+(AND(J5>=INSSIR!A10,J5<=INSSIR!B10)*INSSIR!D10)+(AND(J5>=INSSIR!A11,J5<=INSSIR!B11)*INSSIR!C11)+(AND(J5>=INSSIR!A12,J5<=INSSIR!B12)*INSSIR!D12)+(AND(J5>=INSSIR!A13,J5<=INSSIR!B13)*INSSIR!D13)))","v":0}]
[null,"Total da Remuneração",null,null,null,null,{"$f":"SUM(G5:G5)","v":0}]
["ENCARGOS SOCIAIS E TRABALHISTAS"]
[null,"ENCARGOS SOCIAIS E TRABALHISTAS",null,null,"Cômputo","%","Valor (R$)"]
["A","INSS ",null,null,"Obrigatório",0.2,{"$f":"$F$9*G6","v":0}]
["B","ISS",null,null,"Obrigatório",0,{"$f":"$F$10*G6","v":0}]
[null,"Total de Encargos Sociais e Trabalhistas",null,null,null,{"$f":"SUM(F9:F10)","v":0.2},{"$f":"SUM(G9:G10)","v":0}]
["CUSTO TOTAL",null,null,null,null,{"$f":"(G12-SalárioBase)/SalárioBase","v":{"$error":"#DIV/0!"}},{"$f":"G6+G11","v":0}]
["DESCONTO TOTAL",null,null,null,null,{"$f":"G13/SalárioBase","v":{"$error":"#DIV/0!"}},{"$f":"I5+K5","v":0}]

{"sheet":"INSSIR","index":17,"n_rows":13,"n_cols":4,"rows_kept":13,"cut":false,"hidden":true,"merged":[]}
["INSS"]
["Base de","Base Até","Alíquota"]
[0,1693.72,0.08]
[1693.73,2822.9,0.09]
[2822.91,5645.8,0.11]
[]
["Imposto de Renda"]
["Base de","Base até","Alíquota","Dedução"]
[0,1903.98,0,0]
[1903.99,2826.65,7.4999999999999997E-2,142.80000000000001]
[2826.66,3751.05,0.15,354.8]
[3751.06,4664.68,0.22500000000000001,636.13]
[4664.09,999999,0.27500000000000002,869.36]

{"sheet":"Diárias","index":18,"n_rows":192,"n_cols":3,"rows_kept":192,"cut":false,"hidden":true,"merged":[]}
["DESTINO","Moeda","VALOR REF."]
["ADICIONAL DE DESLOCAMENTO","R$",120]
["BRASÍLIA/MANAUS/RIO DE JANEIRO/SÃO PAULO","R$",450]
["DEMAIS CAPITAIS","R$",400]
["DEMAIS CIDADES","R$",350]
[]
[]
["DESTINO","Moeda","VALOR REF."]
["ADICIONAL DE DESLOCAMENTO","US$",50]
["A","US$",220]
["B","US$",300]
["C","US$",350]
["D","US$",460]
[]
["País","Grupo"]
["Afeganistão","A"]
["África do Sul","B"]
["Albânia","B"]
["Alemanha","D"]
["Andorra","B"]
["Angola","D"]
["Antígua e Barbuda","C"]
["Arábia Saudita","C"]
["Argélia","B"]
["Argentina","B"]
["Armênia","A"]
["Austrália","B"]
["Áustria","D"]
["Azerbaidjão","C"]
["Bahamas","C"]
["Bangladesh","A"]
["Barbados","D"]
["Bareine","C"]
["Belarus","A"]
["Bélgica","D"]
["Belize","B"]
["Benin","A"]
["Bolívia","A"]
["Bósnia-Herzegóvina","B"]
["Botsuana","C"]
["Brunei Darussalam","C"]
["Bulgária","C"]
["Burkina-Fasso","A"]
["Burundi","B"]
["Butão","A"]
["Cabo Verde","B"]
["Camarões","B"]
["Camboja","B"]
["Canadá","C"]
["Catar","B"]
["Cazaquistão","D"]
["Chade","B"]
["Chile","A"]
["China","B"]
["Chipre","B"]
["Cingapura","C"]
["Colômbia","B"]
["Comores","A"]
["Congo","C"]
["Coréia do Sul","D"]
["Costa do Marfim","C"]
["Costa Rica","A"]
["Croácia","D"]
["Cuba","C"]
["Dinamarca","D"]
["Djibuti","C"]
["Dominica","B"]
["Egito","B"]
["El Salvador","A"]
["Emirados Árabes","C"]
["Equador","A"]
["Eritréia","B"]
["Eslovênia","A"]
["Espanha","D"]
["Estados Unidos da América","D"]
["Estônia","B"]
["Etiópia","B"]
["Fiji","C"]
["Filipinas","A"]
["Finlândia","D"]
["França","D"]
["Gabão","C"]
["Gâmbia","A"]
["Gana","B"]
["Geórgia","B"]
["Granada","D"]
["Grécia","D"]
["Guatemala","C"]
["Guiana","A"]
["Guiné","A"]
["Guiné Bissau","A"]
["Guiné- Equatorial","B"]
["Haiti","B"]
["Honduras","A"]
["Hong Kong","D"]
["Hungria","B"]
["Iêmen","B"]
["Ilhas Marshall","B"]
["Índia","B"]
["Indonésia","A"]
["Irã","A"]
["Iraque","A"]
["Irlanda","D"]
["Islândia","D"]
["Israel","D"]
["Itália","D"]
["Jamaica","C"]
["Japão","D"]
["Jordânia","C"]
["Kiribati","B"]
["Kuaite","D"]
["Laos","A"]
["Lesoto","B"]
["Letônia","C"]
["Líbano","A"]
["Libéria","C"]
["Líbia","B"]
["Liechtenstein","D"]
["Lituânia","C"]
["Luxemburgo","D"]
["Macedônia","B"]
["Madagascar","B"]
["Malásia","A"]
["Malauí","B"]
["Maldivas","A"]
["Mali","C"]
["Malta","C"]
["Marrocos","A"]
["Maurício","C"]
["Mauritânia","C"]
["México","C"]
["Micronésia","B"]
["Moçambique","B"]
["Moldávia","B"]
["Mônaco","D"]
["Mongólia","A"]
["Montenegro","D"]
["Myanmar","A"]
["Namíbia","A"]
["Nauru","A"]
["Nepal","A"]
["Nicarágua","A"]
["Níger","B"]
["Nigéria","B"]
["Noruega","D"]
["Nova Zelândia","B"]
["Omã","D"]
["Países Baixos","D"]
["Palau","B"]
["Panamá","A"]
["Papua Nova Guiné","B"]
["Paquistão","B"]
["Paraguai","A"]
["Peru","B"]
["Polônia","B"]
["Portugal","D"]
["Quênia","B"]
["Reino Unido","D"]
["Rep. Centro Africana","A"]
["República Democrática do Congo","C"]
["República Dominicana","B"]
["República Eslovaca","B"]
["República Popular Democrática da Coréia","A"]
["República Quirguiz","D"]
["República Tcheca","C"]
["República Togolesa","A"]
["Romênia","B"]
["Ruanda","B"]
["Salomão","A"]
["Samoa","A"]
["São Tomé e Príncipe","B"]
["Senegal","B"]
["Serra Leoa","A"]
["Síria","A"]
["Somália","A"]
["Sri Lanka","A"]
["Sudão","B"]
["Suriname","A"]
["Tadjiquistão","A"]
["Tailândia","A"]
["Tanzânia","B"]
["Timor Leste","A"]
["Tonga","A"]
["Tunísia","A"]
["Turcomenistão","A"]
["Turquia","A"]
["Tuvalu","A"]
["Uruguai","B"]
["Uzbequistão","B"]
["Venezuela","B"]
["Vietnã","A"]
["Zimbábue","A"]